jclouds-dev mailing list archives

Site index · List index
Message view « Date » · « Thread »
Top « Date » · « Thread »
From jenkins-no-re...@cloudbees.com
Subject Build failed in Jenkins: jclouds-karaf #521
Date Thu, 02 Jan 2014 16:45:58 GMT
See <https://jclouds.ci.cloudbees.com/job/jclouds-karaf/521/>

------------------------------------------
[...truncated 3960 lines...]
Jan 2, 2014 11:45:43 AM org.apache.maven.cli.event.ExecutionEventLogger mojoStarted
INFO: --- maven-bundle-plugin:2.1.0:deploy (default-deploy) @ cache ---
[INFO] Remote OBR update disabled (enable with -DremoteOBR)
Jan 2, 2014 11:45:43 AM org.apache.maven.cli.event.ExecutionEventLogger projectStarted
INFO:                                                                         
Jan 2, 2014 11:45:43 AM org.apache.maven.cli.event.ExecutionEventLogger projectStarted
INFO: ------------------------------------------------------------------------
Jan 2, 2014 11:45:43 AM org.apache.maven.cli.event.ExecutionEventLogger projectStarted
INFO: Building jclouds :: Karaf :: Feature 1.8.0-SNAPSHOT
Jan 2, 2014 11:45:43 AM org.apache.maven.cli.event.ExecutionEventLogger projectStarted
INFO: ------------------------------------------------------------------------
Downloading: https://repository-jclouds.forge.cloudbees.com/release/org/apache/maven/plugins/maven-resources-plugin/2.4.3/maven-resources-plugin-2.4.3.pom
Downloading: http://repo.cloudbees.com/content/repositories/central/org/apache/maven/plugins/maven-resources-plugin/2.4.3/maven-resources-plugin-2.4.3.pom
[WARNING] The POM for org.apache.maven.plugins:maven-resources-plugin:jar:2.4.3 is missing,
no dependency information available
Jan 2, 2014 11:45:46 AM org.apache.maven.cli.event.ExecutionEventLogger logReactorSummary
INFO: ------------------------------------------------------------------------
Jan 2, 2014 11:45:46 AM org.apache.maven.cli.event.ExecutionEventLogger logReactorSummary
INFO: Reactor Summary:
Jan 2, 2014 11:45:46 AM org.apache.maven.cli.event.ExecutionEventLogger logReactorSummary
INFO: 
Jan 2, 2014 11:45:46 AM org.apache.maven.cli.event.ExecutionEventLogger logReactorSummary
INFO: Apache jclouds :: Karaf ........................... SUCCESS [5:18.726s]
Jan 2, 2014 11:45:46 AM org.apache.maven.cli.event.ExecutionEventLogger logReactorSummary
INFO: jclouds :: Karaf :: Core .......................... SUCCESS [1:12.056s]
Jan 2, 2014 11:45:46 AM org.apache.maven.cli.event.ExecutionEventLogger logReactorSummary
INFO: jclouds :: Karaf :: Utils ......................... SUCCESS [14.091s]
Jan 2, 2014 11:45:46 AM org.apache.maven.cli.event.ExecutionEventLogger logReactorSummary
INFO: jclouds :: Karaf :: Recipe ........................ SUCCESS [7.294s]
Jan 2, 2014 11:45:46 AM org.apache.maven.cli.event.ExecutionEventLogger logReactorSummary
INFO: jclouds :: Karaf :: Cache ......................... SUCCESS [9.379s]
Jan 2, 2014 11:45:46 AM org.apache.maven.cli.event.ExecutionEventLogger logReactorSummary
INFO: jclouds :: Karaf :: Services ...................... SUCCESS [43.876s]
Jan 2, 2014 11:45:46 AM org.apache.maven.cli.event.ExecutionEventLogger logReactorSummary
INFO: jclouds :: Karaf :: Commands ...................... SUCCESS [42.186s]
Jan 2, 2014 11:45:46 AM org.apache.maven.cli.event.ExecutionEventLogger logReactorSummary
INFO: jclouds :: Karaf :: URL Handler ................... SUCCESS [6.741s]
Jan 2, 2014 11:45:46 AM org.apache.maven.cli.event.ExecutionEventLogger logReactorSummary
INFO: jclouds :: Karaf :: Chef .......................... SUCCESS [3.053s]
Jan 2, 2014 11:45:46 AM org.apache.maven.cli.event.ExecutionEventLogger logReactorSummary
INFO: jclouds :: Karaf :: Chef :: Core .................. SUCCESS [14.357s]
Jan 2, 2014 11:45:46 AM org.apache.maven.cli.event.ExecutionEventLogger logReactorSummary
INFO: jclouds :: Karaf :: Chef :: Services .............. SUCCESS [6.943s]
Jan 2, 2014 11:45:46 AM org.apache.maven.cli.event.ExecutionEventLogger logReactorSummary
INFO: jclouds :: Karaf :: Chef :: Commands .............. SUCCESS [12.844s]
Jan 2, 2014 11:45:46 AM org.apache.maven.cli.event.ExecutionEventLogger logReactorSummary
INFO: jclouds :: Karaf :: Chef :: Cache ................. SUCCESS [9.558s]
Jan 2, 2014 11:45:46 AM org.apache.maven.cli.event.ExecutionEventLogger logReactorSummary
INFO: jclouds :: Karaf :: Feature ....................... FAILURE [3.368s]
Jan 2, 2014 11:45:46 AM org.apache.maven.cli.event.ExecutionEventLogger logReactorSummary
INFO: jclouds :: Karaf :: Integration Tests ............. SKIPPED
Jan 2, 2014 11:45:47 AM org.apache.maven.cli.event.ExecutionEventLogger logResult
INFO: ------------------------------------------------------------------------
Jan 2, 2014 11:45:47 AM org.apache.maven.cli.event.ExecutionEventLogger logResult
INFO: BUILD FAILURE
Jan 2, 2014 11:45:47 AM org.apache.maven.cli.event.ExecutionEventLogger logStats
INFO: ------------------------------------------------------------------------
Jan 2, 2014 11:45:47 AM org.apache.maven.cli.event.ExecutionEventLogger logStats
INFO: Total time: 12:28.456s
Jan 2, 2014 11:45:47 AM org.apache.maven.cli.event.ExecutionEventLogger logStats
INFO: Finished at: Thu Jan 02 11:45:47 EST 2014
[Unloading class GregorSamsa]
[Unloading class GregorSamsa$0]
[Unloading class GregorSamsa]
[Unloading class GregorSamsa$1]
[Unloading class GregorSamsa]
[Unloading class GregorSamsa$0]
[Unloading class GregorSamsa$2]
[Unloading class GregorSamsa$1]
[Unloading class GregorSamsa]
[Unloading class GregorSamsa$2]
[Unloading class GregorSamsa$2]
[Unloading class GregorSamsa$0]
[Unloading class GregorSamsa$1]
[Unloading class GregorSamsa]
[Unloading class GregorSamsa$1]
[Unloading class GregorSamsa$1]
[Unloading class GregorSamsa$1]
[Unloading class GregorSamsa$0]
[Unloading class GregorSamsa$1]
[Unloading class GregorSamsa]
[Unloading class GregorSamsa$0]
[Unloading class GregorSamsa]
[Unloading class GregorSamsa$1]
[Unloading class GregorSamsa]
[Unloading class GregorSamsa$1]
[Unloading class GregorSamsa$2]
[Unloading class GregorSamsa$0]
[Unloading class GregorSamsa$0]
[Unloading class GregorSamsa]
[Unloading class GregorSamsa$1]
[Unloading class GregorSamsa$0]
[Unloading class GregorSamsa$1]
[Unloading class GregorSamsa]
[Unloading class GregorSamsa]
[Unloading class GregorSamsa]
[Unloading class GregorSamsa]
[Unloading class GregorSamsa]
[Unloading class GregorSamsa$1]
[Unloading class GregorSamsa$1]
[Unloading class GregorSamsa]
[Unloading class GregorSamsa$2]
[Unloading class GregorSamsa]
[Unloading class GregorSamsa$0]
[Unloading class GregorSamsa$2]
[Unloading class GregorSamsa$0]
[Unloading class GregorSamsa$0]
[Unloading class GregorSamsa]
[Unloading class GregorSamsa$0]
[Unloading class GregorSamsa$0]
[Unloading class GregorSamsa]
[Unloading class GregorSamsa]
[Unloading class GregorSamsa$0]
[Unloading class GregorSamsa]
[Unloading class GregorSamsa]
[Unloading class GregorSamsa]
[Unloading class GregorSamsa$0]
[Unloading class GregorSamsa]
[Unloading class GregorSamsa$0]
[Unloading class GregorSamsa]
[Unloading class GregorSamsa]
[Unloading class GregorSamsa$0]
[Unloading class GregorSamsa]
[Unloading class GregorSamsa$0]
[Unloading class GregorSamsa$0]
[Unloading class GregorSamsa$0]
[Unloading class GregorSamsa$0]
[Unloading class GregorSamsa$0]
[Unloading class GregorSamsa$0]
[Unloading class GregorSamsa]
[Unloading class GregorSamsa$0]
[Unloading class GregorSamsa]
[Unloading class GregorSamsa$0]
[Unloading class GregorSamsa$1]
[Unloading class GregorSamsa$0]
[Unloading class GregorSamsa$0]
[Unloading class GregorSamsa$0]
[Unloading class GregorSamsa$0]
[Unloading class GregorSamsa]
[Unloading class GregorSamsa]
[Unloading class GregorSamsa$0]
[Unloading class GregorSamsa]
[Unloading class GregorSamsa$0]
[Unloading class GregorSamsa]
[Unloading class GregorSamsa$0]
[Unloading class GregorSamsa]
[Unloading class GregorSamsa]
[Unloading class GregorSamsa$2]
[Unloading class GregorSamsa$0]
[Unloading class GregorSamsa$1]
[Unloading class GregorSamsa]
[Unloading class GregorSamsa$0]
[Unloading class GregorSamsa$0]
[Unloading class GregorSamsa$1]
[Unloading class GregorSamsa$1]
Jan 2, 2014 11:45:48 AM org.apache.maven.cli.event.ExecutionEventLogger logStats
INFO: Final Memory: 69M/151M
Jan 2, 2014 11:45:48 AM org.apache.maven.cli.event.ExecutionEventLogger sessionEnded
INFO: ------------------------------------------------------------------------
[JENKINS] Archiving <https://jclouds.ci.cloudbees.com/job/jclouds-karaf/ws/utils/pom.xml>
to /home/jclouds/hudson_home/jobs/jclouds-karaf/modules/org.apache.jclouds.karaf$utils/builds/2014-01-02_16-33-09/archive/org.apache.jclouds.karaf/utils/1.8.0-SNAPSHOT/utils-1.8.0-SNAPSHOT.pom
[JENKINS] Archiving <https://jclouds.ci.cloudbees.com/job/jclouds-karaf/ws/utils/target/utils-1.8.0-SNAPSHOT.jar>
to /home/jclouds/hudson_home/jobs/jclouds-karaf/modules/org.apache.jclouds.karaf$utils/builds/2014-01-02_16-33-09/archive/org.apache.jclouds.karaf/utils/1.8.0-20140102.164203-77/utils-1.8.0-20140102.164203-77.jar
[JENKINS] Archiving <https://jclouds.ci.cloudbees.com/job/jclouds-karaf/ws/cache/pom.xml>
to /home/jclouds/hudson_home/jobs/jclouds-karaf/modules/org.apache.jclouds.karaf$cache/builds/2014-01-02_16-33-10/archive/org.apache.jclouds.karaf/cache/1.8.0-SNAPSHOT/cache-1.8.0-SNAPSHOT.pom
[JENKINS] Archiving <https://jclouds.ci.cloudbees.com/job/jclouds-karaf/ws/cache/target/cache-1.8.0-SNAPSHOT.jar>
to /home/jclouds/hudson_home/jobs/jclouds-karaf/modules/org.apache.jclouds.karaf$cache/builds/2014-01-02_16-33-10/archive/org.apache.jclouds.karaf/cache/1.8.0-20140102.164317-77/cache-1.8.0-20140102.164317-77.jar
[JENKINS] Archiving <https://jclouds.ci.cloudbees.com/job/jclouds-karaf/ws/chef/commands/pom.xml>
to /home/jclouds/hudson_home/jobs/jclouds-karaf/modules/org.apache.jclouds.karaf.chef$commands/builds/2014-01-02_16-33-10/archive/org.apache.jclouds.karaf.chef/commands/1.8.0-SNAPSHOT/commands-1.8.0-SNAPSHOT.pom
[JENKINS] Archiving <https://jclouds.ci.cloudbees.com/job/jclouds-karaf/ws/chef/commands/target/commands-1.8.0-SNAPSHOT.jar>
to /home/jclouds/hudson_home/jobs/jclouds-karaf/modules/org.apache.jclouds.karaf.chef$commands/builds/2014-01-02_16-33-10/archive/org.apache.jclouds.karaf.chef/commands/1.8.0-20140102.164531-77/commands-1.8.0-20140102.164531-77.jar
[JENKINS] Archiving <https://jclouds.ci.cloudbees.com/job/jclouds-karaf/ws/recipe/pom.xml>
to /home/jclouds/hudson_home/jobs/jclouds-karaf/modules/org.apache.jclouds.karaf$recipe/builds/2014-01-02_16-33-10/archive/org.apache.jclouds.karaf/recipe/1.8.0-SNAPSHOT/recipe-1.8.0-SNAPSHOT.pom
[JENKINS] Archiving <https://jclouds.ci.cloudbees.com/job/jclouds-karaf/ws/recipe/target/recipe-1.8.0-SNAPSHOT.jar>
to /home/jclouds/hudson_home/jobs/jclouds-karaf/modules/org.apache.jclouds.karaf$recipe/builds/2014-01-02_16-33-10/archive/org.apache.jclouds.karaf/recipe/1.8.0-20140102.164308-77/recipe-1.8.0-20140102.164308-77.jar
[JENKINS] Archiving <https://jclouds.ci.cloudbees.com/job/jclouds-karaf/ws/feature/pom.xml>
to /home/jclouds/hudson_home/jobs/jclouds-karaf/modules/org.apache.jclouds.karaf$jclouds-karaf/builds/2014-01-02_16-33-10/archive/org.apache.jclouds.karaf/jclouds-karaf/1.8.0-SNAPSHOT/jclouds-karaf-1.8.0-SNAPSHOT.pom
[JENKINS] Archiving <https://jclouds.ci.cloudbees.com/job/jclouds-karaf/ws/commands/pom.xml>
to /home/jclouds/hudson_home/jobs/jclouds-karaf/modules/org.apache.jclouds.karaf$commands/builds/2014-01-02_16-33-10/archive/org.apache.jclouds.karaf/commands/1.8.0-SNAPSHOT/commands-1.8.0-SNAPSHOT.pom
[JENKINS] Archiving <https://jclouds.ci.cloudbees.com/job/jclouds-karaf/ws/commands/target/commands-1.8.0-SNAPSHOT.jar>
to /home/jclouds/hudson_home/jobs/jclouds-karaf/modules/org.apache.jclouds.karaf$commands/builds/2014-01-02_16-33-10/archive/org.apache.jclouds.karaf/commands/1.8.0-20140102.164446-77/commands-1.8.0-20140102.164446-77.jar
[JENKINS] Archiving <https://jclouds.ci.cloudbees.com/job/jclouds-karaf/ws/itests/pom.xml>
to /home/jclouds/hudson_home/jobs/jclouds-karaf/modules/org.apache.jclouds.karaf$itests/builds/2014-01-02_16-33-10/archive/org.apache.jclouds.karaf/itests/1.8.0-SNAPSHOT/itests-1.8.0-SNAPSHOT.pom
[JENKINS] Archiving <https://jclouds.ci.cloudbees.com/job/jclouds-karaf/ws/urlhandler/pom.xml>
to /home/jclouds/hudson_home/jobs/jclouds-karaf/modules/org.apache.jclouds.karaf$urlhandler/builds/2014-01-02_16-33-10/archive/org.apache.jclouds.karaf/urlhandler/1.8.0-SNAPSHOT/urlhandler-1.8.0-SNAPSHOT.pom
[JENKINS] Archiving <https://jclouds.ci.cloudbees.com/job/jclouds-karaf/ws/urlhandler/target/urlhandler-1.8.0-SNAPSHOT.jar>
to /home/jclouds/hudson_home/jobs/jclouds-karaf/modules/org.apache.jclouds.karaf$urlhandler/builds/2014-01-02_16-33-10/archive/org.apache.jclouds.karaf/urlhandler/1.8.0-20140102.164453-77/urlhandler-1.8.0-20140102.164453-77.jar
[JENKINS] Archiving <https://jclouds.ci.cloudbees.com/job/jclouds-karaf/ws/services/pom.xml>
to /home/jclouds/hudson_home/jobs/jclouds-karaf/modules/org.apache.jclouds.karaf$services/builds/2014-01-02_16-33-10/archive/org.apache.jclouds.karaf/services/1.8.0-SNAPSHOT/services-1.8.0-SNAPSHOT.pom
[JENKINS] Archiving <https://jclouds.ci.cloudbees.com/job/jclouds-karaf/ws/services/target/services-1.8.0-SNAPSHOT.jar>
to /home/jclouds/hudson_home/jobs/jclouds-karaf/modules/org.apache.jclouds.karaf$services/builds/2014-01-02_16-33-10/archive/org.apache.jclouds.karaf/services/1.8.0-20140102.164401-77/services-1.8.0-20140102.164401-77.jar
[JENKINS] Archiving <https://jclouds.ci.cloudbees.com/job/jclouds-karaf/ws/chef/core/pom.xml>
to /home/jclouds/hudson_home/jobs/jclouds-karaf/modules/org.apache.jclouds.karaf.chef$core/builds/2014-01-02_16-33-10/archive/org.apache.jclouds.karaf.chef/core/1.8.0-SNAPSHOT/core-1.8.0-SNAPSHOT.pom
[JENKINS] Archiving <https://jclouds.ci.cloudbees.com/job/jclouds-karaf/ws/chef/core/target/core-1.8.0-SNAPSHOT.jar>
to /home/jclouds/hudson_home/jobs/jclouds-karaf/modules/org.apache.jclouds.karaf.chef$core/builds/2014-01-02_16-33-10/archive/org.apache.jclouds.karaf.chef/core/1.8.0-20140102.164511-77/core-1.8.0-20140102.164511-77.jar
[JENKINS] Archiving <https://jclouds.ci.cloudbees.com/job/jclouds-karaf/ws/chef/services/pom.xml>
to /home/jclouds/hudson_home/jobs/jclouds-karaf/modules/org.apache.jclouds.karaf.chef$services/builds/2014-01-02_16-33-10/archive/org.apache.jclouds.karaf.chef/services/1.8.0-SNAPSHOT/services-1.8.0-SNAPSHOT.pom
[JENKINS] Archiving <https://jclouds.ci.cloudbees.com/job/jclouds-karaf/ws/chef/services/target/services-1.8.0-SNAPSHOT.jar>
to /home/jclouds/hudson_home/jobs/jclouds-karaf/modules/org.apache.jclouds.karaf.chef$services/builds/2014-01-02_16-33-10/archive/org.apache.jclouds.karaf.chef/services/1.8.0-20140102.164518-77/services-1.8.0-20140102.164518-77.jar
[JENKINS] Archiving <https://jclouds.ci.cloudbees.com/job/jclouds-karaf/ws/chef/pom.xml>
to /home/jclouds/hudson_home/jobs/jclouds-karaf/modules/org.apache.jclouds.karaf$chef/builds/2014-01-02_16-33-10/archive/org.apache.jclouds.karaf/chef/1.8.0-SNAPSHOT/chef-1.8.0-SNAPSHOT.pom
[JENKINS] Archiving <https://jclouds.ci.cloudbees.com/job/jclouds-karaf/ws/pom.xml>
to /home/jclouds/hudson_home/jobs/jclouds-karaf/modules/org.apache.jclouds$jclouds-karaf/builds/2014-01-02_16-33-09/archive/org.apache.jclouds/jclouds-karaf/1.8.0-SNAPSHOT/jclouds-karaf-1.8.0-SNAPSHOT.pom
[JENKINS] Archiving <https://jclouds.ci.cloudbees.com/job/jclouds-karaf/ws/core/pom.xml>
to /home/jclouds/hudson_home/jobs/jclouds-karaf/modules/org.apache.jclouds.karaf$core/builds/2014-01-02_16-33-09/archive/org.apache.jclouds.karaf/core/1.8.0-SNAPSHOT/core-1.8.0-SNAPSHOT.pom
[JENKINS] Archiving <https://jclouds.ci.cloudbees.com/job/jclouds-karaf/ws/core/target/core-1.8.0-SNAPSHOT.jar>
to /home/jclouds/hudson_home/jobs/jclouds-karaf/modules/org.apache.jclouds.karaf$core/builds/2014-01-02_16-33-09/archive/org.apache.jclouds.karaf/core/1.8.0-20140102.164147-77/core-1.8.0-20140102.164147-77.jar
[JENKINS] Archiving <https://jclouds.ci.cloudbees.com/job/jclouds-karaf/ws/chef/cache/pom.xml>
to /home/jclouds/hudson_home/jobs/jclouds-karaf/modules/org.apache.jclouds.karaf.chef$cache/builds/2014-01-02_16-33-10/archive/org.apache.jclouds.karaf.chef/cache/1.8.0-SNAPSHOT/cache-1.8.0-SNAPSHOT.pom
[JENKINS] Archiving <https://jclouds.ci.cloudbees.com/job/jclouds-karaf/ws/chef/cache/target/cache-1.8.0-SNAPSHOT.jar>
to /home/jclouds/hudson_home/jobs/jclouds-karaf/modules/org.apache.jclouds.karaf.chef$cache/builds/2014-01-02_16-33-10/archive/org.apache.jclouds.karaf.chef/cache/1.8.0-20140102.164539-77/cache-1.8.0-20140102.164539-77.jar
Waiting for Jenkins to finish collecting data
mavenExecutionResult exceptions not empty
message : Plugin org.apache.maven.plugins:maven-resources-plugin:2.4.3 or one of its dependencies
could not be resolved: Failed to read artifact descriptor for org.apache.maven.plugins:maven-resources-plugin:jar:2.4.3
cause : Failed to read artifact descriptor for org.apache.maven.plugins:maven-resources-plugin:jar:2.4.3
Stack trace : 
org.apache.maven.plugin.PluginResolutionException: Plugin org.apache.maven.plugins:maven-resources-plugin:2.4.3
or one of its dependencies could not be resolved: Failed to read artifact descriptor for org.apache.maven.plugins:maven-resources-plugin:jar:2.4.3
	at org.apache.maven.plugin.internal.DefaultPluginDependenciesResolver.resolve(DefaultPluginDependenciesResolver.java:129)
	at org.apache.maven.plugin.internal.DefaultMavenPluginManager.getPluginDescriptor(DefaultMavenPluginManager.java:142)
	at org.apache.maven.plugin.internal.DefaultMavenPluginManager.getMojoDescriptor(DefaultMavenPluginManager.java:261)
	at org.apache.maven.plugin.DefaultBuildPluginManager.getMojoDescriptor(DefaultBuildPluginManager.java:185)
	at org.apache.maven.lifecycle.internal.DefaultLifecycleExecutionPlanCalculator.setupMojoExecution(DefaultLifecycleExecutionPlanCalculator.java:152)
	at org.apache.maven.lifecycle.internal.DefaultLifecycleExecutionPlanCalculator.setupMojoExecutions(DefaultLifecycleExecutionPlanCalculator.java:139)
	at org.apache.maven.lifecycle.internal.DefaultLifecycleExecutionPlanCalculator.calculateExecutionPlan(DefaultLifecycleExecutionPlanCalculator.java:116)
	at org.apache.maven.lifecycle.internal.DefaultLifecycleExecutionPlanCalculator.calculateExecutionPlan(DefaultLifecycleExecutionPlanCalculator.java:129)
	at org.apache.maven.lifecycle.internal.BuilderCommon.resolveBuildPlan(BuilderCommon.java:92)
	at org.apache.maven.lifecycle.internal.LifecycleModuleBuilder.buildProject(LifecycleModuleBuilder.java:81)
	at org.apache.maven.lifecycle.internal.LifecycleModuleBuilder.buildProject(LifecycleModuleBuilder.java:59)
	at org.apache.maven.lifecycle.internal.LifecycleStarter.singleThreadedBuild(LifecycleStarter.java:183)
	at org.apache.maven.lifecycle.internal.LifecycleStarter.execute(LifecycleStarter.java:161)
	at org.apache.maven.DefaultMaven.doExecute(DefaultMaven.java:319)
	at org.apache.maven.DefaultMaven.execute(DefaultMaven.java:156)
	at org.jvnet.hudson.maven3.launcher.Maven3Launcher.main(Maven3Launcher.java:117)
	at sun.reflect.NativeMethodAccessorImpl.invoke0(Native Method)
	at sun.reflect.NativeMethodAccessorImpl.invoke(NativeMethodAccessorImpl.java:39)
	at sun.reflect.DelegatingMethodAccessorImpl.invoke(DelegatingMethodAccessorImpl.java:25)
	at java.lang.reflect.Method.invoke(Method.java:597)
	at org.codehaus.plexus.classworlds.launcher.Launcher.launchStandard(Launcher.java:329)
	at org.codehaus.plexus.classworlds.launcher.Launcher.launch(Launcher.java:239)
	at org.jvnet.hudson.maven3.agent.Maven3Main.launch(Maven3Main.java:178)
	at sun.reflect.NativeMethodAccessorImpl.invoke0(Native Method)
	at sun.reflect.NativeMethodAccessorImpl.invoke(NativeMethodAccessorImpl.java:39)
	at sun.reflect.DelegatingMethodAccessorImpl.invoke(DelegatingMethodAccessorImpl.java:25)
	at java.lang.reflect.Method.invoke(Method.java:597)
	at hudson.maven.Maven3Builder.call(Maven3Builder.java:129)
	at hudson.maven.Maven3Builder.call(Maven3Builder.java:67)
	at hudson.remoting.UserRequest.perform(UserRequest.java:118)
	at hudson.remoting.UserRequest.perform(UserRequest.java:48)
	at hudson.remoting.Request$2.run(Request.java:326)
	at hudson.remoting.InterceptingExecutorService$1.call(InterceptingExecutorService.java:72)
	at java.util.concurrent.FutureTask$Sync.innerRun(FutureTask.java:303)
	at java.util.concurrent.FutureTask.run(FutureTask.java:138)
	at java.util.concurrent.ThreadPoolExecutor$Worker.runTask(ThreadPoolExecutor.java:895)
	at java.util.concurrent.ThreadPoolExecutor$Worker.run(ThreadPoolExecutor.java:918)
	at java.lang.Thread.run(Thread.java:662)
Caused by: org.sonatype.aether.resolution.ArtifactDescriptorException: Failed to read artifact
descriptor for org.apache.maven.plugins:maven-resources-plugin:jar:2.4.3
	at org.apache.maven.repository.internal.DefaultArtifactDescriptorReader.loadPom(DefaultArtifactDescriptorReader.java:282)
	at org.apache.maven.repository.internal.DefaultArtifactDescriptorReader.readArtifactDescriptor(DefaultArtifactDescriptorReader.java:172)
	at org.sonatype.aether.impl.internal.DefaultRepositorySystem.readArtifactDescriptor(DefaultRepositorySystem.java:316)
	at org.apache.maven.plugin.internal.DefaultPluginDependenciesResolver.resolve(DefaultPluginDependenciesResolver.java:115)
	... 37 more
Caused by: org.sonatype.aether.resolution.ArtifactResolutionException: Could not find artifact
org.apache.maven.plugins:maven-resources-plugin:pom:2.4.3 in cloudbees-private-release-repository
(https://repository-jclouds.forge.cloudbees.com/release)
	at org.sonatype.aether.impl.internal.DefaultArtifactResolver.resolve(DefaultArtifactResolver.java:541)
	at org.sonatype.aether.impl.internal.DefaultArtifactResolver.resolveArtifacts(DefaultArtifactResolver.java:220)
	at org.sonatype.aether.impl.internal.DefaultArtifactResolver.resolveArtifact(DefaultArtifactResolver.java:197)
	at org.apache.maven.repository.internal.DefaultArtifactDescriptorReader.loadPom(DefaultArtifactDescriptorReader.java:267)
	... 40 more
Caused by: org.sonatype.aether.transfer.ArtifactNotFoundException: Could not find artifact
org.apache.maven.plugins:maven-resources-plugin:pom:2.4.3 in cloudbees-private-release-repository
(https://repository-jclouds.forge.cloudbees.com/release)
	at org.sonatype.aether.connector.wagon.WagonRepositoryConnector$4.wrap(WagonRepositoryConnector.java:945)
	at org.sonatype.aether.connector.wagon.WagonRepositoryConnector$4.wrap(WagonRepositoryConnector.java:940)
	at org.sonatype.aether.connector.wagon.WagonRepositoryConnector$GetTask.flush(WagonRepositoryConnector.java:695)
	at org.sonatype.aether.connector.wagon.WagonRepositoryConnector$GetTask.flush(WagonRepositoryConnector.java:689)
	at org.sonatype.aether.connector.wagon.WagonRepositoryConnector.get(WagonRepositoryConnector.java:445)
	at org.sonatype.aether.impl.internal.DefaultArtifactResolver.resolve(DefaultArtifactResolver.java:460)
	... 43 more
channel stopped

Mime
View raw message