jclouds-dev mailing list archives

Site index · List index
Message view « Date » · « Thread »
Top « Date » · « Thread »
From jenkins-no-re...@cloudbees.com
Subject Build failed in Jenkins: jclouds-labs » jclouds virtualbox api #375
Date Wed, 01 Jan 2014 17:45:14 GMT
See <https://jclouds.ci.cloudbees.com/job/jclouds-labs/org.apache.jclouds.labs$virtualbox/375/>

------------------------------------------
Jan 1, 2014 12:44:04 PM org.apache.maven.cli.event.ExecutionEventLogger projectStarted
INFO:                                                                         
Jan 1, 2014 12:44:04 PM org.apache.maven.cli.event.ExecutionEventLogger projectStarted
INFO: ------------------------------------------------------------------------
Jan 1, 2014 12:44:04 PM org.apache.maven.cli.event.ExecutionEventLogger projectStarted
INFO: Building jclouds virtualbox api 1.8.0-SNAPSHOT
Jan 1, 2014 12:44:04 PM org.apache.maven.cli.event.ExecutionEventLogger projectStarted
INFO: ------------------------------------------------------------------------
Downloading: https://repository-jclouds.forge.cloudbees.com/release/org/apache/maven/plugins/maven-resources-plugin/2.6/maven-resources-plugin-2.6.pom
Downloading: http://repo.cloudbees.com/content/repositories/central/org/apache/maven/plugins/maven-resources-plugin/2.6/maven-resources-plugin-2.6.pom
Downloaded: http://repo.cloudbees.com/content/repositories/central/org/apache/maven/plugins/maven-resources-plugin/2.6/maven-resources-plugin-2.6.pom
(8 KB at 1.7 KB/sec)
Downloading: https://repository-jclouds.forge.cloudbees.com/release/org/apache/maven/plugins/maven-resources-plugin/2.6/maven-resources-plugin-2.6.jar
Downloading: http://repo.cloudbees.com/content/repositories/central/org/apache/maven/plugins/maven-resources-plugin/2.6/maven-resources-plugin-2.6.jar
Downloaded: http://repo.cloudbees.com/content/repositories/central/org/apache/maven/plugins/maven-resources-plugin/2.6/maven-resources-plugin-2.6.jar
(29 KB at 655.2 KB/sec)
Downloading: https://repository-jclouds.forge.cloudbees.com/release/org/apache/maven/plugins/maven-compiler-plugin/3.1/maven-compiler-plugin-3.1.pom
Downloading: http://repo.cloudbees.com/content/repositories/central/org/apache/maven/plugins/maven-compiler-plugin/3.1/maven-compiler-plugin-3.1.pom
Downloaded: http://repo.cloudbees.com/content/repositories/central/org/apache/maven/plugins/maven-compiler-plugin/3.1/maven-compiler-plugin-3.1.pom
(10 KB at 767.0 KB/sec)
Downloading: https://repository-jclouds.forge.cloudbees.com/release/org/apache/maven/plugins/maven-plugins/24/maven-plugins-24.pom
Downloading: http://repo.cloudbees.com/content/repositories/central/org/apache/maven/plugins/maven-plugins/24/maven-plugins-24.pom
Downloaded: http://repo.cloudbees.com/content/repositories/central/org/apache/maven/plugins/maven-plugins/24/maven-plugins-24.pom
(11 KB at 703.5 KB/sec)
Downloading: https://repository-jclouds.forge.cloudbees.com/release/org/apache/maven/maven-parent/23/maven-parent-23.pom
Downloading: http://repo.cloudbees.com/content/repositories/central/org/apache/maven/maven-parent/23/maven-parent-23.pom
Downloaded: http://repo.cloudbees.com/content/repositories/central/org/apache/maven/maven-parent/23/maven-parent-23.pom
(32 KB at 2651.9 KB/sec)
Downloading: https://repository-jclouds.forge.cloudbees.com/release/org/apache/maven/plugins/maven-compiler-plugin/3.1/maven-compiler-plugin-3.1.jar
Downloading: http://repo.cloudbees.com/content/repositories/central/org/apache/maven/plugins/maven-compiler-plugin/3.1/maven-compiler-plugin-3.1.jar
Downloaded: http://repo.cloudbees.com/content/repositories/central/org/apache/maven/plugins/maven-compiler-plugin/3.1/maven-compiler-plugin-3.1.jar
(42 KB at 2796.2 KB/sec)
Jan 1, 2014 12:44:09 PM org.apache.maven.cli.event.ExecutionEventLogger mojoStarted
INFO: 
Jan 1, 2014 12:44:09 PM org.apache.maven.cli.event.ExecutionEventLogger mojoStarted
INFO: --- maven-clean-plugin:2.5:clean (default-clean) @ virtualbox ---
Jan 1, 2014 12:44:09 PM org.apache.maven.cli.event.ExecutionEventLogger mojoStarted
INFO: 
Jan 1, 2014 12:44:09 PM org.apache.maven.cli.event.ExecutionEventLogger mojoStarted
INFO: --- maven-enforcer-plugin:1.1.1:enforce (enforce-banned-dependencies) @ virtualbox ---
Jan 1, 2014 12:44:10 PM org.apache.maven.cli.event.ExecutionEventLogger mojoStarted
INFO: 
Jan 1, 2014 12:44:10 PM org.apache.maven.cli.event.ExecutionEventLogger mojoStarted
INFO: --- maven-enforcer-plugin:1.1.1:enforce (enforce-java) @ virtualbox ---
Jan 1, 2014 12:44:10 PM org.apache.maven.cli.event.ExecutionEventLogger mojoStarted
INFO: 
Jan 1, 2014 12:44:10 PM org.apache.maven.cli.event.ExecutionEventLogger mojoStarted
INFO: --- maven-remote-resources-plugin:1.4:process (default) @ virtualbox ---
Downloading: https://repository-jclouds.forge.cloudbees.com/snapshot/org/apache/jclouds/driver/jclouds-bouncycastle/1.8.0-SNAPSHOT/maven-metadata.xml
Downloading: https://oss.sonatype.org/content/repositories/snapshots/org/apache/jclouds/driver/jclouds-bouncycastle/1.8.0-SNAPSHOT/maven-metadata.xml
Downloading: https://repository.apache.org/content/repositories/snapshots/org/apache/jclouds/driver/jclouds-bouncycastle/1.8.0-SNAPSHOT/maven-metadata.xml
Downloading: http://repository.apache.org/snapshots/org/apache/jclouds/driver/jclouds-bouncycastle/1.8.0-SNAPSHOT/maven-metadata.xml
Downloaded: http://repository.apache.org/snapshots/org/apache/jclouds/driver/jclouds-bouncycastle/1.8.0-SNAPSHOT/maven-metadata.xml
(2 KB at 3.4 KB/sec)
Downloaded: https://repository.apache.org/content/repositories/snapshots/org/apache/jclouds/driver/jclouds-bouncycastle/1.8.0-SNAPSHOT/maven-metadata.xml
(2 KB at 1.9 KB/sec)
Downloading: https://oss.sonatype.org/content/repositories/snapshots/org/apache/jclouds/jclouds-project/1.8.0-SNAPSHOT/maven-metadata.xml
Downloading: https://repository.apache.org/content/repositories/snapshots/org/apache/jclouds/jclouds-project/1.8.0-SNAPSHOT/maven-metadata.xml
Downloading: https://repository-jclouds.forge.cloudbees.com/snapshot/org/apache/jclouds/jclouds-project/1.8.0-SNAPSHOT/maven-metadata.xml
Downloading: https://oss.sonatype.org/content/repositories/snapshots/org/apache/jclouds/jclouds-project/1.8.0-SNAPSHOT/maven-metadata.xml
Downloading: http://repository.apache.org/snapshots/org/apache/jclouds/jclouds-project/1.8.0-SNAPSHOT/maven-metadata.xml
Downloaded: http://repository.apache.org/snapshots/org/apache/jclouds/jclouds-project/1.8.0-SNAPSHOT/maven-metadata.xml
(825 B at 3.7 KB/sec)
Downloaded: https://repository.apache.org/content/repositories/snapshots/org/apache/jclouds/jclouds-project/1.8.0-SNAPSHOT/maven-metadata.xml
(825 B at 1.3 KB/sec)
Jan 1, 2014 12:44:13 PM org.apache.maven.cli.event.ExecutionEventLogger mojoStarted
INFO: 
Jan 1, 2014 12:44:13 PM org.apache.maven.cli.event.ExecutionEventLogger mojoStarted
INFO: --- maven-resources-plugin:2.6:resources (default-resources) @ virtualbox ---
Downloading: https://repository-jclouds.forge.cloudbees.com/release/org/codehaus/plexus/plexus-utils/2.0.5/plexus-utils-2.0.5.jar
Downloading: http://repo.cloudbees.com/content/repositories/central/org/codehaus/plexus/plexus-utils/2.0.5/plexus-utils-2.0.5.jar
Downloaded: http://repo.cloudbees.com/content/repositories/central/org/codehaus/plexus/plexus-utils/2.0.5/plexus-utils-2.0.5.jar
(218 KB at 66.3 KB/sec)
[INFO] Using 'UTF-8' encoding to copy filtered resources.
[INFO] skip non existing resourceDirectory <https://jclouds.ci.cloudbees.com/job/jclouds-labs/org.apache.jclouds.labs$virtualbox/ws/src/main/clojure>
[INFO] Copying 8 resources
[INFO] Copying 3 resources
Jan 1, 2014 12:44:17 PM org.apache.maven.cli.event.ExecutionEventLogger mojoStarted
INFO: 
Jan 1, 2014 12:44:17 PM org.apache.maven.cli.event.ExecutionEventLogger mojoStarted
INFO: --- maven-compiler-plugin:3.1:compile (default-compile) @ virtualbox ---
Downloading: https://repository-jclouds.forge.cloudbees.com/release/org/apache/maven/maven-toolchain/1.0/maven-toolchain-1.0.pom
Downloading: http://repo.cloudbees.com/content/repositories/central/org/apache/maven/maven-toolchain/1.0/maven-toolchain-1.0.pom
Downloaded: http://repo.cloudbees.com/content/repositories/central/org/apache/maven/maven-toolchain/1.0/maven-toolchain-1.0.pom
(4 KB at 185.2 KB/sec)
Downloading: https://repository-jclouds.forge.cloudbees.com/release/org/apache/maven/shared/maven-shared-utils/0.1/maven-shared-utils-0.1.pom
Downloading: http://repo.cloudbees.com/content/repositories/central/org/apache/maven/shared/maven-shared-utils/0.1/maven-shared-utils-0.1.pom
Downloaded: http://repo.cloudbees.com/content/repositories/central/org/apache/maven/shared/maven-shared-utils/0.1/maven-shared-utils-0.1.pom
(4 KB at 359.3 KB/sec)
Downloading: https://repository-jclouds.forge.cloudbees.com/release/org/apache/maven/shared/maven-shared-components/18/maven-shared-components-18.pom
Downloading: http://repo.cloudbees.com/content/repositories/central/org/apache/maven/shared/maven-shared-components/18/maven-shared-components-18.pom
Downloaded: http://repo.cloudbees.com/content/repositories/central/org/apache/maven/shared/maven-shared-components/18/maven-shared-components-18.pom
(5 KB at 267.7 KB/sec)
Downloading: https://repository-jclouds.forge.cloudbees.com/release/com/google/code/findbugs/jsr305/2.0.1/jsr305-2.0.1.pom
Downloading: http://repo.cloudbees.com/content/repositories/central/com/google/code/findbugs/jsr305/2.0.1/jsr305-2.0.1.pom
Downloaded: http://repo.cloudbees.com/content/repositories/central/com/google/code/findbugs/jsr305/2.0.1/jsr305-2.0.1.pom
(965 B at 85.7 KB/sec)
Downloading: https://repository-jclouds.forge.cloudbees.com/release/org/apache/maven/shared/maven-shared-incremental/1.1/maven-shared-incremental-1.1.pom
Downloading: http://repo.cloudbees.com/content/repositories/central/org/apache/maven/shared/maven-shared-incremental/1.1/maven-shared-incremental-1.1.pom
Downloaded: http://repo.cloudbees.com/content/repositories/central/org/apache/maven/shared/maven-shared-incremental/1.1/maven-shared-incremental-1.1.pom
(5 KB at 243.7 KB/sec)
Downloading: https://repository-jclouds.forge.cloudbees.com/release/org/apache/maven/shared/maven-shared-components/19/maven-shared-components-19.pom
Downloading: http://repo.cloudbees.com/content/repositories/central/org/apache/maven/shared/maven-shared-components/19/maven-shared-components-19.pom
Downloaded: http://repo.cloudbees.com/content/repositories/central/org/apache/maven/shared/maven-shared-components/19/maven-shared-components-19.pom
(7 KB at 326.8 KB/sec)
Downloading: https://repository-jclouds.forge.cloudbees.com/release/org/codehaus/plexus/plexus-compiler-api/2.2/plexus-compiler-api-2.2.pom
Downloading: http://repo.cloudbees.com/content/repositories/central/org/codehaus/plexus/plexus-compiler-api/2.2/plexus-compiler-api-2.2.pom
Downloaded: http://repo.cloudbees.com/content/repositories/central/org/codehaus/plexus/plexus-compiler-api/2.2/plexus-compiler-api-2.2.pom
(865 B at 70.4 KB/sec)
Downloading: https://repository-jclouds.forge.cloudbees.com/release/org/codehaus/plexus/plexus-compiler/2.2/plexus-compiler-2.2.pom
Downloading: http://repo.cloudbees.com/content/repositories/central/org/codehaus/plexus/plexus-compiler/2.2/plexus-compiler-2.2.pom
Downloaded: http://repo.cloudbees.com/content/repositories/central/org/codehaus/plexus/plexus-compiler/2.2/plexus-compiler-2.2.pom
(4 KB at 352.9 KB/sec)
Downloading: https://repository-jclouds.forge.cloudbees.com/release/org/codehaus/plexus/plexus-components/1.3.1/plexus-components-1.3.1.pom
Downloading: http://repo.cloudbees.com/content/repositories/central/org/codehaus/plexus/plexus-components/1.3.1/plexus-components-1.3.1.pom
Downloaded: http://repo.cloudbees.com/content/repositories/central/org/codehaus/plexus/plexus-components/1.3.1/plexus-components-1.3.1.pom
(3 KB at 213.7 KB/sec)
Downloading: https://repository-jclouds.forge.cloudbees.com/release/org/codehaus/plexus/plexus/3.3.1/plexus-3.3.1.pom
Downloading: http://repo.cloudbees.com/content/repositories/central/org/codehaus/plexus/plexus/3.3.1/plexus-3.3.1.pom
Downloaded: http://repo.cloudbees.com/content/repositories/central/org/codehaus/plexus/plexus/3.3.1/plexus-3.3.1.pom
(20 KB at 1535.9 KB/sec)
Downloading: https://repository-jclouds.forge.cloudbees.com/release/org/codehaus/plexus/plexus-compiler-manager/2.2/plexus-compiler-manager-2.2.pom
Downloading: http://repo.cloudbees.com/content/repositories/central/org/codehaus/plexus/plexus-compiler-manager/2.2/plexus-compiler-manager-2.2.pom
Downloaded: http://repo.cloudbees.com/content/repositories/central/org/codehaus/plexus/plexus-compiler-manager/2.2/plexus-compiler-manager-2.2.pom
(690 B at 67.4 KB/sec)
Downloading: https://repository-jclouds.forge.cloudbees.com/release/org/codehaus/plexus/plexus-compiler-javac/2.2/plexus-compiler-javac-2.2.pom
Downloading: http://repo.cloudbees.com/content/repositories/central/org/codehaus/plexus/plexus-compiler-javac/2.2/plexus-compiler-javac-2.2.pom
Downloaded: http://repo.cloudbees.com/content/repositories/central/org/codehaus/plexus/plexus-compiler-javac/2.2/plexus-compiler-javac-2.2.pom
(769 B at 68.3 KB/sec)
Downloading: https://repository-jclouds.forge.cloudbees.com/release/org/codehaus/plexus/plexus-compilers/2.2/plexus-compilers-2.2.pom
Downloading: http://repo.cloudbees.com/content/repositories/central/org/codehaus/plexus/plexus-compilers/2.2/plexus-compilers-2.2.pom
Downloaded: http://repo.cloudbees.com/content/repositories/central/org/codehaus/plexus/plexus-compilers/2.2/plexus-compilers-2.2.pom
(2 KB at 60.6 KB/sec)
Downloading: https://repository-jclouds.forge.cloudbees.com/release/org/codehaus/plexus/plexus-container-default/1.5.5/plexus-container-default-1.5.5.pom
Downloading: http://repo.cloudbees.com/content/repositories/central/org/codehaus/plexus/plexus-container-default/1.5.5/plexus-container-default-1.5.5.pom
Downloaded: http://repo.cloudbees.com/content/repositories/central/org/codehaus/plexus/plexus-container-default/1.5.5/plexus-container-default-1.5.5.pom
(3 KB at 0.4 KB/sec)
Downloading: https://repository-jclouds.forge.cloudbees.com/release/org/codehaus/plexus/plexus-classworlds/2.2.2/plexus-classworlds-2.2.2.pom
Downloading: http://repo.cloudbees.com/content/repositories/central/org/codehaus/plexus/plexus-classworlds/2.2.2/plexus-classworlds-2.2.2.pom
Downloaded: http://repo.cloudbees.com/content/repositories/central/org/codehaus/plexus/plexus-classworlds/2.2.2/plexus-classworlds-2.2.2.pom
(4 KB at 112.5 KB/sec)
Downloading: https://repository-jclouds.forge.cloudbees.com/release/org/apache/xbean/xbean-reflect/3.4/xbean-reflect-3.4.pom
Downloading: http://repo.cloudbees.com/content/repositories/central/org/apache/xbean/xbean-reflect/3.4/xbean-reflect-3.4.pom
Downloaded: http://repo.cloudbees.com/content/repositories/central/org/apache/xbean/xbean-reflect/3.4/xbean-reflect-3.4.pom
(3 KB at 228.6 KB/sec)
Downloading: https://repository-jclouds.forge.cloudbees.com/release/org/apache/xbean/xbean/3.4/xbean-3.4.pom
Downloading: http://repo.cloudbees.com/content/repositories/central/org/apache/xbean/xbean/3.4/xbean-3.4.pom
Downloaded: http://repo.cloudbees.com/content/repositories/central/org/apache/xbean/xbean/3.4/xbean-3.4.pom
(19 KB at 502.7 KB/sec)
Downloading: https://repository-jclouds.forge.cloudbees.com/release/commons-logging/commons-logging-api/1.1/commons-logging-api-1.1.pom
Downloading: http://repo.cloudbees.com/content/repositories/central/commons-logging/commons-logging-api/1.1/commons-logging-api-1.1.pom
Downloaded: http://repo.cloudbees.com/content/repositories/central/commons-logging/commons-logging-api/1.1/commons-logging-api-1.1.pom
(6 KB at 137.4 KB/sec)
Downloading: https://repository-jclouds.forge.cloudbees.com/release/com/google/collections/google-collections/1.0/google-collections-1.0.pom
Downloading: http://repo.cloudbees.com/content/repositories/central/com/google/collections/google-collections/1.0/google-collections-1.0.pom
Downloaded: http://repo.cloudbees.com/content/repositories/central/com/google/collections/google-collections/1.0/google-collections-1.0.pom
(3 KB at 83.4 KB/sec)
Downloading: https://repository-jclouds.forge.cloudbees.com/release/com/google/google/1/google-1.pom
Downloading: http://repo.cloudbees.com/content/repositories/central/com/google/google/1/google-1.pom
Downloaded: http://repo.cloudbees.com/content/repositories/central/com/google/google/1/google-1.pom
(2 KB at 101.2 KB/sec)
Downloading: https://repository-jclouds.forge.cloudbees.com/release/org/apache/maven/shared/maven-shared-utils/0.1/maven-shared-utils-0.1.jar
Downloading: https://repository-jclouds.forge.cloudbees.com/release/com/google/code/findbugs/jsr305/2.0.1/jsr305-2.0.1.jar
Downloading: https://repository-jclouds.forge.cloudbees.com/release/org/apache/maven/shared/maven-shared-incremental/1.1/maven-shared-incremental-1.1.jar
Downloading: https://repository-jclouds.forge.cloudbees.com/release/org/codehaus/plexus/plexus-compiler-api/2.2/plexus-compiler-api-2.2.jar
Downloading: https://repository-jclouds.forge.cloudbees.com/release/org/codehaus/plexus/plexus-compiler-manager/2.2/plexus-compiler-manager-2.2.jar
Downloading: https://repository-jclouds.forge.cloudbees.com/release/org/codehaus/plexus/plexus-compiler-javac/2.2/plexus-compiler-javac-2.2.jar
Downloading: https://repository-jclouds.forge.cloudbees.com/release/org/apache/xbean/xbean-reflect/3.4/xbean-reflect-3.4.jar
Downloading: https://repository-jclouds.forge.cloudbees.com/release/log4j/log4j/1.2.12/log4j-1.2.12.jar
Downloading: https://repository-jclouds.forge.cloudbees.com/release/commons-logging/commons-logging-api/1.1/commons-logging-api-1.1.jar
Downloading: https://repository-jclouds.forge.cloudbees.com/release/com/google/collections/google-collections/1.0/google-collections-1.0.jar
Downloading: https://repository-jclouds.forge.cloudbees.com/release/junit/junit/3.8.2/junit-3.8.2.jar
Downloading: http://repo.cloudbees.com/content/repositories/central/org/apache/maven/shared/maven-shared-utils/0.1/maven-shared-utils-0.1.jar
Downloading: http://repo.cloudbees.com/content/repositories/central/com/google/code/findbugs/jsr305/2.0.1/jsr305-2.0.1.jar
Downloading: http://repo.cloudbees.com/content/repositories/central/org/apache/maven/shared/maven-shared-incremental/1.1/maven-shared-incremental-1.1.jar
Downloading: http://repo.cloudbees.com/content/repositories/central/org/codehaus/plexus/plexus-compiler-api/2.2/plexus-compiler-api-2.2.jar
Downloading: http://repo.cloudbees.com/content/repositories/central/org/codehaus/plexus/plexus-compiler-manager/2.2/plexus-compiler-manager-2.2.jar
Downloaded: http://repo.cloudbees.com/content/repositories/central/com/google/code/findbugs/jsr305/2.0.1/jsr305-2.0.1.jar
(32 KB at 1556.0 KB/sec)
Downloaded: http://repo.cloudbees.com/content/repositories/central/org/apache/maven/shared/maven-shared-incremental/1.1/maven-shared-incremental-1.1.jar
(14 KB at 661.0 KB/sec)
Downloading: http://repo.cloudbees.com/content/repositories/central/org/codehaus/plexus/plexus-compiler-javac/2.2/plexus-compiler-javac-2.2.jar
Downloading: http://repo.cloudbees.com/content/repositories/central/org/apache/xbean/xbean-reflect/3.4/xbean-reflect-3.4.jar
Downloaded: http://repo.cloudbees.com/content/repositories/central/org/apache/maven/shared/maven-shared-utils/0.1/maven-shared-utils-0.1.jar
(151 KB at 4311.4 KB/sec)
Downloading: http://repo.cloudbees.com/content/repositories/central/log4j/log4j/1.2.12/log4j-1.2.12.jar
Downloaded: http://repo.cloudbees.com/content/repositories/central/org/codehaus/plexus/plexus-compiler-api/2.2/plexus-compiler-api-2.2.jar
(25 KB at 254.2 KB/sec)
Downloading: http://repo.cloudbees.com/content/repositories/central/commons-logging/commons-logging-api/1.1/commons-logging-api-1.1.jar
Downloaded: http://repo.cloudbees.com/content/repositories/central/org/codehaus/plexus/plexus-compiler-javac/2.2/plexus-compiler-javac-2.2.jar
(19 KB at 215.4 KB/sec)
Downloading: http://repo.cloudbees.com/content/repositories/central/com/google/collections/google-collections/1.0/google-collections-1.0.jar
Downloaded: http://repo.cloudbees.com/content/repositories/central/org/apache/xbean/xbean-reflect/3.4/xbean-reflect-3.4.jar
(131 KB at 1405.3 KB/sec)
Downloaded: http://repo.cloudbees.com/content/repositories/central/org/codehaus/plexus/plexus-compiler-manager/2.2/plexus-compiler-manager-2.2.jar
(5 KB at 41.6 KB/sec)
Downloading: http://repo.cloudbees.com/content/repositories/central/junit/junit/3.8.2/junit-3.8.2.jar
Downloaded: http://repo.cloudbees.com/content/repositories/central/commons-logging/commons-logging-api/1.1/commons-logging-api-1.1.jar
(44 KB at 478.6 KB/sec)
Downloaded: http://repo.cloudbees.com/content/repositories/central/junit/junit/3.8.2/junit-3.8.2.jar
(118 KB at 1386.0 KB/sec)
Downloaded: http://repo.cloudbees.com/content/repositories/central/log4j/log4j/1.2.12/log4j-1.2.12.jar
(350 KB at 1784.1 KB/sec)
Downloaded: http://repo.cloudbees.com/content/repositories/central/com/google/collections/google-collections/1.0/google-collections-1.0.jar
(625 KB at 4626.7 KB/sec)
[INFO] Changes detected - recompiling the module!
[INFO] Compiling 87 source files to <https://jclouds.ci.cloudbees.com/job/jclouds-labs/org.apache.jclouds.labs$virtualbox/ws/target/classes>
[Unloading class GregorSamsa$2]
[Unloading class GregorSamsa$1]
[Unloading class GregorSamsa$0]
[Unloading class GregorSamsa]
[WARNING] Note: Some input files use or override a deprecated API.
[WARNING] Note: Recompile with -Xlint:deprecation for details.
Jan 1, 2014 12:44:42 PM org.apache.maven.cli.event.ExecutionEventLogger mojoStarted
INFO: 
Jan 1, 2014 12:44:42 PM org.apache.maven.cli.event.ExecutionEventLogger mojoStarted
INFO: --- maven-resources-plugin:2.6:testResources (default-testResources) @ virtualbox ---
[INFO] Using 'UTF-8' encoding to copy filtered resources.
[INFO] skip non existing resourceDirectory <https://jclouds.ci.cloudbees.com/job/jclouds-labs/org.apache.jclouds.labs$virtualbox/ws/src/test/clojure>
[INFO] Copying 11 resources
[INFO] Copying 3 resources
Jan 1, 2014 12:44:42 PM org.apache.maven.cli.event.ExecutionEventLogger mojoStarted
INFO: 
Jan 1, 2014 12:44:42 PM org.apache.maven.cli.event.ExecutionEventLogger mojoStarted
INFO: --- maven-compiler-plugin:3.1:testCompile (default-testCompile) @ virtualbox ---
[INFO] Changes detected - recompiling the module!
[INFO] Compiling 45 source files to <https://jclouds.ci.cloudbees.com/job/jclouds-labs/org.apache.jclouds.labs$virtualbox/ws/target/test-classes>
Jan 1, 2014 12:44:46 PM org.apache.maven.cli.event.ExecutionEventLogger mojoStarted
INFO: 
Jan 1, 2014 12:44:46 PM org.apache.maven.cli.event.ExecutionEventLogger mojoStarted
INFO: --- maven-surefire-plugin:2.12.4:test (default-test) @ virtualbox ---
[INFO] Surefire report directory: <https://jclouds.ci.cloudbees.com/job/jclouds-labs/org.apache.jclouds.labs$virtualbox/ws/target/surefire-reports>
Downloading: https://repository-jclouds.forge.cloudbees.com/release/org/apache/maven/surefire/surefire-testng/2.12.4/surefire-testng-2.12.4.pom
Downloading: http://repo.cloudbees.com/content/repositories/central/org/apache/maven/surefire/surefire-testng/2.12.4/surefire-testng-2.12.4.pom
[WARNING] Missing POM for org.apache.maven.surefire:surefire-testng:jar:2.12.4
Downloading: https://repository-jclouds.forge.cloudbees.com/release/org/apache/maven/surefire/surefire-testng/2.12.4/surefire-testng-2.12.4.jar
Downloading: http://repo.cloudbees.com/content/repositories/central/org/apache/maven/surefire/surefire-testng/2.12.4/surefire-testng-2.12.4.jar
Downloaded: http://repo.cloudbees.com/content/repositories/central/org/apache/maven/surefire/surefire-testng/2.12.4/surefire-testng-2.12.4.jar
(33 KB at 2523.4 KB/sec)
Downloading: https://repository-jclouds.forge.cloudbees.com/release/org/apache/maven/surefire/surefire-testng-utils/2.12.4/surefire-testng-utils-2.12.4.jar
Downloading: http://repo.cloudbees.com/content/repositories/central/org/apache/maven/surefire/surefire-testng-utils/2.12.4/surefire-testng-utils-2.12.4.jar
Downloaded: http://repo.cloudbees.com/content/repositories/central/org/apache/maven/surefire/surefire-testng-utils/2.12.4/surefire-testng-utils-2.12.4.jar
(23 KB at 1768.7 KB/sec)
Downloading: https://repository-jclouds.forge.cloudbees.com/release/org/apache/maven/surefire/surefire-grouper/2.12.4/surefire-grouper-2.12.4.jar
Downloading: http://repo.cloudbees.com/content/repositories/central/org/apache/maven/surefire/surefire-grouper/2.12.4/surefire-grouper-2.12.4.jar
Downloaded: http://repo.cloudbees.com/content/repositories/central/org/apache/maven/surefire/surefire-grouper/2.12.4/surefire-grouper-2.12.4.jar
(37 KB at 1538.4 KB/sec)

-------------------------------------------------------
 T E S T S
-------------------------------------------------------
org.apache.maven.surefire.util.SurefireReflectionException: java.lang.reflect.InvocationTargetException;
nested exception is java.lang.reflect.InvocationTargetException: null
java.lang.reflect.InvocationTargetException
	at sun.reflect.NativeMethodAccessorImpl.invoke0(Native Method)
	at sun.reflect.NativeMethodAccessorImpl.invoke(NativeMethodAccessorImpl.java:39)
	at sun.reflect.DelegatingMethodAccessorImpl.invoke(DelegatingMethodAccessorImpl.java:25)
	at java.lang.reflect.Method.invoke(Method.java:597)
	at org.apache.maven.surefire.util.ReflectionUtils.invokeMethodWithArray(ReflectionUtils.java:189)
	at org.apache.maven.surefire.booter.ProviderFactory$ProviderProxy.invoke(ProviderFactory.java:165)
	at org.apache.maven.surefire.booter.ProviderFactory.invokeProvider(ProviderFactory.java:85)
	at org.apache.maven.surefire.booter.ForkedBooter.runSuitesInProcess(ForkedBooter.java:115)
	at org.apache.maven.surefire.booter.ForkedBooter.main(ForkedBooter.java:75)
Caused by: java.lang.NoClassDefFoundError: org/apache/maven/artifact/versioning/ArtifactVersion
	at org.apache.maven.surefire.testng.TestNGProvider.getDirectorySuite(TestNGProvider.java:122)
	at org.apache.maven.surefire.testng.TestNGProvider.invoke(TestNGProvider.java:105)
	... 9 more
Caused by: java.lang.ClassNotFoundException: org.apache.maven.artifact.versioning.ArtifactVersion
	at java.net.URLClassLoader$1.run(URLClassLoader.java:202)
	at java.security.AccessController.doPrivileged(Native Method)
	at java.net.URLClassLoader.findClass(URLClassLoader.java:190)
	at java.lang.ClassLoader.loadClass(ClassLoader.java:306)
	at java.lang.ClassLoader.loadClass(ClassLoader.java:247)
	at org.apache.maven.surefire.booter.IsolatedClassLoader.loadClass(IsolatedClassLoader.java:97)
	... 11 more

Results :

Tests run: 0, Failures: 0, Errors: 0, Skipped: 0

[JENKINS] Recording test results

Mime
View raw message