jclouds-dev mailing list archives

Site index · List index
Message view « Date » · « Thread »
Top « Date » · « Thread »
From jenkins-no-re...@cloudbees.com
Subject Build failed in Jenkins: jclouds-chef #740
Date Wed, 01 Jan 2014 15:39:02 GMT
See <https://jclouds.ci.cloudbees.com/job/jclouds-chef/740/>

------------------------------------------
[...truncated 188 lines...]
Downloaded: http://repo.cloudbees.com/content/repositories/central/org/codehaus/plexus/plexus-io/1.0/plexus-io-1.0.pom
(2 KB at 30.0 KB/sec)
Downloading: https://repository-jclouds.forge.cloudbees.com/release/org/codehaus/plexus/plexus-interpolation/1.13/plexus-interpolation-1.13.pom
Downloading: http://repo.cloudbees.com/content/repositories/central/org/codehaus/plexus/plexus-interpolation/1.13/plexus-interpolation-1.13.pom
Downloaded: http://repo.cloudbees.com/content/repositories/central/org/codehaus/plexus/plexus-interpolation/1.13/plexus-interpolation-1.13.pom
(890 B at 72.4 KB/sec)
Downloading: https://repository-jclouds.forge.cloudbees.com/release/org/codehaus/plexus/plexus-components/1.1.15/plexus-components-1.1.15.pom
Downloading: http://repo.cloudbees.com/content/repositories/central/org/codehaus/plexus/plexus-components/1.1.15/plexus-components-1.1.15.pom
Downloaded: http://repo.cloudbees.com/content/repositories/central/org/codehaus/plexus/plexus-components/1.1.15/plexus-components-1.1.15.pom
(3 KB at 4.2 KB/sec)
Downloading: https://repository-jclouds.forge.cloudbees.com/release/org/codehaus/plexus/plexus/2.0.3/plexus-2.0.3.pom
Downloading: http://repo.cloudbees.com/content/repositories/central/org/codehaus/plexus/plexus/2.0.3/plexus-2.0.3.pom
Downloaded: http://repo.cloudbees.com/content/repositories/central/org/codehaus/plexus/plexus/2.0.3/plexus-2.0.3.pom
(16 KB at 1161.4 KB/sec)
Downloading: https://repository-jclouds.forge.cloudbees.com/release/org/apache/maven/shared/maven-dependency-tree/1.2/maven-dependency-tree-1.2.pom
Downloading: http://repo.cloudbees.com/content/repositories/central/org/apache/maven/shared/maven-dependency-tree/1.2/maven-dependency-tree-1.2.pom
Downloaded: http://repo.cloudbees.com/content/repositories/central/org/apache/maven/shared/maven-dependency-tree/1.2/maven-dependency-tree-1.2.pom
(4 KB at 271.3 KB/sec)
Downloading: https://repository-jclouds.forge.cloudbees.com/release/org/apache/maven/shared/maven-shared-components/9/maven-shared-components-9.pom
Downloading: http://repo.cloudbees.com/content/repositories/central/org/apache/maven/shared/maven-shared-components/9/maven-shared-components-9.pom
Downloaded: http://repo.cloudbees.com/content/repositories/central/org/apache/maven/shared/maven-shared-components/9/maven-shared-components-9.pom
(4 KB at 284.9 KB/sec)
Downloading: https://repository-jclouds.forge.cloudbees.com/release/org/apache/maven/maven-parent/8/maven-parent-8.pom
Downloading: http://repo.cloudbees.com/content/repositories/central/org/apache/maven/maven-parent/8/maven-parent-8.pom
Downloaded: http://repo.cloudbees.com/content/repositories/central/org/apache/maven/maven-parent/8/maven-parent-8.pom
(24 KB at 1473.0 KB/sec)
Downloading: https://repository-jclouds.forge.cloudbees.com/release/org/apache/apache/4/apache-4.pom
Downloading: http://repo.cloudbees.com/content/repositories/central/org/apache/apache/4/apache-4.pom
Downloaded: http://repo.cloudbees.com/content/repositories/central/org/apache/apache/4/apache-4.pom
(5 KB at 439.0 KB/sec)
Downloading: https://repository-jclouds.forge.cloudbees.com/release/org/apache/maven/maven-project/2.0.8/maven-project-2.0.8.pom
Downloading: http://repo.cloudbees.com/content/repositories/central/org/apache/maven/maven-project/2.0.8/maven-project-2.0.8.pom
Downloaded: http://repo.cloudbees.com/content/repositories/central/org/apache/maven/maven-project/2.0.8/maven-project-2.0.8.pom
(3 KB at 240.6 KB/sec)
Downloading: https://repository-jclouds.forge.cloudbees.com/release/org/apache/maven/maven/2.0.8/maven-2.0.8.pom
Downloading: http://repo.cloudbees.com/content/repositories/central/org/apache/maven/maven/2.0.8/maven-2.0.8.pom
Downloaded: http://repo.cloudbees.com/content/repositories/central/org/apache/maven/maven/2.0.8/maven-2.0.8.pom
(12 KB at 492.1 KB/sec)
Downloading: https://repository-jclouds.forge.cloudbees.com/release/org/apache/maven/maven-parent/6/maven-parent-6.pom
Downloading: http://repo.cloudbees.com/content/repositories/central/org/apache/maven/maven-parent/6/maven-parent-6.pom
Downloaded: http://repo.cloudbees.com/content/repositories/central/org/apache/maven/maven-parent/6/maven-parent-6.pom
(20 KB at 1398.3 KB/sec)
Downloading: https://repository-jclouds.forge.cloudbees.com/release/org/apache/maven/maven-settings/2.0.8/maven-settings-2.0.8.pom
Downloading: http://repo.cloudbees.com/content/repositories/central/org/apache/maven/maven-settings/2.0.8/maven-settings-2.0.8.pom
Downloaded: http://repo.cloudbees.com/content/repositories/central/org/apache/maven/maven-settings/2.0.8/maven-settings-2.0.8.pom
(3 KB at 134.0 KB/sec)
Downloading: https://repository-jclouds.forge.cloudbees.com/release/org/apache/maven/maven-model/2.0.8/maven-model-2.0.8.pom
Downloading: http://repo.cloudbees.com/content/repositories/central/org/apache/maven/maven-model/2.0.8/maven-model-2.0.8.pom
Downloaded: http://repo.cloudbees.com/content/repositories/central/org/apache/maven/maven-model/2.0.8/maven-model-2.0.8.pom
(4 KB at 180.4 KB/sec)
Downloading: https://repository-jclouds.forge.cloudbees.com/release/org/codehaus/plexus/plexus-utils/1.4.6/plexus-utils-1.4.6.pom
Downloading: http://repo.cloudbees.com/content/repositories/central/org/codehaus/plexus/plexus-utils/1.4.6/plexus-utils-1.4.6.pom
Downloaded: http://repo.cloudbees.com/content/repositories/central/org/codehaus/plexus/plexus-utils/1.4.6/plexus-utils-1.4.6.pom
(3 KB at 138.2 KB/sec)
Downloading: https://repository-jclouds.forge.cloudbees.com/release/org/apache/maven/maven-profile/2.0.8/maven-profile-2.0.8.pom
Downloading: http://repo.cloudbees.com/content/repositories/central/org/apache/maven/maven-profile/2.0.8/maven-profile-2.0.8.pom
Downloaded: http://repo.cloudbees.com/content/repositories/central/org/apache/maven/maven-profile/2.0.8/maven-profile-2.0.8.pom
(2 KB at 0.3 KB/sec)
Downloading: https://repository-jclouds.forge.cloudbees.com/release/org/apache/maven/maven-artifact-manager/2.0.8/maven-artifact-manager-2.0.8.pom
Downloading: http://repo.cloudbees.com/content/repositories/central/org/apache/maven/maven-artifact-manager/2.0.8/maven-artifact-manager-2.0.8.pom
Downloaded: http://repo.cloudbees.com/content/repositories/central/org/apache/maven/maven-artifact-manager/2.0.8/maven-artifact-manager-2.0.8.pom
(3 KB at 239.7 KB/sec)
Downloading: https://repository-jclouds.forge.cloudbees.com/release/org/apache/maven/maven-repository-metadata/2.0.8/maven-repository-metadata-2.0.8.pom
Downloading: http://repo.cloudbees.com/content/repositories/central/org/apache/maven/maven-repository-metadata/2.0.8/maven-repository-metadata-2.0.8.pom
Downloaded: http://repo.cloudbees.com/content/repositories/central/org/apache/maven/maven-repository-metadata/2.0.8/maven-repository-metadata-2.0.8.pom
(2 KB at 71.4 KB/sec)
Downloading: https://repository-jclouds.forge.cloudbees.com/release/org/apache/maven/maven-artifact/2.0.8/maven-artifact-2.0.8.pom
Downloading: http://repo.cloudbees.com/content/repositories/central/org/apache/maven/maven-artifact/2.0.8/maven-artifact-2.0.8.pom
Downloaded: http://repo.cloudbees.com/content/repositories/central/org/apache/maven/maven-artifact/2.0.8/maven-artifact-2.0.8.pom
(2 KB at 121.6 KB/sec)
Downloading: https://repository-jclouds.forge.cloudbees.com/release/org/apache/maven/maven-plugin-registry/2.0.8/maven-plugin-registry-2.0.8.pom
Downloading: http://repo.cloudbees.com/content/repositories/central/org/apache/maven/maven-plugin-registry/2.0.8/maven-plugin-registry-2.0.8.pom
Downloaded: http://repo.cloudbees.com/content/repositories/central/org/apache/maven/maven-plugin-registry/2.0.8/maven-plugin-registry-2.0.8.pom
(2 KB at 122.0 KB/sec)
Downloading: https://repository-jclouds.forge.cloudbees.com/release/org/codehaus/plexus/plexus-utils/2.1/plexus-utils-2.1.pom
Downloading: http://repo.cloudbees.com/content/repositories/central/org/codehaus/plexus/plexus-utils/2.1/plexus-utils-2.1.pom
Downloaded: http://repo.cloudbees.com/content/repositories/central/org/codehaus/plexus/plexus-utils/2.1/plexus-utils-2.1.pom
(4 KB at 393.9 KB/sec)
Downloading: https://repository-jclouds.forge.cloudbees.com/release/org/sonatype/spice/spice-parent/16/spice-parent-16.pom
Downloading: http://repo.cloudbees.com/content/repositories/central/org/sonatype/spice/spice-parent/16/spice-parent-16.pom
Downloaded: http://repo.cloudbees.com/content/repositories/central/org/sonatype/spice/spice-parent/16/spice-parent-16.pom
(9 KB at 742.0 KB/sec)
Downloading: https://repository-jclouds.forge.cloudbees.com/release/org/sonatype/forge/forge-parent/5/forge-parent-5.pom
Downloading: http://repo.cloudbees.com/content/repositories/central/org/sonatype/forge/forge-parent/5/forge-parent-5.pom
Downloaded: http://repo.cloudbees.com/content/repositories/central/org/sonatype/forge/forge-parent/5/forge-parent-5.pom
(9 KB at 453.7 KB/sec)
Downloading: https://repository-jclouds.forge.cloudbees.com/release/org/apache/felix/maven-bundle-plugin/2.3.7/maven-bundle-plugin-2.3.7.jar
Downloading: https://repository-jclouds.forge.cloudbees.com/release/biz/aQute/bndlib/1.50.0/bndlib-1.50.0.jar
Downloading: https://repository-jclouds.forge.cloudbees.com/release/org/apache/felix/org.apache.felix.bundlerepository/1.6.6/org.apache.felix.bundlerepository-1.6.6.jar
Downloading: https://repository-jclouds.forge.cloudbees.com/release/org/osgi/org.osgi.core/4.1.0/org.osgi.core-4.1.0.jar
Downloading: https://repository-jclouds.forge.cloudbees.com/release/org/easymock/easymock/2.4/easymock-2.4.jar
Downloading: https://repository-jclouds.forge.cloudbees.com/release/org/apache/maven/reporting/maven-reporting-api/2.0.7/maven-reporting-api-2.0.7.jar
Downloading: https://repository-jclouds.forge.cloudbees.com/release/org/apache/maven/doxia/doxia-sink-api/1.0-alpha-7/doxia-sink-api-1.0-alpha-7.jar
Downloading: https://repository-jclouds.forge.cloudbees.com/release/junit/junit/3.8.1/junit-3.8.1.jar
Downloading: https://repository-jclouds.forge.cloudbees.com/release/commons-cli/commons-cli/1.0/commons-cli-1.0.jar
Downloading: https://repository-jclouds.forge.cloudbees.com/release/org/codehaus/plexus/plexus-interactivity-api/1.0-alpha-4/plexus-interactivity-api-1.0-alpha-4.jar
Downloading: https://repository-jclouds.forge.cloudbees.com/release/org/apache/maven/maven-archiver/2.4.1/maven-archiver-2.4.1.jar
Downloading: https://repository-jclouds.forge.cloudbees.com/release/org/codehaus/plexus/plexus-archiver/1.0/plexus-archiver-1.0.jar
Downloading: https://repository-jclouds.forge.cloudbees.com/release/org/codehaus/plexus/plexus-io/1.0/plexus-io-1.0.jar
Downloading: https://repository-jclouds.forge.cloudbees.com/release/org/codehaus/plexus/plexus-interpolation/1.13/plexus-interpolation-1.13.jar
Downloading: https://repository-jclouds.forge.cloudbees.com/release/org/apache/maven/shared/maven-dependency-tree/1.2/maven-dependency-tree-1.2.jar
Downloading: https://repository-jclouds.forge.cloudbees.com/release/org/codehaus/plexus/plexus-utils/2.1/plexus-utils-2.1.jar
Downloading: http://repo.cloudbees.com/content/repositories/central/org/apache/felix/maven-bundle-plugin/2.3.7/maven-bundle-plugin-2.3.7.jar
Downloading: http://repo.cloudbees.com/content/repositories/central/biz/aQute/bndlib/1.50.0/bndlib-1.50.0.jar
Downloading: http://repo.cloudbees.com/content/repositories/central/org/apache/felix/org.apache.felix.bundlerepository/1.6.6/org.apache.felix.bundlerepository-1.6.6.jar
Downloading: http://repo.cloudbees.com/content/repositories/central/org/osgi/org.osgi.core/4.1.0/org.osgi.core-4.1.0.jar
Downloading: http://repo.cloudbees.com/content/repositories/central/org/easymock/easymock/2.4/easymock-2.4.jar
Downloaded: http://repo.cloudbees.com/content/repositories/central/org/osgi/org.osgi.core/4.1.0/org.osgi.core-4.1.0.jar
(160 KB at 3130.1 KB/sec)
Downloading: http://repo.cloudbees.com/content/repositories/central/org/apache/maven/reporting/maven-reporting-api/2.0.7/maven-reporting-api-2.0.7.jar
Downloaded: http://repo.cloudbees.com/content/repositories/central/org/apache/felix/org.apache.felix.bundlerepository/1.6.6/org.apache.felix.bundlerepository-1.6.6.jar
(165 KB at 3160.3 KB/sec)
Downloading: http://repo.cloudbees.com/content/repositories/central/org/apache/maven/doxia/doxia-sink-api/1.0-alpha-7/doxia-sink-api-1.0-alpha-7.jar
Downloaded: http://repo.cloudbees.com/content/repositories/central/org/apache/felix/maven-bundle-plugin/2.3.7/maven-bundle-plugin-2.3.7.jar
(122 KB at 2248.0 KB/sec)
Downloading: http://repo.cloudbees.com/content/repositories/central/junit/junit/3.8.1/junit-3.8.1.jar
Downloaded: http://repo.cloudbees.com/content/repositories/central/org/apache/maven/reporting/maven-reporting-api/2.0.7/maven-reporting-api-2.0.7.jar
(10 KB at 346.6 KB/sec)
Downloaded: http://repo.cloudbees.com/content/repositories/central/junit/junit/3.8.1/junit-3.8.1.jar
(119 KB at 4547.4 KB/sec)
Downloading: http://repo.cloudbees.com/content/repositories/central/commons-cli/commons-cli/1.0/commons-cli-1.0.jar
Downloading: http://repo.cloudbees.com/content/repositories/central/org/codehaus/plexus/plexus-interactivity-api/1.0-alpha-4/plexus-interactivity-api-1.0-alpha-4.jar
Downloaded: http://repo.cloudbees.com/content/repositories/central/org/apache/maven/doxia/doxia-sink-api/1.0-alpha-7/doxia-sink-api-1.0-alpha-7.jar
(6 KB at 199.9 KB/sec)
Downloading: http://repo.cloudbees.com/content/repositories/central/org/apache/maven/maven-archiver/2.4.1/maven-archiver-2.4.1.jar
Downloaded: http://repo.cloudbees.com/content/repositories/central/org/easymock/easymock/2.4/easymock-2.4.jar
(80 KB at 842.9 KB/sec)
Downloading: http://repo.cloudbees.com/content/repositories/central/org/codehaus/plexus/plexus-archiver/1.0/plexus-archiver-1.0.jar
Downloaded: http://repo.cloudbees.com/content/repositories/central/biz/aQute/bndlib/1.50.0/bndlib-1.50.0.jar
(899 KB at 8804.2 KB/sec)
Downloading: http://repo.cloudbees.com/content/repositories/central/org/codehaus/plexus/plexus-io/1.0/plexus-io-1.0.jar
Downloaded: http://repo.cloudbees.com/content/repositories/central/org/apache/maven/maven-archiver/2.4.1/maven-archiver-2.4.1.jar
(20 KB at 456.4 KB/sec)
Downloading: http://repo.cloudbees.com/content/repositories/central/org/codehaus/plexus/plexus-interpolation/1.13/plexus-interpolation-1.13.jar
Downloaded: http://repo.cloudbees.com/content/repositories/central/commons-cli/commons-cli/1.0/commons-cli-1.0.jar
(30 KB at 653.6 KB/sec)
Downloading: http://repo.cloudbees.com/content/repositories/central/org/apache/maven/shared/maven-dependency-tree/1.2/maven-dependency-tree-1.2.jar
Downloaded: http://repo.cloudbees.com/content/repositories/central/org/codehaus/plexus/plexus-io/1.0/plexus-io-1.0.jar
(50 KB at 1908.2 KB/sec)
Downloading: http://repo.cloudbees.com/content/repositories/central/org/codehaus/plexus/plexus-utils/2.1/plexus-utils-2.1.jar
Downloaded: http://repo.cloudbees.com/content/repositories/central/org/codehaus/plexus/plexus-interactivity-api/1.0-alpha-4/plexus-interactivity-api-1.0-alpha-4.jar
(14 KB at 204.6 KB/sec)
Downloaded: http://repo.cloudbees.com/content/repositories/central/org/apache/maven/shared/maven-dependency-tree/1.2/maven-dependency-tree-1.2.jar
(34 KB at 1125.0 KB/sec)
Downloaded: http://repo.cloudbees.com/content/repositories/central/org/codehaus/plexus/plexus-archiver/1.0/plexus-archiver-1.0.jar
(174 KB at 2790.5 KB/sec)
Downloaded: http://repo.cloudbees.com/content/repositories/central/org/codehaus/plexus/plexus-interpolation/1.13/plexus-interpolation-1.13.jar
(60 KB at 1419.7 KB/sec)
Downloaded: http://repo.cloudbees.com/content/repositories/central/org/codehaus/plexus/plexus-utils/2.1/plexus-utils-2.1.jar
(220 KB at 5621.5 KB/sec)
[WARNING] 
[WARNING] Some problems were encountered while building the effective model for org.apache.jclouds.chef:jclouds-chef:pom:1.8.0-SNAPSHOT
[WARNING] 'parent.relativePath' of POM org.apache.jclouds.chef:chef-project:1.8.0-SNAPSHOT
(<https://jclouds.ci.cloudbees.com/job/jclouds-chef/ws/project/pom.xml)> points at org.apache.jclouds.chef:jclouds-chef
instead of org.apache:apache, please verify your project structure @ org.apache.jclouds.chef:chef-project:1.8.0-SNAPSHOT,
<https://jclouds.ci.cloudbees.com/job/jclouds-chef/ws/project/pom.xml,> line 22, column
11
[WARNING] 
[WARNING] It is highly recommended to fix these problems because they threaten the stability
of your build.
[WARNING] 
[WARNING] For this reason, future Maven versions might no longer support building such malformed
projects.
[WARNING] 
Jan 1, 2014 10:38:35 AM org.apache.maven.cli.event.ExecutionEventLogger sessionStarted
INFO: ------------------------------------------------------------------------
Jan 1, 2014 10:38:35 AM org.apache.maven.cli.event.ExecutionEventLogger sessionStarted
INFO: Reactor Build Order:
Jan 1, 2014 10:38:35 AM org.apache.maven.cli.event.ExecutionEventLogger sessionStarted
INFO: 
Jan 1, 2014 10:38:35 AM org.apache.maven.cli.event.ExecutionEventLogger sessionStarted
INFO: Apache jclouds Chef :: Project
Jan 1, 2014 10:38:35 AM org.apache.maven.cli.event.ExecutionEventLogger sessionStarted
INFO: Apache jclouds Chef :: Core
Jan 1, 2014 10:38:35 AM org.apache.maven.cli.event.ExecutionEventLogger sessionStarted
INFO: Apache jclouds Chef :: Compute
Jan 1, 2014 10:38:35 AM org.apache.maven.cli.event.ExecutionEventLogger sessionStarted
INFO: Apache jclouds Chef :: Enterprise
Jan 1, 2014 10:38:35 AM org.apache.maven.cli.event.ExecutionEventLogger sessionStarted
INFO: Apache jclouds Chef
Jan 1, 2014 10:38:47 AM org.apache.maven.cli.event.ExecutionEventLogger projectStarted
INFO:                                                                         
Jan 1, 2014 10:38:47 AM org.apache.maven.cli.event.ExecutionEventLogger projectStarted
INFO: ------------------------------------------------------------------------
Jan 1, 2014 10:38:47 AM org.apache.maven.cli.event.ExecutionEventLogger projectStarted
INFO: Building Apache jclouds Chef :: Project 1.8.0-SNAPSHOT
Jan 1, 2014 10:38:47 AM org.apache.maven.cli.event.ExecutionEventLogger projectStarted
INFO: ------------------------------------------------------------------------
Downloading: https://repository-jclouds.forge.cloudbees.com/release/org/apache/maven/plugins/maven-jar-plugin/2.4/maven-jar-plugin-2.4.pom
Downloading: http://repo.cloudbees.com/content/repositories/central/org/apache/maven/plugins/maven-jar-plugin/2.4/maven-jar-plugin-2.4.pom
[WARNING] The POM for org.apache.maven.plugins:maven-jar-plugin:jar:2.4 is missing, no dependency
information available
Jan 1, 2014 10:38:51 AM org.apache.maven.cli.event.ExecutionEventLogger logReactorSummary
INFO: ------------------------------------------------------------------------
Jan 1, 2014 10:38:51 AM org.apache.maven.cli.event.ExecutionEventLogger logReactorSummary
INFO: Reactor Summary:
Jan 1, 2014 10:38:51 AM org.apache.maven.cli.event.ExecutionEventLogger logReactorSummary
INFO: 
Jan 1, 2014 10:38:51 AM org.apache.maven.cli.event.ExecutionEventLogger logReactorSummary
INFO: Apache jclouds Chef :: Project .................... FAILURE [13.205s]
Jan 1, 2014 10:38:51 AM org.apache.maven.cli.event.ExecutionEventLogger logReactorSummary
INFO: Apache jclouds Chef :: Core ....................... SKIPPED
Jan 1, 2014 10:38:51 AM org.apache.maven.cli.event.ExecutionEventLogger logReactorSummary
INFO: Apache jclouds Chef :: Compute .................... SKIPPED
Jan 1, 2014 10:38:51 AM org.apache.maven.cli.event.ExecutionEventLogger logReactorSummary
INFO: Apache jclouds Chef :: Enterprise ................. SKIPPED
Jan 1, 2014 10:38:51 AM org.apache.maven.cli.event.ExecutionEventLogger logReactorSummary
INFO: Apache jclouds Chef ............................... SKIPPED
Jan 1, 2014 10:38:51 AM org.apache.maven.cli.event.ExecutionEventLogger logResult
INFO: ------------------------------------------------------------------------
Jan 1, 2014 10:38:51 AM org.apache.maven.cli.event.ExecutionEventLogger logResult
INFO: BUILD FAILURE
Jan 1, 2014 10:38:51 AM org.apache.maven.cli.event.ExecutionEventLogger logStats
INFO: ------------------------------------------------------------------------
Jan 1, 2014 10:38:51 AM org.apache.maven.cli.event.ExecutionEventLogger logStats
INFO: Total time: 49.262s
Jan 1, 2014 10:38:51 AM org.apache.maven.cli.event.ExecutionEventLogger logStats
INFO: Finished at: Wed Jan 01 10:38:51 EST 2014
Jan 1, 2014 10:38:51 AM org.apache.maven.cli.event.ExecutionEventLogger logStats
INFO: Final Memory: 6M/28M
Jan 1, 2014 10:38:51 AM org.apache.maven.cli.event.ExecutionEventLogger sessionEnded
INFO: ------------------------------------------------------------------------
[JENKINS] Archiving <https://jclouds.ci.cloudbees.com/job/jclouds-chef/ws/pom.xml> to
/home/jclouds/hudson_home/jobs/jclouds-chef/modules/org.apache.jclouds.chef$jclouds-chef/builds/2014-01-01_15-37-52/archive/org.apache.jclouds.chef/jclouds-chef/1.8.0-SNAPSHOT/jclouds-chef-1.8.0-SNAPSHOT.pom
[JENKINS] Archiving <https://jclouds.ci.cloudbees.com/job/jclouds-chef/ws/enterprise/pom.xml>
to /home/jclouds/hudson_home/jobs/jclouds-chef/modules/org.apache.jclouds.provider$enterprisechef/builds/2014-01-01_15-37-52/archive/org.apache.jclouds.provider/enterprisechef/1.8.0-SNAPSHOT/enterprisechef-1.8.0-SNAPSHOT.pom
[JENKINS] Archiving <https://jclouds.ci.cloudbees.com/job/jclouds-chef/ws/compute/pom.xml>
to /home/jclouds/hudson_home/jobs/jclouds-chef/modules/org.apache.jclouds.chef$chef-compute/builds/2014-01-01_15-37-52/archive/org.apache.jclouds.chef/chef-compute/1.8.0-SNAPSHOT/chef-compute-1.8.0-SNAPSHOT.pom
[JENKINS] Archiving <https://jclouds.ci.cloudbees.com/job/jclouds-chef/ws/core/pom.xml>
to /home/jclouds/hudson_home/jobs/jclouds-chef/modules/org.apache.jclouds.api$chef/builds/2014-01-01_15-37-52/archive/org.apache.jclouds.api/chef/1.8.0-SNAPSHOT/chef-1.8.0-SNAPSHOT.pom
[JENKINS] Archiving <https://jclouds.ci.cloudbees.com/job/jclouds-chef/ws/project/pom.xml>
to /home/jclouds/hudson_home/jobs/jclouds-chef/modules/org.apache.jclouds.chef$chef-project/builds/2014-01-01_15-37-52/archive/org.apache.jclouds.chef/chef-project/1.8.0-SNAPSHOT/chef-project-1.8.0-SNAPSHOT.pom
[WARNING] The requested profile "src" could not be activated because it does not exist.
Waiting for Jenkins to finish collecting data
mavenExecutionResult exceptions not empty
message : Plugin org.apache.maven.plugins:maven-jar-plugin:2.4 or one of its dependencies
could not be resolved: Failed to read artifact descriptor for org.apache.maven.plugins:maven-jar-plugin:jar:2.4
cause : Failed to read artifact descriptor for org.apache.maven.plugins:maven-jar-plugin:jar:2.4
Stack trace : 
org.apache.maven.plugin.PluginResolutionException: Plugin org.apache.maven.plugins:maven-jar-plugin:2.4
or one of its dependencies could not be resolved: Failed to read artifact descriptor for org.apache.maven.plugins:maven-jar-plugin:jar:2.4
	at org.apache.maven.plugin.internal.DefaultPluginDependenciesResolver.resolve(DefaultPluginDependenciesResolver.java:129)
	at org.apache.maven.plugin.internal.DefaultMavenPluginManager.getPluginDescriptor(DefaultMavenPluginManager.java:142)
	at org.apache.maven.plugin.internal.DefaultMavenPluginManager.getMojoDescriptor(DefaultMavenPluginManager.java:261)
	at org.apache.maven.plugin.DefaultBuildPluginManager.getMojoDescriptor(DefaultBuildPluginManager.java:185)
	at org.apache.maven.lifecycle.internal.DefaultLifecycleExecutionPlanCalculator.calculateLifecycleMappings(DefaultLifecycleExecutionPlanCalculator.java:280)
	at org.apache.maven.lifecycle.internal.DefaultLifecycleExecutionPlanCalculator.calculateMojoExecutions(DefaultLifecycleExecutionPlanCalculator.java:193)
	at org.apache.maven.lifecycle.internal.DefaultLifecycleExecutionPlanCalculator.calculateExecutionPlan(DefaultLifecycleExecutionPlanCalculator.java:112)
	at org.apache.maven.lifecycle.internal.DefaultLifecycleExecutionPlanCalculator.calculateExecutionPlan(DefaultLifecycleExecutionPlanCalculator.java:129)
	at org.apache.maven.lifecycle.internal.BuilderCommon.resolveBuildPlan(BuilderCommon.java:92)
	at org.apache.maven.lifecycle.internal.LifecycleModuleBuilder.buildProject(LifecycleModuleBuilder.java:81)
	at org.apache.maven.lifecycle.internal.LifecycleModuleBuilder.buildProject(LifecycleModuleBuilder.java:59)
	at org.apache.maven.lifecycle.internal.LifecycleStarter.singleThreadedBuild(LifecycleStarter.java:183)
	at org.apache.maven.lifecycle.internal.LifecycleStarter.execute(LifecycleStarter.java:161)
	at org.apache.maven.DefaultMaven.doExecute(DefaultMaven.java:319)
	at org.apache.maven.DefaultMaven.execute(DefaultMaven.java:156)
	at org.jvnet.hudson.maven3.launcher.Maven3Launcher.main(Maven3Launcher.java:117)
	at sun.reflect.NativeMethodAccessorImpl.invoke0(Native Method)
	at sun.reflect.NativeMethodAccessorImpl.invoke(NativeMethodAccessorImpl.java:39)
	at sun.reflect.DelegatingMethodAccessorImpl.invoke(DelegatingMethodAccessorImpl.java:25)
	at java.lang.reflect.Method.invoke(Method.java:597)
	at org.codehaus.plexus.classworlds.launcher.Launcher.launchStandard(Launcher.java:329)
	at org.codehaus.plexus.classworlds.launcher.Launcher.launch(Launcher.java:239)
	at org.jvnet.hudson.maven3.agent.Maven3Main.launch(Maven3Main.java:178)
	at sun.reflect.NativeMethodAccessorImpl.invoke0(Native Method)
	at sun.reflect.NativeMethodAccessorImpl.invoke(NativeMethodAccessorImpl.java:39)
	at sun.reflect.DelegatingMethodAccessorImpl.invoke(DelegatingMethodAccessorImpl.java:25)
	at java.lang.reflect.Method.invoke(Method.java:597)
	at hudson.maven.Maven3Builder.call(Maven3Builder.java:129)
	at hudson.maven.Maven3Builder.call(Maven3Builder.java:67)
	at hudson.remoting.UserRequest.perform(UserRequest.java:118)
	at hudson.remoting.UserRequest.perform(UserRequest.java:48)
	at hudson.remoting.Request$2.run(Request.java:326)
	at hudson.remoting.InterceptingExecutorService$1.call(InterceptingExecutorService.java:72)
	at java.util.concurrent.FutureTask$Sync.innerRun(FutureTask.java:303)
	at java.util.concurrent.FutureTask.run(FutureTask.java:138)
	at java.util.concurrent.ThreadPoolExecutor$Worker.runTask(ThreadPoolExecutor.java:895)
	at java.util.concurrent.ThreadPoolExecutor$Worker.run(ThreadPoolExecutor.java:918)
	at java.lang.Thread.run(Thread.java:662)
Caused by: org.sonatype.aether.resolution.ArtifactDescriptorException: Failed to read artifact
descriptor for org.apache.maven.plugins:maven-jar-plugin:jar:2.4
	at org.apache.maven.repository.internal.DefaultArtifactDescriptorReader.loadPom(DefaultArtifactDescriptorReader.java:282)
	at org.apache.maven.repository.internal.DefaultArtifactDescriptorReader.readArtifactDescriptor(DefaultArtifactDescriptorReader.java:172)
	at org.sonatype.aether.impl.internal.DefaultRepositorySystem.readArtifactDescriptor(DefaultRepositorySystem.java:316)
	at org.apache.maven.plugin.internal.DefaultPluginDependenciesResolver.resolve(DefaultPluginDependenciesResolver.java:115)
	... 37 more
Caused by: org.sonatype.aether.resolution.ArtifactResolutionException: Could not find artifact
org.apache.maven.plugins:maven-jar-plugin:pom:2.4 in cloudbees-private-release-repository
(https://repository-jclouds.forge.cloudbees.com/release)
	at org.sonatype.aether.impl.internal.DefaultArtifactResolver.resolve(DefaultArtifactResolver.java:541)
	at org.sonatype.aether.impl.internal.DefaultArtifactResolver.resolveArtifacts(DefaultArtifactResolver.java:220)
	at org.sonatype.aether.impl.internal.DefaultArtifactResolver.resolveArtifact(DefaultArtifactResolver.java:197)
	at org.apache.maven.repository.internal.DefaultArtifactDescriptorReader.loadPom(DefaultArtifactDescriptorReader.java:267)
	... 40 more
Caused by: org.sonatype.aether.transfer.ArtifactNotFoundException: Could not find artifact
org.apache.maven.plugins:maven-jar-plugin:pom:2.4 in cloudbees-private-release-repository
(https://repository-jclouds.forge.cloudbees.com/release)
	at org.sonatype.aether.connector.wagon.WagonRepositoryConnector$4.wrap(WagonRepositoryConnector.java:945)
	at org.sonatype.aether.connector.wagon.WagonRepositoryConnector$4.wrap(WagonRepositoryConnector.java:940)
	at org.sonatype.aether.connector.wagon.WagonRepositoryConnector$GetTask.flush(WagonRepositoryConnector.java:695)
	at org.sonatype.aether.connector.wagon.WagonRepositoryConnector$GetTask.flush(WagonRepositoryConnector.java:689)
	at org.sonatype.aether.connector.wagon.WagonRepositoryConnector.get(WagonRepositoryConnector.java:445)
	at org.sonatype.aether.impl.internal.DefaultArtifactResolver.resolve(DefaultArtifactResolver.java:460)
	... 43 more
Sending e-mails to: dev@jclouds.apache.org
channel stopped

Mime
View raw message