jclouds-dev mailing list archives

Site index · List index
Message view « Date » · « Thread »
Top « Date » · « Thread »
From jenkins-no-re...@cloudbees.com
Subject Build failed in Jenkins: jclouds-chef #752
Date Thu, 02 Jan 2014 16:41:56 GMT
See <https://jclouds.ci.cloudbees.com/job/jclouds-chef/752/>

------------------------------------------
[...truncated 1879 lines...]
Downloading: http://repo.cloudbees.com/content/repositories/central/org/apache/maven/maven-plugin-api/2.0.9/maven-plugin-api-2.0.9.jar
Downloaded: http://repo.cloudbees.com/content/repositories/central/org/apache/maven/surefire/surefire-testng/2.12/surefire-testng-2.12.jar
(32 KB at 263.2 KB/sec)
Downloaded: http://repo.cloudbees.com/content/repositories/central/org/apache/maven/maven-artifact/2.0/maven-artifact-2.0.jar
(77 KB at 635.7 KB/sec)
Downloaded: http://repo.cloudbees.com/content/repositories/central/org/apache/maven/surefire/surefire-grouper/2.12/surefire-grouper-2.12.jar
(37 KB at 292.6 KB/sec)
Downloading: https://repository-jclouds.forge.cloudbees.com/release/org/apache/maven/maven-project/2.0.9/maven-project-2.0.9.jar
Downloading: https://repository-jclouds.forge.cloudbees.com/release/org/apache/maven/maven-settings/2.0.9/maven-settings-2.0.9.jar
Downloaded: http://repo.cloudbees.com/content/repositories/central/org/codehaus/plexus/plexus-utils/1.0.4/plexus-utils-1.0.4.jar
(160 KB at 1259.6 KB/sec)
Downloading: https://repository-jclouds.forge.cloudbees.com/release/org/apache/maven/maven-model/2.0.9/maven-model-2.0.9.jar
Downloading: https://repository-jclouds.forge.cloudbees.com/release/org/codehaus/plexus/plexus-container-default/1.0-alpha-9-stable-1/plexus-container-default-1.0-alpha-9-stable-1.jar
Downloaded: http://repo.cloudbees.com/content/repositories/central/org/apache/maven/maven-plugin-api/2.0.9/maven-plugin-api-2.0.9.jar
(13 KB at 179.9 KB/sec)
Downloading: https://repository-jclouds.forge.cloudbees.com/release/classworlds/classworlds/1.1/classworlds-1.1.jar
Downloading: http://repo.cloudbees.com/content/repositories/central/org/apache/maven/maven-project/2.0.9/maven-project-2.0.9.jar
Downloading: http://repo.cloudbees.com/content/repositories/central/org/apache/maven/maven-settings/2.0.9/maven-settings-2.0.9.jar
Downloading: http://repo.cloudbees.com/content/repositories/central/org/apache/maven/maven-model/2.0.9/maven-model-2.0.9.jar
Downloading: http://repo.cloudbees.com/content/repositories/central/org/codehaus/plexus/plexus-container-default/1.0-alpha-9-stable-1/plexus-container-default-1.0-alpha-9-stable-1.jar
Downloading: http://repo.cloudbees.com/content/repositories/central/classworlds/classworlds/1.1/classworlds-1.1.jar
Downloaded: http://repo.cloudbees.com/content/repositories/central/org/apache/maven/maven-model/2.0.9/maven-model-2.0.9.jar
(86 KB at 3411.0 KB/sec)
Downloaded: http://repo.cloudbees.com/content/repositories/central/classworlds/classworlds/1.1/classworlds-1.1.jar
(37 KB at 1607.3 KB/sec)
Downloading: https://repository-jclouds.forge.cloudbees.com/release/org/apache/maven/maven-profile/2.0.9/maven-profile-2.0.9.jar
Downloading: https://repository-jclouds.forge.cloudbees.com/release/org/apache/maven/maven-artifact-manager/2.0.9/maven-artifact-manager-2.0.9.jar
Downloaded: http://repo.cloudbees.com/content/repositories/central/org/apache/maven/maven-settings/2.0.9/maven-settings-2.0.9.jar
(48 KB at 1653.8 KB/sec)
Downloaded: http://repo.cloudbees.com/content/repositories/central/org/codehaus/plexus/plexus-container-default/1.0-alpha-9-stable-1/plexus-container-default-1.0-alpha-9-stable-1.jar
(190 KB at 6772.6 KB/sec)
Downloading: https://repository-jclouds.forge.cloudbees.com/release/org/apache/maven/maven-repository-metadata/2.0.9/maven-repository-metadata-2.0.9.jar
Downloading: https://repository-jclouds.forge.cloudbees.com/release/org/apache/maven/wagon/wagon-provider-api/1.0-beta-2/wagon-provider-api-1.0-beta-2.jar
Downloading: http://repo.cloudbees.com/content/repositories/central/org/apache/maven/maven-profile/2.0.9/maven-profile-2.0.9.jar
Downloading: http://repo.cloudbees.com/content/repositories/central/org/apache/maven/maven-artifact-manager/2.0.9/maven-artifact-manager-2.0.9.jar
Downloading: http://repo.cloudbees.com/content/repositories/central/org/apache/maven/maven-repository-metadata/2.0.9/maven-repository-metadata-2.0.9.jar
Downloading: http://repo.cloudbees.com/content/repositories/central/org/apache/maven/wagon/wagon-provider-api/1.0-beta-2/wagon-provider-api-1.0-beta-2.jar
Downloaded: http://repo.cloudbees.com/content/repositories/central/org/apache/maven/maven-project/2.0.9/maven-project-2.0.9.jar
(119 KB at 1918.2 KB/sec)
Downloading: https://repository-jclouds.forge.cloudbees.com/release/org/apache/maven/maven-plugin-registry/2.0.9/maven-plugin-registry-2.0.9.jar
Downloaded: http://repo.cloudbees.com/content/repositories/central/org/apache/maven/maven-artifact-manager/2.0.9/maven-artifact-manager-2.0.9.jar
(57 KB at 1765.0 KB/sec)
Downloaded: http://repo.cloudbees.com/content/repositories/central/org/apache/maven/wagon/wagon-provider-api/1.0-beta-2/wagon-provider-api-1.0-beta-2.jar
(46 KB at 1459.4 KB/sec)
Downloading: http://repo.cloudbees.com/content/repositories/central/org/apache/maven/maven-plugin-registry/2.0.9/maven-plugin-registry-2.0.9.jar
Downloading: https://repository-jclouds.forge.cloudbees.com/release/org/apache/maven/maven-plugin-parameter-documenter/2.0.9/maven-plugin-parameter-documenter-2.0.9.jar
Downloading: https://repository-jclouds.forge.cloudbees.com/release/org/apache/maven/maven-core/2.0.9/maven-core-2.0.9.jar
Downloaded: http://repo.cloudbees.com/content/repositories/central/org/apache/maven/maven-profile/2.0.9/maven-profile-2.0.9.jar
(35 KB at 1046.4 KB/sec)
Downloading: https://repository-jclouds.forge.cloudbees.com/release/org/apache/maven/maven-error-diagnostics/2.0.9/maven-error-diagnostics-2.0.9.jar
Downloading: http://repo.cloudbees.com/content/repositories/central/org/apache/maven/maven-plugin-parameter-documenter/2.0.9/maven-plugin-parameter-documenter-2.0.9.jar
Downloading: http://repo.cloudbees.com/content/repositories/central/org/apache/maven/maven-core/2.0.9/maven-core-2.0.9.jar
Downloading: http://repo.cloudbees.com/content/repositories/central/org/apache/maven/maven-error-diagnostics/2.0.9/maven-error-diagnostics-2.0.9.jar
Downloaded: http://repo.cloudbees.com/content/repositories/central/org/apache/maven/maven-repository-metadata/2.0.9/maven-repository-metadata-2.0.9.jar
(24 KB at 510.3 KB/sec)
Downloading: https://repository-jclouds.forge.cloudbees.com/release/org/apache/maven/maven-plugin-descriptor/2.0.9/maven-plugin-descriptor-2.0.9.jar
Downloading: http://repo.cloudbees.com/content/repositories/central/org/apache/maven/maven-plugin-descriptor/2.0.9/maven-plugin-descriptor-2.0.9.jar
Downloaded: http://repo.cloudbees.com/content/repositories/central/org/apache/maven/maven-plugin-registry/2.0.9/maven-plugin-registry-2.0.9.jar
(29 KB at 4.1 KB/sec)
Downloading: https://repository-jclouds.forge.cloudbees.com/release/org/apache/maven/maven-monitor/2.0.9/maven-monitor-2.0.9.jar
Downloaded: http://repo.cloudbees.com/content/repositories/central/org/apache/maven/maven-plugin-parameter-documenter/2.0.9/maven-plugin-parameter-documenter-2.0.9.jar
(21 KB at 3.0 KB/sec)
Downloading: https://repository-jclouds.forge.cloudbees.com/release/org/apache/maven/maven-toolchain/2.0.9/maven-toolchain-2.0.9.jar
Downloaded: http://repo.cloudbees.com/content/repositories/central/org/apache/maven/maven-error-diagnostics/2.0.9/maven-error-diagnostics-2.0.9.jar
(14 KB at 2.0 KB/sec)
Downloaded: http://repo.cloudbees.com/content/repositories/central/org/apache/maven/maven-core/2.0.9/maven-core-2.0.9.jar
(156 KB at 22.6 KB/sec)
Downloading: http://repo.cloudbees.com/content/repositories/central/org/apache/maven/maven-monitor/2.0.9/maven-monitor-2.0.9.jar
Downloading: http://repo.cloudbees.com/content/repositories/central/org/apache/maven/maven-toolchain/2.0.9/maven-toolchain-2.0.9.jar
Downloaded: http://repo.cloudbees.com/content/repositories/central/org/apache/maven/maven-plugin-descriptor/2.0.9/maven-plugin-descriptor-2.0.9.jar
(37 KB at 5.2 KB/sec)
Downloaded: http://repo.cloudbees.com/content/repositories/central/org/apache/maven/maven-toolchain/2.0.9/maven-toolchain-2.0.9.jar
(38 KB at 1545.1 KB/sec)
Downloaded: http://repo.cloudbees.com/content/repositories/central/org/apache/maven/maven-monitor/2.0.9/maven-monitor-2.0.9.jar
(11 KB at 386.2 KB/sec)

-------------------------------------------------------
 T E S T S
-------------------------------------------------------

Results :

Tests run: 0, Failures: 0, Errors: 0, Skipped: 0

Jan 2, 2014 11:41:20 AM org.apache.maven.cli.event.ExecutionEventLogger mojoStarted
INFO: 
Jan 2, 2014 11:41:20 AM org.apache.maven.cli.event.ExecutionEventLogger mojoStarted
INFO: --- maven-install-plugin:2.3.1:install (default-install) @ chef-project ---
Downloading: https://repository-jclouds.forge.cloudbees.com/release/org/codehaus/plexus/plexus-digest/1.0/plexus-digest-1.0.pom
Downloading: http://repo.cloudbees.com/content/repositories/central/org/codehaus/plexus/plexus-digest/1.0/plexus-digest-1.0.pom
Downloaded: http://repo.cloudbees.com/content/repositories/central/org/codehaus/plexus/plexus-digest/1.0/plexus-digest-1.0.pom
(2 KB at 94.0 KB/sec)
Downloading: https://repository-jclouds.forge.cloudbees.com/release/org/codehaus/plexus/plexus-components/1.1.7/plexus-components-1.1.7.pom
Downloading: http://repo.cloudbees.com/content/repositories/central/org/codehaus/plexus/plexus-components/1.1.7/plexus-components-1.1.7.pom
Downloaded: http://repo.cloudbees.com/content/repositories/central/org/codehaus/plexus/plexus-components/1.1.7/plexus-components-1.1.7.pom
(5 KB at 373.7 KB/sec)
Downloading: https://repository-jclouds.forge.cloudbees.com/release/org/codehaus/plexus/plexus-utils/2.0.5/plexus-utils-2.0.5.jar
Downloading: https://repository-jclouds.forge.cloudbees.com/release/org/codehaus/plexus/plexus-digest/1.0/plexus-digest-1.0.jar
Downloading: http://repo.cloudbees.com/content/repositories/central/org/codehaus/plexus/plexus-utils/2.0.5/plexus-utils-2.0.5.jar
Downloading: http://repo.cloudbees.com/content/repositories/central/org/codehaus/plexus/plexus-digest/1.0/plexus-digest-1.0.jar
Downloaded: http://repo.cloudbees.com/content/repositories/central/org/codehaus/plexus/plexus-digest/1.0/plexus-digest-1.0.jar
(12 KB at 1052.7 KB/sec)
Downloaded: http://repo.cloudbees.com/content/repositories/central/org/codehaus/plexus/plexus-utils/2.0.5/plexus-utils-2.0.5.jar
(218 KB at 13621.3 KB/sec)
[INFO] Installing <https://jclouds.ci.cloudbees.com/job/jclouds-chef/ws/project/pom.xml>
to <https://jclouds.ci.cloudbees.com/job/jclouds-chef/ws/.repository/org/apache/jclouds/chef/chef-project/1.8.0-SNAPSHOT/chef-project-1.8.0-SNAPSHOT.pom>
[INFO] Installing <https://jclouds.ci.cloudbees.com/job/jclouds-chef/ws/project/target/chef-project-1.8.0-SNAPSHOT-tests.jar>
to <https://jclouds.ci.cloudbees.com/job/jclouds-chef/ws/.repository/org/apache/jclouds/chef/chef-project/1.8.0-SNAPSHOT/chef-project-1.8.0-SNAPSHOT-tests.jar>
Jan 2, 2014 11:41:25 AM org.apache.maven.cli.event.ExecutionEventLogger mojoStarted
INFO: 
Jan 2, 2014 11:41:25 AM org.apache.maven.cli.event.ExecutionEventLogger mojoStarted
INFO: --- maven-deploy-plugin:2.7:deploy (default-deploy) @ chef-project ---
Downloading: https://repository-jclouds.forge.cloudbees.com/release/org/codehaus/plexus/plexus-utils/1.5.6/plexus-utils-1.5.6.jar
Downloading: http://repo.cloudbees.com/content/repositories/central/org/codehaus/plexus/plexus-utils/1.5.6/plexus-utils-1.5.6.jar
Downloaded: http://repo.cloudbees.com/content/repositories/central/org/codehaus/plexus/plexus-utils/1.5.6/plexus-utils-1.5.6.jar
(245 KB at 101.0 KB/sec)
Downloading: https://repository.apache.org/content/repositories/snapshots/org/apache/jclouds/chef/chef-project/1.8.0-SNAPSHOT/maven-metadata.xml
Downloaded: https://repository.apache.org/content/repositories/snapshots/org/apache/jclouds/chef/chef-project/1.8.0-SNAPSHOT/maven-metadata.xml
(827 B at 0.8 KB/sec)
Uploading: https://repository.apache.org/content/repositories/snapshots/org/apache/jclouds/chef/chef-project/1.8.0-SNAPSHOT/chef-project-1.8.0-20140102.164129-59.pom
Uploaded: https://repository.apache.org/content/repositories/snapshots/org/apache/jclouds/chef/chef-project/1.8.0-SNAPSHOT/chef-project-1.8.0-20140102.164129-59.pom
(15 KB at 13.2 KB/sec)
Downloading: https://repository.apache.org/content/repositories/snapshots/org/apache/jclouds/chef/chef-project/maven-metadata.xml
Downloaded: https://repository.apache.org/content/repositories/snapshots/org/apache/jclouds/chef/chef-project/maven-metadata.xml
(516 B at 1.0 KB/sec)
Uploading: https://repository.apache.org/content/repositories/snapshots/org/apache/jclouds/chef/chef-project/1.8.0-SNAPSHOT/maven-metadata.xml
Uploaded: https://repository.apache.org/content/repositories/snapshots/org/apache/jclouds/chef/chef-project/1.8.0-SNAPSHOT/maven-metadata.xml
(827 B at 1.2 KB/sec)
Uploading: https://repository.apache.org/content/repositories/snapshots/org/apache/jclouds/chef/chef-project/maven-metadata.xml
Uploaded: https://repository.apache.org/content/repositories/snapshots/org/apache/jclouds/chef/chef-project/maven-metadata.xml
(516 B at 0.8 KB/sec)
Uploading: https://repository.apache.org/content/repositories/snapshots/org/apache/jclouds/chef/chef-project/1.8.0-SNAPSHOT/chef-project-1.8.0-20140102.164129-59-tests.jar
Uploaded: https://repository.apache.org/content/repositories/snapshots/org/apache/jclouds/chef/chef-project/1.8.0-SNAPSHOT/chef-project-1.8.0-20140102.164129-59-tests.jar
(5 KB at 14.2 KB/sec)
Uploading: https://repository.apache.org/content/repositories/snapshots/org/apache/jclouds/chef/chef-project/1.8.0-SNAPSHOT/maven-metadata.xml
Uploaded: https://repository.apache.org/content/repositories/snapshots/org/apache/jclouds/chef/chef-project/1.8.0-SNAPSHOT/maven-metadata.xml
(827 B at 2.4 KB/sec)
Jan 2, 2014 11:41:43 AM org.apache.maven.cli.event.ExecutionEventLogger projectStarted
INFO:                                                                         
Jan 2, 2014 11:41:43 AM org.apache.maven.cli.event.ExecutionEventLogger projectStarted
INFO: ------------------------------------------------------------------------
Jan 2, 2014 11:41:43 AM org.apache.maven.cli.event.ExecutionEventLogger projectStarted
INFO: Building Apache jclouds Chef :: Core 1.8.0-SNAPSHOT
Jan 2, 2014 11:41:43 AM org.apache.maven.cli.event.ExecutionEventLogger projectStarted
INFO: ------------------------------------------------------------------------
Downloading: https://repository-jclouds.forge.cloudbees.com/release/org/apache/maven/plugins/maven-remote-resources-plugin/1.4/maven-remote-resources-plugin-1.4.pom
Downloading: http://repo.cloudbees.com/content/repositories/central/org/apache/maven/plugins/maven-remote-resources-plugin/1.4/maven-remote-resources-plugin-1.4.pom
[WARNING] The POM for org.apache.maven.plugins:maven-remote-resources-plugin:jar:1.4 is missing,
no dependency information available
Jan 2, 2014 11:41:51 AM org.apache.maven.cli.event.ExecutionEventLogger logReactorSummary
INFO: ------------------------------------------------------------------------
Jan 2, 2014 11:41:51 AM org.apache.maven.cli.event.ExecutionEventLogger logReactorSummary
INFO: Reactor Summary:
Jan 2, 2014 11:41:51 AM org.apache.maven.cli.event.ExecutionEventLogger logReactorSummary
INFO: 
Jan 2, 2014 11:41:51 AM org.apache.maven.cli.event.ExecutionEventLogger logReactorSummary
INFO: Apache jclouds Chef :: Project .................... SUCCESS [7:47.773s]
Jan 2, 2014 11:41:51 AM org.apache.maven.cli.event.ExecutionEventLogger logReactorSummary
INFO: Apache jclouds Chef :: Core ....................... FAILURE [4.025s]
Jan 2, 2014 11:41:51 AM org.apache.maven.cli.event.ExecutionEventLogger logReactorSummary
INFO: Apache jclouds Chef :: Compute .................... SKIPPED
Jan 2, 2014 11:41:51 AM org.apache.maven.cli.event.ExecutionEventLogger logReactorSummary
INFO: Apache jclouds Chef :: Enterprise ................. SKIPPED
Jan 2, 2014 11:41:51 AM org.apache.maven.cli.event.ExecutionEventLogger logReactorSummary
INFO: Apache jclouds Chef ............................... SKIPPED
Jan 2, 2014 11:41:51 AM org.apache.maven.cli.event.ExecutionEventLogger logResult
INFO: ------------------------------------------------------------------------
Jan 2, 2014 11:41:51 AM org.apache.maven.cli.event.ExecutionEventLogger logResult
INFO: BUILD FAILURE
Jan 2, 2014 11:41:51 AM org.apache.maven.cli.event.ExecutionEventLogger logStats
INFO: ------------------------------------------------------------------------
Jan 2, 2014 11:41:51 AM org.apache.maven.cli.event.ExecutionEventLogger logStats
INFO: Total time: 8:36.024s
Jan 2, 2014 11:41:51 AM org.apache.maven.cli.event.ExecutionEventLogger logStats
INFO: Finished at: Thu Jan 02 11:41:51 EST 2014
[Unloading class sun.reflect.GeneratedSerializationConstructorAccessor31]
[Unloading class sun.reflect.GeneratedSerializationConstructorAccessor37]
[Unloading class sun.reflect.GeneratedSerializationConstructorAccessor35]
[Unloading class sun.reflect.GeneratedSerializationConstructorAccessor34]
[Unloading class sun.reflect.GeneratedSerializationConstructorAccessor48]
[Unloading class sun.reflect.GeneratedSerializationConstructorAccessor51]
[Unloading class sun.reflect.GeneratedSerializationConstructorAccessor43]
[Unloading class sun.reflect.GeneratedSerializationConstructorAccessor53]
[Unloading class sun.reflect.GeneratedSerializationConstructorAccessor52]
[Unloading class sun.reflect.GeneratedMethodAccessor7]
[Unloading class sun.reflect.GeneratedSerializationConstructorAccessor47]
[Unloading class sun.reflect.GeneratedSerializationConstructorAccessor40]
[Unloading class sun.reflect.GeneratedSerializationConstructorAccessor44]
[Unloading class sun.reflect.GeneratedSerializationConstructorAccessor36]
[Unloading class sun.reflect.GeneratedSerializationConstructorAccessor26]
[Unloading class sun.reflect.GeneratedSerializationConstructorAccessor29]
[Unloading class sun.reflect.GeneratedSerializationConstructorAccessor49]
[Unloading class sun.reflect.GeneratedSerializationConstructorAccessor57]
[Unloading class sun.reflect.GeneratedSerializationConstructorAccessor41]
[Unloading class sun.reflect.GeneratedSerializationConstructorAccessor54]
[Unloading class sun.reflect.GeneratedSerializationConstructorAccessor1]
[Unloading class sun.reflect.GeneratedSerializationConstructorAccessor50]
[Unloading class sun.reflect.GeneratedSerializationConstructorAccessor30]
[Unloading class sun.reflect.GeneratedSerializationConstructorAccessor59]
[Unloading class sun.reflect.GeneratedSerializationConstructorAccessor33]
[Unloading class sun.reflect.GeneratedSerializationConstructorAccessor39]
[Unloading class sun.reflect.GeneratedSerializationConstructorAccessor60]
[Unloading class sun.reflect.GeneratedSerializationConstructorAccessor58]
[Unloading class sun.reflect.GeneratedConstructorAccessor6]
[Unloading class sun.reflect.GeneratedSerializationConstructorAccessor38]
[Unloading class sun.reflect.GeneratedSerializationConstructorAccessor55]
[Unloading class sun.reflect.GeneratedSerializationConstructorAccessor42]
[Unloading class sun.reflect.GeneratedSerializationConstructorAccessor45]
Jan 2, 2014 11:41:51 AM org.apache.maven.cli.event.ExecutionEventLogger logStats
INFO: Final Memory: 17M/62M
Jan 2, 2014 11:41:51 AM org.apache.maven.cli.event.ExecutionEventLogger sessionEnded
INFO: ------------------------------------------------------------------------
[JENKINS] Archiving <https://jclouds.ci.cloudbees.com/job/jclouds-chef/ws/pom.xml> to
/home/jclouds/hudson_home/jobs/jclouds-chef/modules/org.apache.jclouds.chef$jclouds-chef/builds/2014-01-02_16-33-07/archive/org.apache.jclouds.chef/jclouds-chef/1.8.0-SNAPSHOT/jclouds-chef-1.8.0-SNAPSHOT.pom
[JENKINS] Archiving <https://jclouds.ci.cloudbees.com/job/jclouds-chef/ws/enterprise/pom.xml>
to /home/jclouds/hudson_home/jobs/jclouds-chef/modules/org.apache.jclouds.provider$enterprisechef/builds/2014-01-02_16-33-07/archive/org.apache.jclouds.provider/enterprisechef/1.8.0-SNAPSHOT/enterprisechef-1.8.0-SNAPSHOT.pom
[JENKINS] Archiving <https://jclouds.ci.cloudbees.com/job/jclouds-chef/ws/compute/pom.xml>
to /home/jclouds/hudson_home/jobs/jclouds-chef/modules/org.apache.jclouds.chef$chef-compute/builds/2014-01-02_16-33-07/archive/org.apache.jclouds.chef/chef-compute/1.8.0-SNAPSHOT/chef-compute-1.8.0-SNAPSHOT.pom
[JENKINS] Archiving <https://jclouds.ci.cloudbees.com/job/jclouds-chef/ws/core/pom.xml>
to /home/jclouds/hudson_home/jobs/jclouds-chef/modules/org.apache.jclouds.api$chef/builds/2014-01-02_16-33-07/archive/org.apache.jclouds.api/chef/1.8.0-SNAPSHOT/chef-1.8.0-SNAPSHOT.pom
[JENKINS] Archiving <https://jclouds.ci.cloudbees.com/job/jclouds-chef/ws/project/pom.xml>
to /home/jclouds/hudson_home/jobs/jclouds-chef/modules/org.apache.jclouds.chef$chef-project/builds/2014-01-02_16-33-07/archive/org.apache.jclouds.chef/chef-project/1.8.0-SNAPSHOT/chef-project-1.8.0-SNAPSHOT.pom
[JENKINS] Archiving <https://jclouds.ci.cloudbees.com/job/jclouds-chef/ws/project/target/chef-project-1.8.0-SNAPSHOT-tests.jar>
to /home/jclouds/hudson_home/jobs/jclouds-chef/modules/org.apache.jclouds.chef$chef-project/builds/2014-01-02_16-33-07/archive/org.apache.jclouds.chef/chef-project/1.8.0-20140102.164129-59/chef-project-1.8.0-20140102.164129-59-tests.jar
[WARNING] The requested profile "src" could not be activated because it does not exist.
Waiting for Jenkins to finish collecting data
mavenExecutionResult exceptions not empty
message : Plugin org.apache.maven.plugins:maven-remote-resources-plugin:1.4 or one of its
dependencies could not be resolved: Failed to read artifact descriptor for org.apache.maven.plugins:maven-remote-resources-plugin:jar:1.4
cause : Failed to read artifact descriptor for org.apache.maven.plugins:maven-remote-resources-plugin:jar:1.4
Stack trace : 
org.apache.maven.plugin.PluginResolutionException: Plugin org.apache.maven.plugins:maven-remote-resources-plugin:1.4
or one of its dependencies could not be resolved: Failed to read artifact descriptor for org.apache.maven.plugins:maven-remote-resources-plugin:jar:1.4
	at org.apache.maven.plugin.internal.DefaultPluginDependenciesResolver.resolve(DefaultPluginDependenciesResolver.java:129)
	at org.apache.maven.plugin.internal.DefaultMavenPluginManager.getPluginDescriptor(DefaultMavenPluginManager.java:142)
	at org.apache.maven.plugin.internal.DefaultMavenPluginManager.getMojoDescriptor(DefaultMavenPluginManager.java:261)
	at org.apache.maven.plugin.DefaultBuildPluginManager.getMojoDescriptor(DefaultBuildPluginManager.java:185)
	at org.apache.maven.lifecycle.internal.DefaultLifecycleExecutionPlanCalculator.calculateLifecycleMappings(DefaultLifecycleExecutionPlanCalculator.java:280)
	at org.apache.maven.lifecycle.internal.DefaultLifecycleExecutionPlanCalculator.calculateMojoExecutions(DefaultLifecycleExecutionPlanCalculator.java:193)
	at org.apache.maven.lifecycle.internal.DefaultLifecycleExecutionPlanCalculator.calculateExecutionPlan(DefaultLifecycleExecutionPlanCalculator.java:112)
	at org.apache.maven.lifecycle.internal.DefaultLifecycleExecutionPlanCalculator.calculateExecutionPlan(DefaultLifecycleExecutionPlanCalculator.java:129)
	at org.apache.maven.lifecycle.internal.BuilderCommon.resolveBuildPlan(BuilderCommon.java:92)
	at org.apache.maven.lifecycle.internal.LifecycleModuleBuilder.buildProject(LifecycleModuleBuilder.java:81)
	at org.apache.maven.lifecycle.internal.LifecycleModuleBuilder.buildProject(LifecycleModuleBuilder.java:59)
	at org.apache.maven.lifecycle.internal.LifecycleStarter.singleThreadedBuild(LifecycleStarter.java:183)
	at org.apache.maven.lifecycle.internal.LifecycleStarter.execute(LifecycleStarter.java:161)
	at org.apache.maven.DefaultMaven.doExecute(DefaultMaven.java:319)
	at org.apache.maven.DefaultMaven.execute(DefaultMaven.java:156)
	at org.jvnet.hudson.maven3.launcher.Maven3Launcher.main(Maven3Launcher.java:117)
	at sun.reflect.NativeMethodAccessorImpl.invoke0(Native Method)
	at sun.reflect.NativeMethodAccessorImpl.invoke(NativeMethodAccessorImpl.java:39)
	at sun.reflect.DelegatingMethodAccessorImpl.invoke(DelegatingMethodAccessorImpl.java:25)
	at java.lang.reflect.Method.invoke(Method.java:597)
	at org.codehaus.plexus.classworlds.launcher.Launcher.launchStandard(Launcher.java:329)
	at org.codehaus.plexus.classworlds.launcher.Launcher.launch(Launcher.java:239)
	at org.jvnet.hudson.maven3.agent.Maven3Main.launch(Maven3Main.java:178)
	at sun.reflect.NativeMethodAccessorImpl.invoke0(Native Method)
	at sun.reflect.NativeMethodAccessorImpl.invoke(NativeMethodAccessorImpl.java:39)
	at sun.reflect.DelegatingMethodAccessorImpl.invoke(DelegatingMethodAccessorImpl.java:25)
	at java.lang.reflect.Method.invoke(Method.java:597)
	at hudson.maven.Maven3Builder.call(Maven3Builder.java:129)
	at hudson.maven.Maven3Builder.call(Maven3Builder.java:67)
	at hudson.remoting.UserRequest.perform(UserRequest.java:118)
	at hudson.remoting.UserRequest.perform(UserRequest.java:48)
	at hudson.remoting.Request$2.run(Request.java:326)
	at hudson.remoting.InterceptingExecutorService$1.call(InterceptingExecutorService.java:72)
	at java.util.concurrent.FutureTask$Sync.innerRun(FutureTask.java:303)
	at java.util.concurrent.FutureTask.run(FutureTask.java:138)
	at java.util.concurrent.ThreadPoolExecutor$Worker.runTask(ThreadPoolExecutor.java:895)
	at java.util.concurrent.ThreadPoolExecutor$Worker.run(ThreadPoolExecutor.java:918)
	at java.lang.Thread.run(Thread.java:662)
Caused by: org.sonatype.aether.resolution.ArtifactDescriptorException: Failed to read artifact
descriptor for org.apache.maven.plugins:maven-remote-resources-plugin:jar:1.4
	at org.apache.maven.repository.internal.DefaultArtifactDescriptorReader.loadPom(DefaultArtifactDescriptorReader.java:282)
	at org.apache.maven.repository.internal.DefaultArtifactDescriptorReader.readArtifactDescriptor(DefaultArtifactDescriptorReader.java:172)
	at org.sonatype.aether.impl.internal.DefaultRepositorySystem.readArtifactDescriptor(DefaultRepositorySystem.java:316)
	at org.apache.maven.plugin.internal.DefaultPluginDependenciesResolver.resolve(DefaultPluginDependenciesResolver.java:115)
	... 37 more
Caused by: org.sonatype.aether.resolution.ArtifactResolutionException: Could not find artifact
org.apache.maven.plugins:maven-remote-resources-plugin:pom:1.4 in cloudbees-private-release-repository
(https://repository-jclouds.forge.cloudbees.com/release)
	at org.sonatype.aether.impl.internal.DefaultArtifactResolver.resolve(DefaultArtifactResolver.java:541)
	at org.sonatype.aether.impl.internal.DefaultArtifactResolver.resolveArtifacts(DefaultArtifactResolver.java:220)
	at org.sonatype.aether.impl.internal.DefaultArtifactResolver.resolveArtifact(DefaultArtifactResolver.java:197)
	at org.apache.maven.repository.internal.DefaultArtifactDescriptorReader.loadPom(DefaultArtifactDescriptorReader.java:267)
	... 40 more
Caused by: org.sonatype.aether.transfer.ArtifactNotFoundException: Could not find artifact
org.apache.maven.plugins:maven-remote-resources-plugin:pom:1.4 in cloudbees-private-release-repository
(https://repository-jclouds.forge.cloudbees.com/release)
	at org.sonatype.aether.connector.wagon.WagonRepositoryConnector$4.wrap(WagonRepositoryConnector.java:945)
	at org.sonatype.aether.connector.wagon.WagonRepositoryConnector$4.wrap(WagonRepositoryConnector.java:940)
	at org.sonatype.aether.connector.wagon.WagonRepositoryConnector$GetTask.flush(WagonRepositoryConnector.java:695)
	at org.sonatype.aether.connector.wagon.WagonRepositoryConnector$GetTask.flush(WagonRepositoryConnector.java:689)
	at org.sonatype.aether.connector.wagon.WagonRepositoryConnector.get(WagonRepositoryConnector.java:445)
	at org.sonatype.aether.impl.internal.DefaultArtifactResolver.resolve(DefaultArtifactResolver.java:460)
	... 43 more
Sending e-mails to: dev@jclouds.apache.org
channel stopped

Mime
View raw message