jclouds-dev mailing list archives

Site index · List index
Message view « Date » · « Thread »
Top « Date » · « Thread »
From jenkins-no-re...@cloudbees.com
Subject Build failed in Jenkins: jclouds-karaf #512
Date Wed, 01 Jan 2014 20:56:29 GMT
See <https://jclouds.ci.cloudbees.com/job/jclouds-karaf/512/>

------------------------------------------
[...truncated 63 lines...]
Downloaded: http://repo.cloudbees.com/content/repositories/central/org/apache/maven/maven-profile/2.0.8/maven-profile-2.0.8.pom
(2 KB at 153.0 KB/sec)
Downloading: https://repository-jclouds.forge.cloudbees.com/release/org/apache/maven/maven-artifact-manager/2.0.8/maven-artifact-manager-2.0.8.pom
Downloading: http://repo.cloudbees.com/content/repositories/central/org/apache/maven/maven-artifact-manager/2.0.8/maven-artifact-manager-2.0.8.pom
Downloaded: http://repo.cloudbees.com/content/repositories/central/org/apache/maven/maven-artifact-manager/2.0.8/maven-artifact-manager-2.0.8.pom
(3 KB at 164.8 KB/sec)
Downloading: https://repository-jclouds.forge.cloudbees.com/release/org/apache/maven/maven-repository-metadata/2.0.8/maven-repository-metadata-2.0.8.pom
Downloading: http://repo.cloudbees.com/content/repositories/central/org/apache/maven/maven-repository-metadata/2.0.8/maven-repository-metadata-2.0.8.pom
Downloaded: http://repo.cloudbees.com/content/repositories/central/org/apache/maven/maven-repository-metadata/2.0.8/maven-repository-metadata-2.0.8.pom
(2 KB at 132.6 KB/sec)
Downloading: https://repository-jclouds.forge.cloudbees.com/release/org/apache/maven/maven-artifact/2.0.8/maven-artifact-2.0.8.pom
Downloading: http://repo.cloudbees.com/content/repositories/central/org/apache/maven/maven-artifact/2.0.8/maven-artifact-2.0.8.pom
Downloaded: http://repo.cloudbees.com/content/repositories/central/org/apache/maven/maven-artifact/2.0.8/maven-artifact-2.0.8.pom
(2 KB at 112.9 KB/sec)
Downloading: https://repository-jclouds.forge.cloudbees.com/release/org/apache/maven/maven-plugin-registry/2.0.8/maven-plugin-registry-2.0.8.pom
Downloading: http://repo.cloudbees.com/content/repositories/central/org/apache/maven/maven-plugin-registry/2.0.8/maven-plugin-registry-2.0.8.pom
Downloaded: http://repo.cloudbees.com/content/repositories/central/org/apache/maven/maven-plugin-registry/2.0.8/maven-plugin-registry-2.0.8.pom
(2 KB at 195.2 KB/sec)
Downloading: https://repository-jclouds.forge.cloudbees.com/release/org/apache/maven/wagon/wagon-provider-api/1.0-beta-2/wagon-provider-api-1.0-beta-2.pom
Downloading: http://repo.cloudbees.com/content/repositories/central/org/apache/maven/wagon/wagon-provider-api/1.0-beta-2/wagon-provider-api-1.0-beta-2.pom
Downloaded: http://repo.cloudbees.com/content/repositories/central/org/apache/maven/wagon/wagon-provider-api/1.0-beta-2/wagon-provider-api-1.0-beta-2.pom
(680 B at 36.9 KB/sec)
Downloading: https://repository-jclouds.forge.cloudbees.com/release/org/apache/maven/wagon/wagon/1.0-beta-2/wagon-1.0-beta-2.pom
Downloading: http://repo.cloudbees.com/content/repositories/central/org/apache/maven/wagon/wagon/1.0-beta-2/wagon-1.0-beta-2.pom
Downloaded: http://repo.cloudbees.com/content/repositories/central/org/apache/maven/wagon/wagon/1.0-beta-2/wagon-1.0-beta-2.pom
(6 KB at 410.3 KB/sec)
Downloading: https://repository-jclouds.forge.cloudbees.com/release/org/codehaus/plexus/plexus-utils/1.4.7/plexus-utils-1.4.7.pom
Downloading: http://repo.cloudbees.com/content/repositories/central/org/codehaus/plexus/plexus-utils/1.4.7/plexus-utils-1.4.7.pom
Downloaded: http://repo.cloudbees.com/content/repositories/central/org/codehaus/plexus/plexus-utils/1.4.7/plexus-utils-1.4.7.pom
(3 KB at 51.4 KB/sec)
Downloading: https://repository-jclouds.forge.cloudbees.com/release/org/apache/felix/maven-bundle-plugin/2.1.0/maven-bundle-plugin-2.1.0.jar
Downloading: https://repository-jclouds.forge.cloudbees.com/release/biz/aQute/bndlib/0.0.357/bndlib-0.0.357.jar
Downloading: https://repository-jclouds.forge.cloudbees.com/release/net/sf/kxml/kxml2/2.2.2/kxml2-2.2.2.jar
Downloading: https://repository-jclouds.forge.cloudbees.com/release/xmlpull/xmlpull/1.1.3.1/xmlpull-1.1.3.1.jar
Downloading: https://repository-jclouds.forge.cloudbees.com/release/org/apache/felix/org.apache.felix.bundlerepository/1.6.2/org.apache.felix.bundlerepository-1.6.2.jar
Downloading: https://repository-jclouds.forge.cloudbees.com/release/org/osgi/org.osgi.core/4.1.0/org.osgi.core-4.1.0.jar
Downloading: https://repository-jclouds.forge.cloudbees.com/release/org/easymock/easymock/2.4/easymock-2.4.jar
Downloading: https://repository-jclouds.forge.cloudbees.com/release/org/apache/felix/org.osgi.core/1.0.0/org.osgi.core-1.0.0.jar
Downloading: https://repository-jclouds.forge.cloudbees.com/release/org/apache/felix/org.osgi.service.obr/1.0.1/org.osgi.service.obr-1.0.1.jar
Downloading: https://repository-jclouds.forge.cloudbees.com/release/org/apache/maven/maven-archiver/2.2/maven-archiver-2.2.jar
Downloading: https://repository-jclouds.forge.cloudbees.com/release/org/apache/maven/shared/maven-dependency-tree/1.2/maven-dependency-tree-1.2.jar
Downloading: https://repository-jclouds.forge.cloudbees.com/release/junit/junit/3.8.1/junit-3.8.1.jar
Downloading: https://repository-jclouds.forge.cloudbees.com/release/org/codehaus/plexus/plexus-archiver/1.0-alpha-7/plexus-archiver-1.0-alpha-7.jar
Downloading: https://repository-jclouds.forge.cloudbees.com/release/org/codehaus/plexus/plexus-utils/1.4.7/plexus-utils-1.4.7.jar
Downloading: http://repo.cloudbees.com/content/repositories/central/org/apache/felix/maven-bundle-plugin/2.1.0/maven-bundle-plugin-2.1.0.jar
Downloading: http://repo.cloudbees.com/content/repositories/central/biz/aQute/bndlib/0.0.357/bndlib-0.0.357.jar
Downloading: http://repo.cloudbees.com/content/repositories/central/net/sf/kxml/kxml2/2.2.2/kxml2-2.2.2.jar
Downloading: http://repo.cloudbees.com/content/repositories/central/xmlpull/xmlpull/1.1.3.1/xmlpull-1.1.3.1.jar
Downloading: http://repo.cloudbees.com/content/repositories/central/org/apache/felix/org.apache.felix.bundlerepository/1.6.2/org.apache.felix.bundlerepository-1.6.2.jar
Downloaded: http://repo.cloudbees.com/content/repositories/central/net/sf/kxml/kxml2/2.2.2/kxml2-2.2.2.jar
(43 KB at 1364.2 KB/sec)
Downloading: http://repo.cloudbees.com/content/repositories/central/org/osgi/org.osgi.core/4.1.0/org.osgi.core-4.1.0.jar
Downloaded: http://repo.cloudbees.com/content/repositories/central/org/apache/felix/maven-bundle-plugin/2.1.0/maven-bundle-plugin-2.1.0.jar
(130 KB at 3405.0 KB/sec)
Downloading: http://repo.cloudbees.com/content/repositories/central/org/easymock/easymock/2.4/easymock-2.4.jar
Downloaded: http://repo.cloudbees.com/content/repositories/central/org/apache/felix/org.apache.felix.bundlerepository/1.6.2/org.apache.felix.bundlerepository-1.6.2.jar
(147 KB at 3674.8 KB/sec)
Downloading: http://repo.cloudbees.com/content/repositories/central/org/apache/felix/org.osgi.core/1.0.0/org.osgi.core-1.0.0.jar
Downloaded: http://repo.cloudbees.com/content/repositories/central/biz/aQute/bndlib/0.0.357/bndlib-0.0.357.jar
(273 KB at 5675.5 KB/sec)
Downloading: http://repo.cloudbees.com/content/repositories/central/org/apache/felix/org.osgi.service.obr/1.0.1/org.osgi.service.obr-1.0.1.jar
Downloaded: http://repo.cloudbees.com/content/repositories/central/org/easymock/easymock/2.4/easymock-2.4.jar
(80 KB at 4952.0 KB/sec)
Downloading: http://repo.cloudbees.com/content/repositories/central/org/apache/maven/maven-archiver/2.2/maven-archiver-2.2.jar
Downloaded: http://repo.cloudbees.com/content/repositories/central/org/osgi/org.osgi.core/4.1.0/org.osgi.core-4.1.0.jar
(160 KB at 5701.2 KB/sec)
Downloading: http://repo.cloudbees.com/content/repositories/central/org/apache/maven/shared/maven-dependency-tree/1.2/maven-dependency-tree-1.2.jar
Downloaded: http://repo.cloudbees.com/content/repositories/central/org/apache/felix/org.osgi.service.obr/1.0.1/org.osgi.service.obr-1.0.1.jar
(11 KB at 573.2 KB/sec)
Downloading: http://repo.cloudbees.com/content/repositories/central/junit/junit/3.8.1/junit-3.8.1.jar
Downloaded: http://repo.cloudbees.com/content/repositories/central/org/apache/felix/org.osgi.core/1.0.0/org.osgi.core-1.0.0.jar
(60 KB at 2203.7 KB/sec)
Downloading: http://repo.cloudbees.com/content/repositories/central/org/codehaus/plexus/plexus-archiver/1.0-alpha-7/plexus-archiver-1.0-alpha-7.jar
Downloaded: http://repo.cloudbees.com/content/repositories/central/org/apache/maven/shared/maven-dependency-tree/1.2/maven-dependency-tree-1.2.jar
(34 KB at 1298.0 KB/sec)
Downloading: http://repo.cloudbees.com/content/repositories/central/org/codehaus/plexus/plexus-utils/1.4.7/plexus-utils-1.4.7.jar
Downloaded: http://repo.cloudbees.com/content/repositories/central/org/apache/maven/maven-archiver/2.2/maven-archiver-2.2.jar
(10 KB at 315.7 KB/sec)
Downloaded: http://repo.cloudbees.com/content/repositories/central/org/codehaus/plexus/plexus-archiver/1.0-alpha-7/plexus-archiver-1.0-alpha-7.jar
(139 KB at 6935.4 KB/sec)
Downloaded: http://repo.cloudbees.com/content/repositories/central/junit/junit/3.8.1/junit-3.8.1.jar
(119 KB at 4926.4 KB/sec)
Downloaded: http://repo.cloudbees.com/content/repositories/central/org/codehaus/plexus/plexus-utils/1.4.7/plexus-utils-1.4.7.jar
(199 KB at 13247.5 KB/sec)
Downloaded: http://repo.cloudbees.com/content/repositories/central/xmlpull/xmlpull/1.1.3.1/xmlpull-1.1.3.1.jar
(8 KB at 1.1 KB/sec)
[WARNING] 
[WARNING] Some problems were encountered while building the effective model for org.apache.jclouds.karaf:commands:bundle:1.8.0-SNAPSHOT
[WARNING] 'dependencies.dependency.(groupId:artifactId:type:classifier)' must be unique: org.apache.jclouds.driver:jclouds-log4j:jar
-> duplicate declaration of version (?) @ line 133, column 17
[WARNING] 
[WARNING] It is highly recommended to fix these problems because they threaten the stability
of your build.
[WARNING] 
[WARNING] For this reason, future Maven versions might no longer support building such malformed
projects.
[WARNING] 
Jan 1, 2014 3:54:47 PM org.apache.maven.cli.event.ExecutionEventLogger sessionStarted
INFO: ------------------------------------------------------------------------
Jan 1, 2014 3:54:47 PM org.apache.maven.cli.event.ExecutionEventLogger sessionStarted
INFO: Reactor Build Order:
Jan 1, 2014 3:54:47 PM org.apache.maven.cli.event.ExecutionEventLogger sessionStarted
INFO: 
Jan 1, 2014 3:54:47 PM org.apache.maven.cli.event.ExecutionEventLogger sessionStarted
INFO: Apache jclouds :: Karaf
Jan 1, 2014 3:54:47 PM org.apache.maven.cli.event.ExecutionEventLogger sessionStarted
INFO: jclouds :: Karaf :: Core
Jan 1, 2014 3:54:47 PM org.apache.maven.cli.event.ExecutionEventLogger sessionStarted
INFO: jclouds :: Karaf :: Utils
Jan 1, 2014 3:54:47 PM org.apache.maven.cli.event.ExecutionEventLogger sessionStarted
INFO: jclouds :: Karaf :: Recipe
Jan 1, 2014 3:54:47 PM org.apache.maven.cli.event.ExecutionEventLogger sessionStarted
INFO: jclouds :: Karaf :: Cache
Jan 1, 2014 3:54:47 PM org.apache.maven.cli.event.ExecutionEventLogger sessionStarted
INFO: jclouds :: Karaf :: Services
Jan 1, 2014 3:54:47 PM org.apache.maven.cli.event.ExecutionEventLogger sessionStarted
INFO: jclouds :: Karaf :: Commands
Jan 1, 2014 3:54:47 PM org.apache.maven.cli.event.ExecutionEventLogger sessionStarted
INFO: jclouds :: Karaf :: URL Handler
Jan 1, 2014 3:54:47 PM org.apache.maven.cli.event.ExecutionEventLogger sessionStarted
INFO: jclouds :: Karaf :: Chef
Jan 1, 2014 3:54:47 PM org.apache.maven.cli.event.ExecutionEventLogger sessionStarted
INFO: jclouds :: Karaf :: Chef :: Core
Jan 1, 2014 3:54:47 PM org.apache.maven.cli.event.ExecutionEventLogger sessionStarted
INFO: jclouds :: Karaf :: Chef :: Services
Jan 1, 2014 3:54:47 PM org.apache.maven.cli.event.ExecutionEventLogger sessionStarted
INFO: jclouds :: Karaf :: Chef :: Commands
Jan 1, 2014 3:54:47 PM org.apache.maven.cli.event.ExecutionEventLogger sessionStarted
INFO: jclouds :: Karaf :: Chef :: Cache
Jan 1, 2014 3:54:47 PM org.apache.maven.cli.event.ExecutionEventLogger sessionStarted
INFO: jclouds :: Karaf :: Feature
Jan 1, 2014 3:54:47 PM org.apache.maven.cli.event.ExecutionEventLogger sessionStarted
INFO: jclouds :: Karaf :: Integration Tests
Jan 1, 2014 3:55:09 PM org.apache.maven.cli.event.ExecutionEventLogger projectStarted
INFO:                                                                         
Jan 1, 2014 3:55:09 PM org.apache.maven.cli.event.ExecutionEventLogger projectStarted
INFO: ------------------------------------------------------------------------
Jan 1, 2014 3:55:09 PM org.apache.maven.cli.event.ExecutionEventLogger projectStarted
INFO: Building Apache jclouds :: Karaf 1.8.0-SNAPSHOT
Jan 1, 2014 3:55:09 PM org.apache.maven.cli.event.ExecutionEventLogger projectStarted
INFO: ------------------------------------------------------------------------
Downloading: https://repository-jclouds.forge.cloudbees.com/release/org/apache/maven/plugins/maven-remote-resources-plugin/1.4/maven-remote-resources-plugin-1.4.pom
Downloading: http://repo.cloudbees.com/content/repositories/central/org/apache/maven/plugins/maven-remote-resources-plugin/1.4/maven-remote-resources-plugin-1.4.pom
[WARNING] The POM for org.apache.maven.plugins:maven-remote-resources-plugin:jar:1.4 is missing,
no dependency information available
Jan 1, 2014 3:55:52 PM org.apache.maven.cli.event.ExecutionEventLogger logReactorSummary
INFO: ------------------------------------------------------------------------
Jan 1, 2014 3:55:52 PM org.apache.maven.cli.event.ExecutionEventLogger logReactorSummary
INFO: Reactor Summary:
Jan 1, 2014 3:55:52 PM org.apache.maven.cli.event.ExecutionEventLogger logReactorSummary
INFO: 
Jan 1, 2014 3:55:52 PM org.apache.maven.cli.event.ExecutionEventLogger logReactorSummary
INFO: Apache jclouds :: Karaf ........................... FAILURE [23.746s]
Jan 1, 2014 3:55:52 PM org.apache.maven.cli.event.ExecutionEventLogger logReactorSummary
INFO: jclouds :: Karaf :: Core .......................... SKIPPED
Jan 1, 2014 3:55:52 PM org.apache.maven.cli.event.ExecutionEventLogger logReactorSummary
INFO: jclouds :: Karaf :: Utils ......................... SKIPPED
Jan 1, 2014 3:55:52 PM org.apache.maven.cli.event.ExecutionEventLogger logReactorSummary
INFO: jclouds :: Karaf :: Recipe ........................ SKIPPED
Jan 1, 2014 3:55:52 PM org.apache.maven.cli.event.ExecutionEventLogger logReactorSummary
INFO: jclouds :: Karaf :: Cache ......................... SKIPPED
Jan 1, 2014 3:55:52 PM org.apache.maven.cli.event.ExecutionEventLogger logReactorSummary
INFO: jclouds :: Karaf :: Services ...................... SKIPPED
Jan 1, 2014 3:55:52 PM org.apache.maven.cli.event.ExecutionEventLogger logReactorSummary
INFO: jclouds :: Karaf :: Commands ...................... SKIPPED
Jan 1, 2014 3:55:52 PM org.apache.maven.cli.event.ExecutionEventLogger logReactorSummary
INFO: jclouds :: Karaf :: URL Handler ................... SKIPPED
Jan 1, 2014 3:55:52 PM org.apache.maven.cli.event.ExecutionEventLogger logReactorSummary
INFO: jclouds :: Karaf :: Chef .......................... SKIPPED
Jan 1, 2014 3:55:52 PM org.apache.maven.cli.event.ExecutionEventLogger logReactorSummary
INFO: jclouds :: Karaf :: Chef :: Core .................. SKIPPED
Jan 1, 2014 3:55:52 PM org.apache.maven.cli.event.ExecutionEventLogger logReactorSummary
INFO: jclouds :: Karaf :: Chef :: Services .............. SKIPPED
Jan 1, 2014 3:55:52 PM org.apache.maven.cli.event.ExecutionEventLogger logReactorSummary
INFO: jclouds :: Karaf :: Chef :: Commands .............. SKIPPED
Jan 1, 2014 3:55:52 PM org.apache.maven.cli.event.ExecutionEventLogger logReactorSummary
INFO: jclouds :: Karaf :: Chef :: Cache ................. SKIPPED
Jan 1, 2014 3:55:52 PM org.apache.maven.cli.event.ExecutionEventLogger logReactorSummary
INFO: jclouds :: Karaf :: Feature ....................... SKIPPED
Jan 1, 2014 3:55:52 PM org.apache.maven.cli.event.ExecutionEventLogger logReactorSummary
INFO: jclouds :: Karaf :: Integration Tests ............. SKIPPED
Jan 1, 2014 3:55:52 PM org.apache.maven.cli.event.ExecutionEventLogger logResult
INFO: ------------------------------------------------------------------------
Jan 1, 2014 3:55:52 PM org.apache.maven.cli.event.ExecutionEventLogger logResult
INFO: BUILD FAILURE
Jan 1, 2014 3:55:52 PM org.apache.maven.cli.event.ExecutionEventLogger logStats
INFO: ------------------------------------------------------------------------
Jan 1, 2014 3:55:52 PM org.apache.maven.cli.event.ExecutionEventLogger logStats
INFO: Total time: 1:23.964s
Jan 1, 2014 3:55:52 PM org.apache.maven.cli.event.ExecutionEventLogger logStats
INFO: Finished at: Wed Jan 01 15:55:52 EST 2014
Jan 1, 2014 3:55:52 PM org.apache.maven.cli.event.ExecutionEventLogger logStats
INFO: Final Memory: 7M/25M
Jan 1, 2014 3:55:52 PM org.apache.maven.cli.event.ExecutionEventLogger sessionEnded
INFO: ------------------------------------------------------------------------
[JENKINS] Archiving <https://jclouds.ci.cloudbees.com/job/jclouds-karaf/ws/utils/pom.xml>
to /home/jclouds/hudson_home/jobs/jclouds-karaf/modules/org.apache.jclouds.karaf$utils/builds/2014-01-01_20-54-16/archive/org.apache.jclouds.karaf/utils/1.8.0-SNAPSHOT/utils-1.8.0-SNAPSHOT.pom
[JENKINS] Archiving <https://jclouds.ci.cloudbees.com/job/jclouds-karaf/ws/cache/pom.xml>
to /home/jclouds/hudson_home/jobs/jclouds-karaf/modules/org.apache.jclouds.karaf$cache/builds/2014-01-01_20-54-16/archive/org.apache.jclouds.karaf/cache/1.8.0-SNAPSHOT/cache-1.8.0-SNAPSHOT.pom
[JENKINS] Archiving <https://jclouds.ci.cloudbees.com/job/jclouds-karaf/ws/chef/commands/pom.xml>
to /home/jclouds/hudson_home/jobs/jclouds-karaf/modules/org.apache.jclouds.karaf.chef$commands/builds/2014-01-01_20-54-16/archive/org.apache.jclouds.karaf.chef/commands/1.8.0-SNAPSHOT/commands-1.8.0-SNAPSHOT.pom
[JENKINS] Archiving <https://jclouds.ci.cloudbees.com/job/jclouds-karaf/ws/recipe/pom.xml>
to /home/jclouds/hudson_home/jobs/jclouds-karaf/modules/org.apache.jclouds.karaf$recipe/builds/2014-01-01_20-54-16/archive/org.apache.jclouds.karaf/recipe/1.8.0-SNAPSHOT/recipe-1.8.0-SNAPSHOT.pom
[JENKINS] Archiving <https://jclouds.ci.cloudbees.com/job/jclouds-karaf/ws/feature/pom.xml>
to /home/jclouds/hudson_home/jobs/jclouds-karaf/modules/org.apache.jclouds.karaf$jclouds-karaf/builds/2014-01-01_20-54-16/archive/org.apache.jclouds.karaf/jclouds-karaf/1.8.0-SNAPSHOT/jclouds-karaf-1.8.0-SNAPSHOT.pom
[JENKINS] Archiving <https://jclouds.ci.cloudbees.com/job/jclouds-karaf/ws/commands/pom.xml>
to /home/jclouds/hudson_home/jobs/jclouds-karaf/modules/org.apache.jclouds.karaf$commands/builds/2014-01-01_20-54-16/archive/org.apache.jclouds.karaf/commands/1.8.0-SNAPSHOT/commands-1.8.0-SNAPSHOT.pom
[JENKINS] Archiving <https://jclouds.ci.cloudbees.com/job/jclouds-karaf/ws/itests/pom.xml>
to /home/jclouds/hudson_home/jobs/jclouds-karaf/modules/org.apache.jclouds.karaf$itests/builds/2014-01-01_20-54-16/archive/org.apache.jclouds.karaf/itests/1.8.0-SNAPSHOT/itests-1.8.0-SNAPSHOT.pom
[JENKINS] Archiving <https://jclouds.ci.cloudbees.com/job/jclouds-karaf/ws/urlhandler/pom.xml>
to /home/jclouds/hudson_home/jobs/jclouds-karaf/modules/org.apache.jclouds.karaf$urlhandler/builds/2014-01-01_20-54-16/archive/org.apache.jclouds.karaf/urlhandler/1.8.0-SNAPSHOT/urlhandler-1.8.0-SNAPSHOT.pom
[JENKINS] Archiving <https://jclouds.ci.cloudbees.com/job/jclouds-karaf/ws/services/pom.xml>
to /home/jclouds/hudson_home/jobs/jclouds-karaf/modules/org.apache.jclouds.karaf$services/builds/2014-01-01_20-54-16/archive/org.apache.jclouds.karaf/services/1.8.0-SNAPSHOT/services-1.8.0-SNAPSHOT.pom
[JENKINS] Archiving <https://jclouds.ci.cloudbees.com/job/jclouds-karaf/ws/chef/core/pom.xml>
to /home/jclouds/hudson_home/jobs/jclouds-karaf/modules/org.apache.jclouds.karaf.chef$core/builds/2014-01-01_20-54-16/archive/org.apache.jclouds.karaf.chef/core/1.8.0-SNAPSHOT/core-1.8.0-SNAPSHOT.pom
[JENKINS] Archiving <https://jclouds.ci.cloudbees.com/job/jclouds-karaf/ws/chef/services/pom.xml>
to /home/jclouds/hudson_home/jobs/jclouds-karaf/modules/org.apache.jclouds.karaf.chef$services/builds/2014-01-01_20-54-16/archive/org.apache.jclouds.karaf.chef/services/1.8.0-SNAPSHOT/services-1.8.0-SNAPSHOT.pom
[JENKINS] Archiving <https://jclouds.ci.cloudbees.com/job/jclouds-karaf/ws/chef/pom.xml>
to /home/jclouds/hudson_home/jobs/jclouds-karaf/modules/org.apache.jclouds.karaf$chef/builds/2014-01-01_20-54-16/archive/org.apache.jclouds.karaf/chef/1.8.0-SNAPSHOT/chef-1.8.0-SNAPSHOT.pom
[JENKINS] Archiving <https://jclouds.ci.cloudbees.com/job/jclouds-karaf/ws/pom.xml>
to /home/jclouds/hudson_home/jobs/jclouds-karaf/modules/org.apache.jclouds$jclouds-karaf/builds/2014-01-01_20-54-16/archive/org.apache.jclouds/jclouds-karaf/1.8.0-SNAPSHOT/jclouds-karaf-1.8.0-SNAPSHOT.pom
[JENKINS] Archiving <https://jclouds.ci.cloudbees.com/job/jclouds-karaf/ws/core/pom.xml>
to /home/jclouds/hudson_home/jobs/jclouds-karaf/modules/org.apache.jclouds.karaf$core/builds/2014-01-01_20-54-16/archive/org.apache.jclouds.karaf/core/1.8.0-SNAPSHOT/core-1.8.0-SNAPSHOT.pom
[JENKINS] Archiving <https://jclouds.ci.cloudbees.com/job/jclouds-karaf/ws/chef/cache/pom.xml>
to /home/jclouds/hudson_home/jobs/jclouds-karaf/modules/org.apache.jclouds.karaf.chef$cache/builds/2014-01-01_20-54-16/archive/org.apache.jclouds.karaf.chef/cache/1.8.0-SNAPSHOT/cache-1.8.0-SNAPSHOT.pom
Waiting for Jenkins to finish collecting data
mavenExecutionResult exceptions not empty
message : Plugin org.apache.maven.plugins:maven-remote-resources-plugin:1.4 or one of its
dependencies could not be resolved: Failed to read artifact descriptor for org.apache.maven.plugins:maven-remote-resources-plugin:jar:1.4
cause : Failed to read artifact descriptor for org.apache.maven.plugins:maven-remote-resources-plugin:jar:1.4
Stack trace : 
org.apache.maven.plugin.PluginResolutionException: Plugin org.apache.maven.plugins:maven-remote-resources-plugin:1.4
or one of its dependencies could not be resolved: Failed to read artifact descriptor for org.apache.maven.plugins:maven-remote-resources-plugin:jar:1.4
	at org.apache.maven.plugin.internal.DefaultPluginDependenciesResolver.resolve(DefaultPluginDependenciesResolver.java:129)
	at org.apache.maven.plugin.internal.DefaultMavenPluginManager.getPluginDescriptor(DefaultMavenPluginManager.java:142)
	at org.apache.maven.plugin.internal.DefaultMavenPluginManager.getMojoDescriptor(DefaultMavenPluginManager.java:261)
	at org.apache.maven.plugin.DefaultBuildPluginManager.getMojoDescriptor(DefaultBuildPluginManager.java:185)
	at org.apache.maven.lifecycle.internal.DefaultLifecycleExecutionPlanCalculator.calculateLifecycleMappings(DefaultLifecycleExecutionPlanCalculator.java:280)
	at org.apache.maven.lifecycle.internal.DefaultLifecycleExecutionPlanCalculator.calculateMojoExecutions(DefaultLifecycleExecutionPlanCalculator.java:193)
	at org.apache.maven.lifecycle.internal.DefaultLifecycleExecutionPlanCalculator.calculateExecutionPlan(DefaultLifecycleExecutionPlanCalculator.java:112)
	at org.apache.maven.lifecycle.internal.DefaultLifecycleExecutionPlanCalculator.calculateExecutionPlan(DefaultLifecycleExecutionPlanCalculator.java:129)
	at org.apache.maven.lifecycle.internal.BuilderCommon.resolveBuildPlan(BuilderCommon.java:92)
	at org.apache.maven.lifecycle.internal.LifecycleModuleBuilder.buildProject(LifecycleModuleBuilder.java:81)
	at org.apache.maven.lifecycle.internal.LifecycleModuleBuilder.buildProject(LifecycleModuleBuilder.java:59)
	at org.apache.maven.lifecycle.internal.LifecycleStarter.singleThreadedBuild(LifecycleStarter.java:183)
	at org.apache.maven.lifecycle.internal.LifecycleStarter.execute(LifecycleStarter.java:161)
	at org.apache.maven.DefaultMaven.doExecute(DefaultMaven.java:319)
	at org.apache.maven.DefaultMaven.execute(DefaultMaven.java:156)
	at org.jvnet.hudson.maven3.launcher.Maven3Launcher.main(Maven3Launcher.java:117)
	at sun.reflect.NativeMethodAccessorImpl.invoke0(Native Method)
	at sun.reflect.NativeMethodAccessorImpl.invoke(NativeMethodAccessorImpl.java:39)
	at sun.reflect.DelegatingMethodAccessorImpl.invoke(DelegatingMethodAccessorImpl.java:25)
	at java.lang.reflect.Method.invoke(Method.java:597)
	at org.codehaus.plexus.classworlds.launcher.Launcher.launchStandard(Launcher.java:329)
	at org.codehaus.plexus.classworlds.launcher.Launcher.launch(Launcher.java:239)
	at org.jvnet.hudson.maven3.agent.Maven3Main.launch(Maven3Main.java:178)
	at sun.reflect.NativeMethodAccessorImpl.invoke0(Native Method)
	at sun.reflect.NativeMethodAccessorImpl.invoke(NativeMethodAccessorImpl.java:39)
	at sun.reflect.DelegatingMethodAccessorImpl.invoke(DelegatingMethodAccessorImpl.java:25)
	at java.lang.reflect.Method.invoke(Method.java:597)
	at hudson.maven.Maven3Builder.call(Maven3Builder.java:129)
	at hudson.maven.Maven3Builder.call(Maven3Builder.java:67)
	at hudson.remoting.UserRequest.perform(UserRequest.java:118)
	at hudson.remoting.UserRequest.perform(UserRequest.java:48)
	at hudson.remoting.Request$2.run(Request.java:326)
	at hudson.remoting.InterceptingExecutorService$1.call(InterceptingExecutorService.java:72)
	at java.util.concurrent.FutureTask$Sync.innerRun(FutureTask.java:303)
	at java.util.concurrent.FutureTask.run(FutureTask.java:138)
	at java.util.concurrent.ThreadPoolExecutor$Worker.runTask(ThreadPoolExecutor.java:895)
	at java.util.concurrent.ThreadPoolExecutor$Worker.run(ThreadPoolExecutor.java:918)
	at java.lang.Thread.run(Thread.java:662)
Caused by: org.sonatype.aether.resolution.ArtifactDescriptorException: Failed to read artifact
descriptor for org.apache.maven.plugins:maven-remote-resources-plugin:jar:1.4
	at org.apache.maven.repository.internal.DefaultArtifactDescriptorReader.loadPom(DefaultArtifactDescriptorReader.java:282)
	at org.apache.maven.repository.internal.DefaultArtifactDescriptorReader.readArtifactDescriptor(DefaultArtifactDescriptorReader.java:172)
	at org.sonatype.aether.impl.internal.DefaultRepositorySystem.readArtifactDescriptor(DefaultRepositorySystem.java:316)
	at org.apache.maven.plugin.internal.DefaultPluginDependenciesResolver.resolve(DefaultPluginDependenciesResolver.java:115)
	... 37 more
Caused by: org.sonatype.aether.resolution.ArtifactResolutionException: Could not find artifact
org.apache.maven.plugins:maven-remote-resources-plugin:pom:1.4 in cloudbees-private-release-repository
(https://repository-jclouds.forge.cloudbees.com/release)
	at org.sonatype.aether.impl.internal.DefaultArtifactResolver.resolve(DefaultArtifactResolver.java:541)
	at org.sonatype.aether.impl.internal.DefaultArtifactResolver.resolveArtifacts(DefaultArtifactResolver.java:220)
	at org.sonatype.aether.impl.internal.DefaultArtifactResolver.resolveArtifact(DefaultArtifactResolver.java:197)
	at org.apache.maven.repository.internal.DefaultArtifactDescriptorReader.loadPom(DefaultArtifactDescriptorReader.java:267)
	... 40 more
Caused by: org.sonatype.aether.transfer.ArtifactNotFoundException: Could not find artifact
org.apache.maven.plugins:maven-remote-resources-plugin:pom:1.4 in cloudbees-private-release-repository
(https://repository-jclouds.forge.cloudbees.com/release)
	at org.sonatype.aether.connector.wagon.WagonRepositoryConnector$4.wrap(WagonRepositoryConnector.java:945)
	at org.sonatype.aether.connector.wagon.WagonRepositoryConnector$4.wrap(WagonRepositoryConnector.java:940)
	at org.sonatype.aether.connector.wagon.WagonRepositoryConnector$GetTask.flush(WagonRepositoryConnector.java:695)
	at org.sonatype.aether.connector.wagon.WagonRepositoryConnector$GetTask.flush(WagonRepositoryConnector.java:689)
	at org.sonatype.aether.connector.wagon.WagonRepositoryConnector.get(WagonRepositoryConnector.java:445)
	at org.sonatype.aether.impl.internal.DefaultArtifactResolver.resolve(DefaultArtifactResolver.java:460)
	... 43 more
channel stopped

Mime
View raw message