jclouds-dev mailing list archives

Site index · List index
Message view « Date » · « Thread »
Top « Date » · « Thread »
From jenkins-no-re...@cloudbees.com
Subject Build failed in Jenkins: jclouds-labs #375
Date Wed, 01 Jan 2014 17:45:17 GMT
See <https://jclouds.ci.cloudbees.com/job/jclouds-labs/375/>

------------------------------------------
[...truncated 3215 lines...]
Downloading: http://repo.cloudbees.com/content/repositories/central/com/google/collections/google-collections/1.0/google-collections-1.0.pom
Downloaded: http://repo.cloudbees.com/content/repositories/central/com/google/collections/google-collections/1.0/google-collections-1.0.pom
(3 KB at 83.4 KB/sec)
Downloading: https://repository-jclouds.forge.cloudbees.com/release/com/google/google/1/google-1.pom
Downloading: http://repo.cloudbees.com/content/repositories/central/com/google/google/1/google-1.pom
Downloaded: http://repo.cloudbees.com/content/repositories/central/com/google/google/1/google-1.pom
(2 KB at 101.2 KB/sec)
Downloading: https://repository-jclouds.forge.cloudbees.com/release/org/apache/maven/shared/maven-shared-utils/0.1/maven-shared-utils-0.1.jar
Downloading: https://repository-jclouds.forge.cloudbees.com/release/com/google/code/findbugs/jsr305/2.0.1/jsr305-2.0.1.jar
Downloading: https://repository-jclouds.forge.cloudbees.com/release/org/apache/maven/shared/maven-shared-incremental/1.1/maven-shared-incremental-1.1.jar
Downloading: https://repository-jclouds.forge.cloudbees.com/release/org/codehaus/plexus/plexus-compiler-api/2.2/plexus-compiler-api-2.2.jar
Downloading: https://repository-jclouds.forge.cloudbees.com/release/org/codehaus/plexus/plexus-compiler-manager/2.2/plexus-compiler-manager-2.2.jar
Downloading: https://repository-jclouds.forge.cloudbees.com/release/org/codehaus/plexus/plexus-compiler-javac/2.2/plexus-compiler-javac-2.2.jar
Downloading: https://repository-jclouds.forge.cloudbees.com/release/org/apache/xbean/xbean-reflect/3.4/xbean-reflect-3.4.jar
Downloading: https://repository-jclouds.forge.cloudbees.com/release/log4j/log4j/1.2.12/log4j-1.2.12.jar
Downloading: https://repository-jclouds.forge.cloudbees.com/release/commons-logging/commons-logging-api/1.1/commons-logging-api-1.1.jar
Downloading: https://repository-jclouds.forge.cloudbees.com/release/com/google/collections/google-collections/1.0/google-collections-1.0.jar
Downloading: https://repository-jclouds.forge.cloudbees.com/release/junit/junit/3.8.2/junit-3.8.2.jar
Downloading: http://repo.cloudbees.com/content/repositories/central/org/apache/maven/shared/maven-shared-utils/0.1/maven-shared-utils-0.1.jar
Downloading: http://repo.cloudbees.com/content/repositories/central/com/google/code/findbugs/jsr305/2.0.1/jsr305-2.0.1.jar
Downloading: http://repo.cloudbees.com/content/repositories/central/org/apache/maven/shared/maven-shared-incremental/1.1/maven-shared-incremental-1.1.jar
Downloading: http://repo.cloudbees.com/content/repositories/central/org/codehaus/plexus/plexus-compiler-api/2.2/plexus-compiler-api-2.2.jar
Downloading: http://repo.cloudbees.com/content/repositories/central/org/codehaus/plexus/plexus-compiler-manager/2.2/plexus-compiler-manager-2.2.jar
Downloaded: http://repo.cloudbees.com/content/repositories/central/com/google/code/findbugs/jsr305/2.0.1/jsr305-2.0.1.jar
(32 KB at 1556.0 KB/sec)
Downloaded: http://repo.cloudbees.com/content/repositories/central/org/apache/maven/shared/maven-shared-incremental/1.1/maven-shared-incremental-1.1.jar
(14 KB at 661.0 KB/sec)
Downloading: http://repo.cloudbees.com/content/repositories/central/org/codehaus/plexus/plexus-compiler-javac/2.2/plexus-compiler-javac-2.2.jar
Downloading: http://repo.cloudbees.com/content/repositories/central/org/apache/xbean/xbean-reflect/3.4/xbean-reflect-3.4.jar
Downloaded: http://repo.cloudbees.com/content/repositories/central/org/apache/maven/shared/maven-shared-utils/0.1/maven-shared-utils-0.1.jar
(151 KB at 4311.4 KB/sec)
Downloading: http://repo.cloudbees.com/content/repositories/central/log4j/log4j/1.2.12/log4j-1.2.12.jar
Downloaded: http://repo.cloudbees.com/content/repositories/central/org/codehaus/plexus/plexus-compiler-api/2.2/plexus-compiler-api-2.2.jar
(25 KB at 254.2 KB/sec)
Downloading: http://repo.cloudbees.com/content/repositories/central/commons-logging/commons-logging-api/1.1/commons-logging-api-1.1.jar
Downloaded: http://repo.cloudbees.com/content/repositories/central/org/codehaus/plexus/plexus-compiler-javac/2.2/plexus-compiler-javac-2.2.jar
(19 KB at 215.4 KB/sec)
Downloading: http://repo.cloudbees.com/content/repositories/central/com/google/collections/google-collections/1.0/google-collections-1.0.jar
Downloaded: http://repo.cloudbees.com/content/repositories/central/org/apache/xbean/xbean-reflect/3.4/xbean-reflect-3.4.jar
(131 KB at 1405.3 KB/sec)
Downloaded: http://repo.cloudbees.com/content/repositories/central/org/codehaus/plexus/plexus-compiler-manager/2.2/plexus-compiler-manager-2.2.jar
(5 KB at 41.6 KB/sec)
Downloading: http://repo.cloudbees.com/content/repositories/central/junit/junit/3.8.2/junit-3.8.2.jar
Downloaded: http://repo.cloudbees.com/content/repositories/central/commons-logging/commons-logging-api/1.1/commons-logging-api-1.1.jar
(44 KB at 478.6 KB/sec)
Downloaded: http://repo.cloudbees.com/content/repositories/central/junit/junit/3.8.2/junit-3.8.2.jar
(118 KB at 1386.0 KB/sec)
Downloaded: http://repo.cloudbees.com/content/repositories/central/log4j/log4j/1.2.12/log4j-1.2.12.jar
(350 KB at 1784.1 KB/sec)
Downloaded: http://repo.cloudbees.com/content/repositories/central/com/google/collections/google-collections/1.0/google-collections-1.0.jar
(625 KB at 4626.7 KB/sec)
[INFO] Changes detected - recompiling the module!
[INFO] Compiling 87 source files to <https://jclouds.ci.cloudbees.com/job/jclouds-labs/ws/virtualbox/target/classes>
[Unloading class GregorSamsa$2]
[Unloading class GregorSamsa$1]
[Unloading class GregorSamsa$0]
[Unloading class GregorSamsa]
[WARNING] Note: Some input files use or override a deprecated API.
[WARNING] Note: Recompile with -Xlint:deprecation for details.
Jan 1, 2014 12:44:42 PM org.apache.maven.cli.event.ExecutionEventLogger mojoStarted
INFO: 
Jan 1, 2014 12:44:42 PM org.apache.maven.cli.event.ExecutionEventLogger mojoStarted
INFO: --- maven-resources-plugin:2.6:testResources (default-testResources) @ virtualbox ---
[INFO] Using 'UTF-8' encoding to copy filtered resources.
[INFO] skip non existing resourceDirectory <https://jclouds.ci.cloudbees.com/job/jclouds-labs/ws/virtualbox/src/test/clojure>
[INFO] Copying 11 resources
[INFO] Copying 3 resources
Jan 1, 2014 12:44:42 PM org.apache.maven.cli.event.ExecutionEventLogger mojoStarted
INFO: 
Jan 1, 2014 12:44:42 PM org.apache.maven.cli.event.ExecutionEventLogger mojoStarted
INFO: --- maven-compiler-plugin:3.1:testCompile (default-testCompile) @ virtualbox ---
[INFO] Changes detected - recompiling the module!
[INFO] Compiling 45 source files to <https://jclouds.ci.cloudbees.com/job/jclouds-labs/ws/virtualbox/target/test-classes>
Jan 1, 2014 12:44:46 PM org.apache.maven.cli.event.ExecutionEventLogger mojoStarted
INFO: 
Jan 1, 2014 12:44:46 PM org.apache.maven.cli.event.ExecutionEventLogger mojoStarted
INFO: --- maven-surefire-plugin:2.12.4:test (default-test) @ virtualbox ---
[INFO] Surefire report directory: <https://jclouds.ci.cloudbees.com/job/jclouds-labs/ws/virtualbox/target/surefire-reports>
Downloading: https://repository-jclouds.forge.cloudbees.com/release/org/apache/maven/surefire/surefire-testng/2.12.4/surefire-testng-2.12.4.pom
Downloading: http://repo.cloudbees.com/content/repositories/central/org/apache/maven/surefire/surefire-testng/2.12.4/surefire-testng-2.12.4.pom
[WARNING] Missing POM for org.apache.maven.surefire:surefire-testng:jar:2.12.4
Downloading: https://repository-jclouds.forge.cloudbees.com/release/org/apache/maven/surefire/surefire-testng/2.12.4/surefire-testng-2.12.4.jar
Downloading: http://repo.cloudbees.com/content/repositories/central/org/apache/maven/surefire/surefire-testng/2.12.4/surefire-testng-2.12.4.jar
Downloaded: http://repo.cloudbees.com/content/repositories/central/org/apache/maven/surefire/surefire-testng/2.12.4/surefire-testng-2.12.4.jar
(33 KB at 2523.4 KB/sec)
Downloading: https://repository-jclouds.forge.cloudbees.com/release/org/apache/maven/surefire/surefire-testng-utils/2.12.4/surefire-testng-utils-2.12.4.jar
Downloading: http://repo.cloudbees.com/content/repositories/central/org/apache/maven/surefire/surefire-testng-utils/2.12.4/surefire-testng-utils-2.12.4.jar
Downloaded: http://repo.cloudbees.com/content/repositories/central/org/apache/maven/surefire/surefire-testng-utils/2.12.4/surefire-testng-utils-2.12.4.jar
(23 KB at 1768.7 KB/sec)
Downloading: https://repository-jclouds.forge.cloudbees.com/release/org/apache/maven/surefire/surefire-grouper/2.12.4/surefire-grouper-2.12.4.jar
Downloading: http://repo.cloudbees.com/content/repositories/central/org/apache/maven/surefire/surefire-grouper/2.12.4/surefire-grouper-2.12.4.jar
Downloaded: http://repo.cloudbees.com/content/repositories/central/org/apache/maven/surefire/surefire-grouper/2.12.4/surefire-grouper-2.12.4.jar
(37 KB at 1538.4 KB/sec)

-------------------------------------------------------
 T E S T S
-------------------------------------------------------
org.apache.maven.surefire.util.SurefireReflectionException: java.lang.reflect.InvocationTargetException;
nested exception is java.lang.reflect.InvocationTargetException: null
java.lang.reflect.InvocationTargetException
	at sun.reflect.NativeMethodAccessorImpl.invoke0(Native Method)
	at sun.reflect.NativeMethodAccessorImpl.invoke(NativeMethodAccessorImpl.java:39)
	at sun.reflect.DelegatingMethodAccessorImpl.invoke(DelegatingMethodAccessorImpl.java:25)
	at java.lang.reflect.Method.invoke(Method.java:597)
	at org.apache.maven.surefire.util.ReflectionUtils.invokeMethodWithArray(ReflectionUtils.java:189)
	at org.apache.maven.surefire.booter.ProviderFactory$ProviderProxy.invoke(ProviderFactory.java:165)
	at org.apache.maven.surefire.booter.ProviderFactory.invokeProvider(ProviderFactory.java:85)
	at org.apache.maven.surefire.booter.ForkedBooter.runSuitesInProcess(ForkedBooter.java:115)
	at org.apache.maven.surefire.booter.ForkedBooter.main(ForkedBooter.java:75)
Caused by: java.lang.NoClassDefFoundError: org/apache/maven/artifact/versioning/ArtifactVersion
	at org.apache.maven.surefire.testng.TestNGProvider.getDirectorySuite(TestNGProvider.java:122)
	at org.apache.maven.surefire.testng.TestNGProvider.invoke(TestNGProvider.java:105)
	... 9 more
Caused by: java.lang.ClassNotFoundException: org.apache.maven.artifact.versioning.ArtifactVersion
	at java.net.URLClassLoader$1.run(URLClassLoader.java:202)
	at java.security.AccessController.doPrivileged(Native Method)
	at java.net.URLClassLoader.findClass(URLClassLoader.java:190)
	at java.lang.ClassLoader.loadClass(ClassLoader.java:306)
	at java.lang.ClassLoader.loadClass(ClassLoader.java:247)
	at org.apache.maven.surefire.booter.IsolatedClassLoader.loadClass(IsolatedClassLoader.java:97)
	... 11 more

Results :

Tests run: 0, Failures: 0, Errors: 0, Skipped: 0

[JENKINS] Recording test results
Jan 1, 2014 12:44:50 PM org.apache.maven.cli.event.ExecutionEventLogger logReactorSummary
INFO: ------------------------------------------------------------------------
Jan 1, 2014 12:44:50 PM org.apache.maven.cli.event.ExecutionEventLogger logReactorSummary
INFO: Reactor Summary:
Jan 1, 2014 12:44:50 PM org.apache.maven.cli.event.ExecutionEventLogger logReactorSummary
INFO: 
Jan 1, 2014 12:44:50 PM org.apache.maven.cli.event.ExecutionEventLogger logReactorSummary
INFO: Apache jclouds labs ............................... SUCCESS [4:24.761s]
Jan 1, 2014 12:44:50 PM org.apache.maven.cli.event.ExecutionEventLogger logReactorSummary
INFO: jclouds virtualbox api ............................ FAILURE [46.383s]
Jan 1, 2014 12:44:50 PM org.apache.maven.cli.event.ExecutionEventLogger logReactorSummary
INFO: jclouds dmtf domain objects ....................... SKIPPED
Jan 1, 2014 12:44:50 PM org.apache.maven.cli.event.ExecutionEventLogger logReactorSummary
INFO: jclouds vcloud-director api ....................... SKIPPED
Jan 1, 2014 12:44:50 PM org.apache.maven.cli.event.ExecutionEventLogger logReactorSummary
INFO: jclouds cdmi api .................................. SKIPPED
Jan 1, 2014 12:44:50 PM org.apache.maven.cli.event.ExecutionEventLogger logReactorSummary
INFO: jclouds CloudSigma v2 API ......................... SKIPPED
Jan 1, 2014 12:44:50 PM org.apache.maven.cli.event.ExecutionEventLogger logReactorSummary
INFO: jclouds CloudSigma v2 Las Vegas Provider .......... SKIPPED
Jan 1, 2014 12:44:50 PM org.apache.maven.cli.event.ExecutionEventLogger logReactorSummary
INFO: jclouds CloudSigma v2 Zurich Provider ............. SKIPPED
Jan 1, 2014 12:44:50 PM org.apache.maven.cli.event.ExecutionEventLogger logReactorSummary
INFO: jclouds joyent-cloudapi api ....................... SKIPPED
Jan 1, 2014 12:44:50 PM org.apache.maven.cli.event.ExecutionEventLogger logReactorSummary
INFO: jclouds joyentcloud provider ...................... SKIPPED
Jan 1, 2014 12:44:50 PM org.apache.maven.cli.event.ExecutionEventLogger logReactorSummary
INFO: jclouds Fujitsu Global Cloud Platform ............. SKIPPED
Jan 1, 2014 12:44:50 PM org.apache.maven.cli.event.ExecutionEventLogger logReactorSummary
INFO: jclouds Fujitsu Global Cloud Platform AU provider . SKIPPED
Jan 1, 2014 12:44:50 PM org.apache.maven.cli.event.ExecutionEventLogger logReactorSummary
INFO: jclouds Fujitsu Global Cloud Platform DE provider . SKIPPED
Jan 1, 2014 12:44:50 PM org.apache.maven.cli.event.ExecutionEventLogger logReactorSummary
INFO: jclouds Abiquo api ................................ SKIPPED
Jan 1, 2014 12:44:50 PM org.apache.maven.cli.event.ExecutionEventLogger logReactorSummary
INFO: jclouds :: represetations ......................... SKIPPED
Jan 1, 2014 12:44:50 PM org.apache.maven.cli.event.ExecutionEventLogger logReactorSummary
INFO: jclouds :: representations :: core ................ SKIPPED
Jan 1, 2014 12:44:50 PM org.apache.maven.cli.event.ExecutionEventLogger logReactorSummary
INFO: jclouds :: representations :: codec ............... SKIPPED
Jan 1, 2014 12:44:50 PM org.apache.maven.cli.event.ExecutionEventLogger logReactorSummary
INFO: jclouds :: management ............................. SKIPPED
Jan 1, 2014 12:44:50 PM org.apache.maven.cli.event.ExecutionEventLogger logReactorSummary
INFO: jclouds :: management :: core ..................... SKIPPED
Jan 1, 2014 12:44:50 PM org.apache.maven.cli.event.ExecutionEventLogger logReactorSummary
INFO: jclouds :: management :: compute .................. SKIPPED
Jan 1, 2014 12:44:50 PM org.apache.maven.cli.event.ExecutionEventLogger logReactorSummary
INFO: jclouds :: management :: blobstore ................ SKIPPED
Jan 1, 2014 12:44:50 PM org.apache.maven.cli.event.ExecutionEventLogger logResult
INFO: ------------------------------------------------------------------------
Jan 1, 2014 12:44:50 PM org.apache.maven.cli.event.ExecutionEventLogger logResult
INFO: BUILD FAILURE
Jan 1, 2014 12:44:50 PM org.apache.maven.cli.event.ExecutionEventLogger logStats
INFO: ------------------------------------------------------------------------
Jan 1, 2014 12:44:50 PM org.apache.maven.cli.event.ExecutionEventLogger logStats
INFO: Total time: 5:27.285s
Jan 1, 2014 12:44:50 PM org.apache.maven.cli.event.ExecutionEventLogger logStats
INFO: Finished at: Wed Jan 01 12:44:50 EST 2014
Jan 1, 2014 12:44:52 PM org.apache.maven.cli.event.ExecutionEventLogger logStats
INFO: Final Memory: 36M/158M
Jan 1, 2014 12:44:52 PM org.apache.maven.cli.event.ExecutionEventLogger sessionEnded
INFO: ------------------------------------------------------------------------
[JENKINS] Archiving <https://jclouds.ci.cloudbees.com/job/jclouds-labs/ws/cloudsigma2-lvs/pom.xml>
to /home/jclouds/hudson_home/jobs/jclouds-labs/modules/org.apache.jclouds.labs$cloudsigma2-lvs/builds/2014-01-01_17-39-08/archive/org.apache.jclouds.labs/cloudsigma2-lvs/1.8.0-SNAPSHOT/cloudsigma2-lvs-1.8.0-SNAPSHOT.pom
[JENKINS] Archiving <https://jclouds.ci.cloudbees.com/job/jclouds-labs/ws/cloudsigma2-zrh/pom.xml>
to /home/jclouds/hudson_home/jobs/jclouds-labs/modules/org.apache.jclouds.labs$cloudsigma2-zrh/builds/2014-01-01_17-39-08/archive/org.apache.jclouds.labs/cloudsigma2-zrh/1.8.0-SNAPSHOT/cloudsigma2-zrh-1.8.0-SNAPSHOT.pom
[JENKINS] Archiving <https://jclouds.ci.cloudbees.com/job/jclouds-labs/ws/fgcp-au/pom.xml>
to /home/jclouds/hudson_home/jobs/jclouds-labs/modules/org.apache.jclouds.labs$fgcp-au/builds/2014-01-01_17-39-08/archive/org.apache.jclouds.labs/fgcp-au/1.8.0-SNAPSHOT/fgcp-au-1.8.0-SNAPSHOT.pom
[JENKINS] Archiving <https://jclouds.ci.cloudbees.com/job/jclouds-labs/ws/abiquo/pom.xml>
to /home/jclouds/hudson_home/jobs/jclouds-labs/modules/org.apache.jclouds.labs$abiquo/builds/2014-01-01_17-39-08/archive/org.apache.jclouds.labs/abiquo/1.8.0-SNAPSHOT/abiquo-1.8.0-SNAPSHOT.pom
[JENKINS] Archiving <https://jclouds.ci.cloudbees.com/job/jclouds-labs/ws/jclouds-management/management-compute/pom.xml>
to /home/jclouds/hudson_home/jobs/jclouds-labs/modules/org.apache.jclouds.labs.management$management-compute/builds/2014-01-01_17-39-08/archive/org.apache.jclouds.labs.management/management-compute/1.8.0-SNAPSHOT/management-compute-1.8.0-SNAPSHOT.pom
[JENKINS] Archiving <https://jclouds.ci.cloudbees.com/job/jclouds-labs/ws/fgcp-de/pom.xml>
to /home/jclouds/hudson_home/jobs/jclouds-labs/modules/org.apache.jclouds.labs$fgcp-de/builds/2014-01-01_17-39-08/archive/org.apache.jclouds.labs/fgcp-de/1.8.0-SNAPSHOT/fgcp-de-1.8.0-SNAPSHOT.pom
[JENKINS] Archiving <https://jclouds.ci.cloudbees.com/job/jclouds-labs/ws/dmtf/pom.xml>
to /home/jclouds/hudson_home/jobs/jclouds-labs/modules/org.apache.jclouds.labs$dmtf/builds/2014-01-01_17-39-08/archive/org.apache.jclouds.labs/dmtf/1.8.0-SNAPSHOT/dmtf-1.8.0-SNAPSHOT.pom
[JENKINS] Archiving <https://jclouds.ci.cloudbees.com/job/jclouds-labs/ws/joyentcloud/pom.xml>
to /home/jclouds/hudson_home/jobs/jclouds-labs/modules/org.apache.jclouds.labs$joyentcloud/builds/2014-01-01_17-39-08/archive/org.apache.jclouds.labs/joyentcloud/1.8.0-SNAPSHOT/joyentcloud-1.8.0-SNAPSHOT.pom
[JENKINS] Archiving <https://jclouds.ci.cloudbees.com/job/jclouds-labs/ws/jclouds-representations/pom.xml>
to /home/jclouds/hudson_home/jobs/jclouds-labs/modules/org.apache.jclouds.labs$jclouds-represetations/builds/2014-01-01_17-39-08/archive/org.apache.jclouds.labs/jclouds-represetations/1.8.0-SNAPSHOT/jclouds-represetations-1.8.0-SNAPSHOT.pom
[JENKINS] Archiving <https://jclouds.ci.cloudbees.com/job/jclouds-labs/ws/jclouds-representations/representations-core/pom.xml>
to /home/jclouds/hudson_home/jobs/jclouds-labs/modules/org.apache.jclouds.labs.representations$representations-core/builds/2014-01-01_17-39-08/archive/org.apache.jclouds.labs.representations/representations-core/1.8.0-SNAPSHOT/representations-core-1.8.0-SNAPSHOT.pom
[JENKINS] Archiving <https://jclouds.ci.cloudbees.com/job/jclouds-labs/ws/jclouds-management/management-core/pom.xml>
to /home/jclouds/hudson_home/jobs/jclouds-labs/modules/org.apache.jclouds.labs.management$management-core/builds/2014-01-01_17-39-08/archive/org.apache.jclouds.labs.management/management-core/1.8.0-SNAPSHOT/management-core-1.8.0-SNAPSHOT.pom
[JENKINS] Archiving <https://jclouds.ci.cloudbees.com/job/jclouds-labs/ws/joyent-cloudapi/pom.xml>
to /home/jclouds/hudson_home/jobs/jclouds-labs/modules/org.apache.jclouds.labs$joyent-cloudapi/builds/2014-01-01_17-39-08/archive/org.apache.jclouds.labs/joyent-cloudapi/1.8.0-SNAPSHOT/joyent-cloudapi-1.8.0-SNAPSHOT.pom
[JENKINS] Archiving <https://jclouds.ci.cloudbees.com/job/jclouds-labs/ws/fgcp/pom.xml>
to /home/jclouds/hudson_home/jobs/jclouds-labs/modules/org.apache.jclouds.labs$fgcp/builds/2014-01-01_17-39-08/archive/org.apache.jclouds.labs/fgcp/1.8.0-SNAPSHOT/fgcp-1.8.0-SNAPSHOT.pom
[JENKINS] Archiving <https://jclouds.ci.cloudbees.com/job/jclouds-labs/ws/jclouds-management/pom.xml>
to /home/jclouds/hudson_home/jobs/jclouds-labs/modules/org.apache.jclouds.labs$jclouds-management/builds/2014-01-01_17-39-08/archive/org.apache.jclouds.labs/jclouds-management/1.8.0-SNAPSHOT/jclouds-management-1.8.0-SNAPSHOT.pom
[JENKINS] Archiving <https://jclouds.ci.cloudbees.com/job/jclouds-labs/ws/cloudsigma2/pom.xml>
to /home/jclouds/hudson_home/jobs/jclouds-labs/modules/org.apache.jclouds.labs$cloudsigma2/builds/2014-01-01_17-39-08/archive/org.apache.jclouds.labs/cloudsigma2/1.8.0-SNAPSHOT/cloudsigma2-1.8.0-SNAPSHOT.pom
[JENKINS] Archiving <https://jclouds.ci.cloudbees.com/job/jclouds-labs/ws/jclouds-management/management-blobstore/pom.xml>
to /home/jclouds/hudson_home/jobs/jclouds-labs/modules/org.apache.jclouds.labs.management$management-blobstore/builds/2014-01-01_17-39-08/archive/org.apache.jclouds.labs.management/management-blobstore/1.8.0-SNAPSHOT/management-blobstore-1.8.0-SNAPSHOT.pom
[JENKINS] Archiving <https://jclouds.ci.cloudbees.com/job/jclouds-labs/ws/jclouds-representations/representations-codec/pom.xml>
to /home/jclouds/hudson_home/jobs/jclouds-labs/modules/org.apache.jclouds.labs.representations$representations-codec/builds/2014-01-01_17-39-08/archive/org.apache.jclouds.labs.representations/representations-codec/1.8.0-SNAPSHOT/representations-codec-1.8.0-SNAPSHOT.pom
[JENKINS] Archiving <https://jclouds.ci.cloudbees.com/job/jclouds-labs/ws/virtualbox/pom.xml>
to /home/jclouds/hudson_home/jobs/jclouds-labs/modules/org.apache.jclouds.labs$virtualbox/builds/2014-01-01_17-39-08/archive/org.apache.jclouds.labs/virtualbox/1.8.0-SNAPSHOT/virtualbox-1.8.0-SNAPSHOT.pom
[JENKINS] Archiving <https://jclouds.ci.cloudbees.com/job/jclouds-labs/ws/cdmi/pom.xml>
to /home/jclouds/hudson_home/jobs/jclouds-labs/modules/org.apache.jclouds.labs$cdmi/builds/2014-01-01_17-39-08/archive/org.apache.jclouds.labs/cdmi/1.8.0-SNAPSHOT/cdmi-1.8.0-SNAPSHOT.pom
[JENKINS] Archiving <https://jclouds.ci.cloudbees.com/job/jclouds-labs/ws/vcloud-director/pom.xml>
to /home/jclouds/hudson_home/jobs/jclouds-labs/modules/org.apache.jclouds.labs$vcloud-director/builds/2014-01-01_17-39-08/archive/org.apache.jclouds.labs/vcloud-director/1.8.0-SNAPSHOT/vcloud-director-1.8.0-SNAPSHOT.pom
[JENKINS] Archiving <https://jclouds.ci.cloudbees.com/job/jclouds-labs/ws/pom.xml> to
/home/jclouds/hudson_home/jobs/jclouds-labs/modules/org.apache.jclouds.labs$jclouds-labs/builds/2014-01-01_17-39-08/archive/org.apache.jclouds.labs/jclouds-labs/1.8.0-SNAPSHOT/jclouds-labs-1.8.0-SNAPSHOT.pom
[JENKINS] Archiving <https://jclouds.ci.cloudbees.com/job/jclouds-labs/ws/target/jclouds-labs-1.8.0-SNAPSHOT-tests.jar>
to /home/jclouds/hudson_home/jobs/jclouds-labs/modules/org.apache.jclouds.labs$jclouds-labs/builds/2014-01-01_17-39-08/archive/org.apache.jclouds.labs/jclouds-labs/1.8.0-20140101.174354-48/jclouds-labs-1.8.0-20140101.174354-48-tests.jar
[JENKINS] Archiving <https://jclouds.ci.cloudbees.com/job/jclouds-labs/ws/target/jclouds-labs-1.8.0-SNAPSHOT-javadoc.jar>
to /home/jclouds/hudson_home/jobs/jclouds-labs/modules/org.apache.jclouds.labs$jclouds-labs/builds/2014-01-01_17-39-08/archive/org.apache.jclouds.labs/jclouds-labs/1.8.0-20140101.174354-48/jclouds-labs-1.8.0-20140101.174354-48-javadoc.jar
Waiting for Jenkins to finish collecting data
mavenExecutionResult exceptions not empty
message : Failed to execute goal org.apache.maven.plugins:maven-surefire-plugin:2.12.4:test
(default-test) on project virtualbox: Execution default-test of goal org.apache.maven.plugins:maven-surefire-plugin:2.12.4:test
failed: The forked VM terminated without saying properly goodbye. VM crash or System.exit
called ?
cause : Execution default-test of goal org.apache.maven.plugins:maven-surefire-plugin:2.12.4:test
failed: The forked VM terminated without saying properly goodbye. VM crash or System.exit
called ?
Stack trace : 
org.apache.maven.lifecycle.LifecycleExecutionException: Failed to execute goal org.apache.maven.plugins:maven-surefire-plugin:2.12.4:test
(default-test) on project virtualbox: Execution default-test of goal org.apache.maven.plugins:maven-surefire-plugin:2.12.4:test
failed: The forked VM terminated without saying properly goodbye. VM crash or System.exit
called ?
	at org.apache.maven.lifecycle.internal.MojoExecutor.execute(MojoExecutor.java:225)
	at org.apache.maven.lifecycle.internal.MojoExecutor.execute(MojoExecutor.java:153)
	at org.apache.maven.lifecycle.internal.MojoExecutor.execute(MojoExecutor.java:145)
	at org.apache.maven.lifecycle.internal.LifecycleModuleBuilder.buildProject(LifecycleModuleBuilder.java:84)
	at org.apache.maven.lifecycle.internal.LifecycleModuleBuilder.buildProject(LifecycleModuleBuilder.java:59)
	at org.apache.maven.lifecycle.internal.LifecycleStarter.singleThreadedBuild(LifecycleStarter.java:183)
	at org.apache.maven.lifecycle.internal.LifecycleStarter.execute(LifecycleStarter.java:161)
	at org.apache.maven.DefaultMaven.doExecute(DefaultMaven.java:319)
	at org.apache.maven.DefaultMaven.execute(DefaultMaven.java:156)
	at org.jvnet.hudson.maven3.launcher.Maven3Launcher.main(Maven3Launcher.java:117)
	at sun.reflect.NativeMethodAccessorImpl.invoke0(Native Method)
	at sun.reflect.NativeMethodAccessorImpl.invoke(NativeMethodAccessorImpl.java:39)
	at sun.reflect.DelegatingMethodAccessorImpl.invoke(DelegatingMethodAccessorImpl.java:25)
	at java.lang.reflect.Method.invoke(Method.java:597)
	at org.codehaus.plexus.classworlds.launcher.Launcher.launchStandard(Launcher.java:329)
	at org.codehaus.plexus.classworlds.launcher.Launcher.launch(Launcher.java:239)
	at org.jvnet.hudson.maven3.agent.Maven3Main.launch(Maven3Main.java:178)
	at sun.reflect.NativeMethodAccessorImpl.invoke0(Native Method)
	at sun.reflect.NativeMethodAccessorImpl.invoke(NativeMethodAccessorImpl.java:39)
	at sun.reflect.DelegatingMethodAccessorImpl.invoke(DelegatingMethodAccessorImpl.java:25)
	at java.lang.reflect.Method.invoke(Method.java:597)
	at hudson.maven.Maven3Builder.call(Maven3Builder.java:129)
	at hudson.maven.Maven3Builder.call(Maven3Builder.java:67)
	at hudson.remoting.UserRequest.perform(UserRequest.java:118)
	at hudson.remoting.UserRequest.perform(UserRequest.java:48)
	at hudson.remoting.Request$2.run(Request.java:326)
	at hudson.remoting.InterceptingExecutorService$1.call(InterceptingExecutorService.java:72)
	at java.util.concurrent.FutureTask$Sync.innerRun(FutureTask.java:303)
	at java.util.concurrent.FutureTask.run(FutureTask.java:138)
	at java.util.concurrent.ThreadPoolExecutor$Worker.runTask(ThreadPoolExecutor.java:895)
	at java.util.concurrent.ThreadPoolExecutor$Worker.run(ThreadPoolExecutor.java:918)
	at java.lang.Thread.run(Thread.java:662)
Caused by: org.apache.maven.plugin.PluginExecutionException: Execution default-test of goal
org.apache.maven.plugins:maven-surefire-plugin:2.12.4:test failed: The forked VM terminated
without saying properly goodbye. VM crash or System.exit called ?
	at org.apache.maven.plugin.DefaultBuildPluginManager.executeMojo(DefaultBuildPluginManager.java:110)
	at org.apache.maven.lifecycle.internal.MojoExecutor.execute(MojoExecutor.java:209)
	... 31 more
Caused by: java.lang.RuntimeException: The forked VM terminated without saying properly goodbye.
VM crash or System.exit called ?
	at org.apache.maven.plugin.surefire.booterclient.output.ForkClient.close(ForkClient.java:257)
	at org.apache.maven.plugin.surefire.booterclient.ForkStarter.fork(ForkStarter.java:301)
	at org.apache.maven.plugin.surefire.booterclient.ForkStarter.run(ForkStarter.java:116)
	at org.apache.maven.plugin.surefire.AbstractSurefireMojo.executeProvider(AbstractSurefireMojo.java:740)
	at org.apache.maven.plugin.surefire.AbstractSurefireMojo.executeAllProviders(AbstractSurefireMojo.java:682)
	at org.apache.maven.plugin.surefire.AbstractSurefireMojo.executeAfterPreconditionsChecked(AbstractSurefireMojo.java:648)
	at org.apache.maven.plugin.surefire.AbstractSurefireMojo.execute(AbstractSurefireMojo.java:586)
	at org.apache.maven.plugin.DefaultBuildPluginManager.executeMojo(DefaultBuildPluginManager.java:101)
	... 32 more
Sending e-mails to: dev@jclouds.apache.org
channel stopped

Mime
View raw message