jclouds-notifications mailing list archives

Site index · List index
Message view « Date » · « Thread »
Top « Date » · « Thread »
From jenkins-no-re...@cloudbees.com
Subject Build failed in Jenkins: jclouds-labs-aws-1.7.x-branch #20
Date Tue, 11 Feb 2014 16:03:34 GMT
See <https://jclouds.ci.cloudbees.com/job/jclouds-labs-aws-1.7.x-branch/20/changes>

Changes:

[Ignasi Barrera] Update jclouds.version to 1.7.1

[Ignasi Barrera] [maven-release-plugin] prepare release jclouds-labs-aws-1.7.1-rc1

[Ignasi Barrera] [maven-release-plugin] prepare for next development iteration

[Ignasi Barrera] Bump jclouds.version to 1.7.2-SNAPSHOT

------------------------------------------
Started by an SCM change
Building remotely on a9e257aa in workspace <https://jclouds.ci.cloudbees.com/job/jclouds-labs-aws-1.7.x-branch/ws/>
$ sudo /opt/jenkins/sbin/mount-webdav https://repository-jclouds.forge.cloudbees.com/private
jclouds alert
/private/jclouds is not a mountpoint
webdav mount try 1
/private/jclouds is not a mountpoint
p11-kit: couldn't read config file: /etc/pkcs11/modules/.
/private/jclouds is a mountpoint
Cloning the remote Git repository
Cloning repository https://git-wip-us.apache.org/repos/asf/jclouds-labs-aws.git
Fetching upstream changes from https://git-wip-us.apache.org/repos/asf/jclouds-labs-aws.git
Fetching upstream changes from https://git-wip-us.apache.org/repos/asf/jclouds-labs-aws.git
Checking out Revision ee84acff70b23f96033b52d9addf6cf2924b9691 (origin/1.7.x)
Parsing POMs
Failed to transfer Could not find metadata org.apache.jclouds:jclouds-project:1.7.2-SNAPSHOT/maven-metadata.xml
in sonatype-nexus-snapshots (https://oss.sonatype.org/content/repositories/snapshots)
Failed to transfer Could not find metadata org.apache.jclouds:jclouds-project:1.7.2-SNAPSHOT/maven-metadata.xml
in apache-snapshots (https://repository.apache.org/content/repositories/snapshots)
Failed to transfer Could not find metadata org.apache.jclouds:jclouds-project:1.7.2-SNAPSHOT/maven-metadata.xml
in cloudbees-private-snapshot-repository (https://repository-jclouds.forge.cloudbees.com/snapshot)
Failed to transfer Could not find artifact org.apache.jclouds:jclouds-project:pom:1.7.2-SNAPSHOT
in cloudbees-private-snapshot-repository (https://repository-jclouds.forge.cloudbees.com/snapshot)
Failed to transfer Could not find artifact org.apache.jclouds:jclouds-project:pom:1.7.2-SNAPSHOT
in apache-snapshots (https://repository.apache.org/content/repositories/snapshots)
Failed to transfer Could not find artifact org.apache.jclouds:jclouds-project:pom:1.7.2-SNAPSHOT
in sonatype-nexus-snapshots (https://oss.sonatype.org/content/repositories/snapshots)
ERROR: Failed to parse POMs
hudson.util.IOException2: remote file operation failed: <https://jclouds.ci.cloudbees.com/job/jclouds-labs-aws-1.7.x-branch/ws/>
at hudson.remoting.Channel@7af3c69:a9e257aa
	at hudson.FilePath.act(FilePath.java:912)
	at hudson.FilePath.act(FilePath.java:889)
	at hudson.maven.MavenModuleSetBuild$MavenModuleSetBuildExecution.parsePoms(MavenModuleSetBuild.java:943)
	at hudson.maven.MavenModuleSetBuild$MavenModuleSetBuildExecution.doRun(MavenModuleSetBuild.java:671)
	at hudson.model.AbstractBuild$AbstractBuildExecution.run(AbstractBuild.java:572)
	at hudson.model.Run.execute(Run.java:1665)
	at hudson.maven.MavenModuleSetBuild.run(MavenModuleSetBuild.java:519)
	at hudson.model.ResourceController.execute(ResourceController.java:88)
	at hudson.model.Executor.run(Executor.java:246)
Caused by: hudson.remoting.ProxyException: hudson.maven.MavenModuleSetBuild$MavenExecutionException:
org.apache.maven.project.ProjectBuildingException: Some problems were encountered while processing
the POMs:
[FATAL] Non-resolvable parent POM: Could not find artifact org.apache.jclouds:jclouds-project:pom:1.7.2-SNAPSHOT
in cloudbees-private-snapshot-repository (https://repository-jclouds.forge.cloudbees.com/snapshot)
and 'parent.relativePath' points at wrong local POM @ line 22, column 11

	at hudson.maven.MavenModuleSetBuild$PomParser.invoke(MavenModuleSetBuild.java:1347)
	at hudson.maven.MavenModuleSetBuild$PomParser.invoke(MavenModuleSetBuild.java:1081)
	at hudson.FilePath$FileCallableWrapper.call(FilePath.java:2444)
	at hudson.remoting.UserRequest.perform(UserRequest.java:118)
	at hudson.remoting.UserRequest.perform(UserRequest.java:48)
	at hudson.remoting.Request$2.run(Request.java:326)
	at hudson.remoting.InterceptingExecutorService$1.call(InterceptingExecutorService.java:72)
	at java.util.concurrent.FutureTask$Sync.innerRun(FutureTask.java:334)
	at java.util.concurrent.FutureTask.run(FutureTask.java:166)
	at java.util.concurrent.ThreadPoolExecutor.runWorker(ThreadPoolExecutor.java:1145)
	at java.util.concurrent.ThreadPoolExecutor$Worker.run(ThreadPoolExecutor.java:615)
	at java.lang.Thread.run(Thread.java:724)
Caused by: hudson.remoting.ProxyException: org.apache.maven.project.ProjectBuildingException:
Some problems were encountered while processing the POMs:
[FATAL] Non-resolvable parent POM: Could not find artifact org.apache.jclouds:jclouds-project:pom:1.7.2-SNAPSHOT
in cloudbees-private-snapshot-repository (https://repository-jclouds.forge.cloudbees.com/snapshot)
and 'parent.relativePath' points at wrong local POM @ line 22, column 11

	at org.apache.maven.project.DefaultProjectBuilder.build(DefaultProjectBuilder.java:364)
	at hudson.maven.MavenEmbedder.buildProjects(MavenEmbedder.java:361)
	at hudson.maven.MavenEmbedder.readProjects(MavenEmbedder.java:331)
	at hudson.maven.MavenModuleSetBuild$PomParser.invoke(MavenModuleSetBuild.java:1284)
	... 11 more
Sending e-mails to: notifications@jclouds.apache.org

Mime
View raw message