jclouds-notifications mailing list archives

Site index · List index
Message view « Date » · « Thread »
Top « Date » · « Thread »
From jenkins-no-re...@cloudbees.com
Subject Build failed in Jenkins: jclouds-karaf-1.7.x-branch #111
Date Tue, 11 Feb 2014 16:04:28 GMT
See <https://jclouds.ci.cloudbees.com/job/jclouds-karaf-1.7.x-branch/111/changes>

Changes:

[Ignasi Barrera] Update jclouds.version to 1.7.1

[Ignasi Barrera] [maven-release-plugin] prepare release jclouds-karaf-1.7.1-rc1

[Ignasi Barrera] [maven-release-plugin] prepare for next development iteration

[Ignasi Barrera] Bump jclouds.version to 1.7.2-SNAPSHOT

------------------------------------------
[...truncated 126 lines...]
[INFO] Downloaded: http://repo.cloudbees.com/content/repositories/central/org/codehaus/plexus/plexus-velocity/1.1.3/plexus-velocity-1.1.3.jar
(8 KB at 297.3 KB/sec)
[INFO] Downloaded: http://repo.cloudbees.com/content/repositories/central/org/apache/maven/doxia/doxia-sink-api/1.0-alpha-8/doxia-sink-api-1.0-alpha-8.jar
(7 KB at 152.3 KB/sec)
[INFO] Downloaded: http://repo.cloudbees.com/content/repositories/central/org/apache/maven/reporting/maven-reporting-api/2.0.4/maven-reporting-api-2.0.4.jar
(5 KB at 79.8 KB/sec)
[INFO] Downloading: https://repository-jclouds.forge.cloudbees.com/release/org/apache/rat/apache-rat-core/0.8/apache-rat-core-0.8.jar
[INFO] Downloading: https://repository-jclouds.forge.cloudbees.com/release/org/apache/commons/commons-compress/1.0/commons-compress-1.0.jar
[INFO] Downloading: https://repository-jclouds.forge.cloudbees.com/release/org/codehaus/plexus/plexus-utils/1.4/plexus-utils-1.4.jar
[INFO] Downloading: https://repository-jclouds.forge.cloudbees.com/release/org/apache/maven/doxia/doxia-site-renderer/1.0-alpha-8/doxia-site-renderer-1.0-alpha-8.jar
[INFO] Downloading: https://repository-jclouds.forge.cloudbees.com/release/org/apache/maven/doxia/doxia-core/1.0-alpha-8/doxia-core-1.0-alpha-8.jar
[INFO] Downloading: https://repository-jclouds.forge.cloudbees.com/release/org/apache/maven/doxia/doxia-sink-api/1.0-alpha-8/doxia-sink-api-1.0-alpha-8.jar
[INFO] Downloading: https://repository-jclouds.forge.cloudbees.com/release/org/codehaus/plexus/plexus-velocity/1.1.3/plexus-velocity-1.1.3.jar
[INFO] Downloading: https://repository-jclouds.forge.cloudbees.com/release/org/apache/maven/doxia/doxia-decoration-model/1.0-alpha-8/doxia-decoration-model-1.0-alpha-8.jar
[INFO] Downloading: https://repository-jclouds.forge.cloudbees.com/release/org/apache/maven/reporting/maven-reporting-api/2.0.4/maven-reporting-api-2.0.4.jar
[INFO] Exclude: **/LICENSE.txt
[INFO] Exclude: **/header.txt
[INFO] Exclude: **/NOTICE.txt
[INFO] Exclude: **/DISCLAIMER
[INFO] Exclude: **/BUILD.txt
[INFO] Exclude: **/CHANGES.txt
[INFO] Exclude: **/README.md
[INFO] Exclude: **/README.txt
[INFO] Exclude: **/DEPENDENCIES
[INFO] Exclude: .git/**
[INFO] Exclude: **/.gitignore
[INFO] Exclude: **/*.json
[INFO] Exclude: **/*.log*
[INFO] Exclude: **/TODO
[INFO] Exclude: .mailmap
[INFO] Exclude: .idea/**
[INFO] Exclude: **/*.iml
[INFO] Exclude: **/.project
[INFO] Exclude: **/.classpath
[INFO] Exclude: **/.settings/**
[INFO] Exclude: **/.checkstyle
[INFO] Exclude: **/target/**
[INFO] Exclude: .repository/**
[INFO] Exclude: **/src/main/resources/**/*.txt
[Unloading class sun.reflect.GeneratedConstructorAccessor27]
[INFO] 
[INFO] --- maven-install-plugin:2.3.1:install (default-install) @ jclouds-karaf ---
[INFO] Installing <https://jclouds.ci.cloudbees.com/job/jclouds-karaf-1.7.x-branch/ws/pom.xml>
to /home/jenkins/.m2/repository/org/apache/jclouds/jclouds-karaf/1.7.2-SNAPSHOT/jclouds-karaf-1.7.2-SNAPSHOT.pom
[INFO] 
[INFO] --- maven-deploy-plugin:2.7:deploy (default-deploy) @ jclouds-karaf ---
[INFO] Downloading: https://repository.apache.org/content/repositories/snapshots/org/apache/jclouds/jclouds-karaf/1.7.2-SNAPSHOT/maven-metadata.xml
[INFO] Uploading: https://repository.apache.org/content/repositories/snapshots/org/apache/jclouds/jclouds-karaf/1.7.2-SNAPSHOT/jclouds-karaf-1.7.2-20140211.160355-1.pom
[INFO] Uploaded: https://repository.apache.org/content/repositories/snapshots/org/apache/jclouds/jclouds-karaf/1.7.2-SNAPSHOT/jclouds-karaf-1.7.2-20140211.160355-1.pom
(22 KB at 13.2 KB/sec)
[INFO] Downloading: https://repository.apache.org/content/repositories/snapshots/org/apache/jclouds/jclouds-karaf/maven-metadata.xml
[INFO] Downloaded: https://repository.apache.org/content/repositories/snapshots/org/apache/jclouds/jclouds-karaf/maven-metadata.xml
(512 B at 0.6 KB/sec)
[INFO] Uploading: https://repository.apache.org/content/repositories/snapshots/org/apache/jclouds/jclouds-karaf/1.7.2-SNAPSHOT/maven-metadata.xml
[INFO] Uploaded: https://repository.apache.org/content/repositories/snapshots/org/apache/jclouds/jclouds-karaf/1.7.2-SNAPSHOT/maven-metadata.xml
(608 B at 0.9 KB/sec)
[INFO] Uploading: https://repository.apache.org/content/repositories/snapshots/org/apache/jclouds/jclouds-karaf/maven-metadata.xml
[INFO] Uploaded: https://repository.apache.org/content/repositories/snapshots/org/apache/jclouds/jclouds-karaf/maven-metadata.xml
(552 B at 0.5 KB/sec)
[INFO]                                                                         
[INFO] ------------------------------------------------------------------------
[INFO] Building jclouds :: Karaf :: Core 1.7.2-SNAPSHOT
[INFO] ------------------------------------------------------------------------
[INFO] Downloading: http://repo.cloudbees.com/content/repositories/central/com/google/guava/guava/15.0/guava-15.0.pom
[INFO] Downloaded: http://repo.cloudbees.com/content/repositories/central/com/google/guava/guava/15.0/guava-15.0.pom
(7 KB at 81.4 KB/sec)
[INFO] Downloading: https://repository-jclouds.forge.cloudbees.com/release/com/google/guava/guava/15.0/guava-15.0.pom
[INFO] Downloading: https://oss.sonatype.org/content/repositories/releases/com/google/guava/guava/15.0/guava-15.0.pom
[INFO] Downloaded: https://oss.sonatype.org/content/repositories/releases/com/google/guava/guava/15.0/guava-15.0.pom
(7 KB at 18.6 KB/sec)
[INFO] Downloading: http://download.java.net/maven/2/com/google/guava/guava/15.0/guava-15.0.pom
[INFO] Downloading: http://repo.cloudbees.com/content/repositories/central/com/google/guava/guava-parent/15.0/guava-parent-15.0.pom
[INFO] Downloaded: http://repo.cloudbees.com/content/repositories/central/com/google/guava/guava-parent/15.0/guava-parent-15.0.pom
(8 KB at 421.3 KB/sec)
[INFO] Downloading: https://repository-jclouds.forge.cloudbees.com/release/com/google/guava/guava-parent/15.0/guava-parent-15.0.pom
[INFO] Downloading: https://oss.sonatype.org/content/repositories/releases/com/google/guava/guava-parent/15.0/guava-parent-15.0.pom
[INFO] Downloaded: https://oss.sonatype.org/content/repositories/releases/com/google/guava/guava-parent/15.0/guava-parent-15.0.pom
(8 KB at 14.9 KB/sec)
[INFO] Downloading: http://download.java.net/maven/2/com/google/guava/guava-parent/15.0/guava-parent-15.0.pom
[INFO] Downloading: https://repository-jclouds.forge.cloudbees.com/snapshot/org/apache/jclouds/jclouds-core/1.7.2-SNAPSHOT/maven-metadata.xml
[INFO] Downloading: https://repository.apache.org/content/repositories/snapshots/org/apache/jclouds/jclouds-core/1.7.2-SNAPSHOT/maven-metadata.xml
[INFO] Downloading: http://download.java.net/maven/2/org/apache/jclouds/jclouds-core/1.7.2-SNAPSHOT/maven-metadata.xml
[INFO] Downloading: https://oss.sonatype.org/content/repositories/releases/org/apache/jclouds/jclouds-core/1.7.2-SNAPSHOT/maven-metadata.xml
[INFO] Downloading: http://repository.apache.org/snapshots/org/apache/jclouds/jclouds-core/1.7.2-SNAPSHOT/maven-metadata.xml
[INFO] Downloading: https://repository-jclouds.forge.cloudbees.com/snapshot/org/apache/jclouds/jclouds-core/1.7.2-SNAPSHOT/jclouds-core-1.7.2-SNAPSHOT.pom
[INFO] Downloading: https://repository.apache.org/content/repositories/snapshots/org/apache/jclouds/jclouds-core/1.7.2-SNAPSHOT/jclouds-core-1.7.2-SNAPSHOT.pom
[INFO] Downloading: https://oss.sonatype.org/content/repositories/releases/org/apache/jclouds/jclouds-core/1.7.2-SNAPSHOT/jclouds-core-1.7.2-SNAPSHOT.pom
[INFO] Downloading: http://download.java.net/maven/2/org/apache/jclouds/jclouds-core/1.7.2-SNAPSHOT/jclouds-core-1.7.2-SNAPSHOT.pom
[INFO] Downloading: http://repository.apache.org/snapshots/org/apache/jclouds/jclouds-core/1.7.2-SNAPSHOT/jclouds-core-1.7.2-SNAPSHOT.pom
[WARNING] The POM for org.apache.jclouds:jclouds-core:jar:1.7.2-SNAPSHOT is missing, no dependency
information available
[INFO] Downloading: https://repository-jclouds.forge.cloudbees.com/snapshot/org/apache/jclouds/jclouds-compute/1.7.2-SNAPSHOT/maven-metadata.xml
[INFO] Downloading: https://oss.sonatype.org/content/repositories/releases/org/apache/jclouds/jclouds-compute/1.7.2-SNAPSHOT/maven-metadata.xml
[INFO] Downloading: http://download.java.net/maven/2/org/apache/jclouds/jclouds-compute/1.7.2-SNAPSHOT/maven-metadata.xml
[INFO] Downloading: https://repository.apache.org/content/repositories/snapshots/org/apache/jclouds/jclouds-compute/1.7.2-SNAPSHOT/maven-metadata.xml
[INFO] Downloading: http://repository.apache.org/snapshots/org/apache/jclouds/jclouds-compute/1.7.2-SNAPSHOT/maven-metadata.xml
[INFO] Downloading: https://repository-jclouds.forge.cloudbees.com/snapshot/org/apache/jclouds/jclouds-compute/1.7.2-SNAPSHOT/jclouds-compute-1.7.2-SNAPSHOT.pom
[INFO] Downloading: https://repository.apache.org/content/repositories/snapshots/org/apache/jclouds/jclouds-compute/1.7.2-SNAPSHOT/jclouds-compute-1.7.2-SNAPSHOT.pom
[INFO] Downloading: https://oss.sonatype.org/content/repositories/releases/org/apache/jclouds/jclouds-compute/1.7.2-SNAPSHOT/jclouds-compute-1.7.2-SNAPSHOT.pom
[INFO] Downloading: http://download.java.net/maven/2/org/apache/jclouds/jclouds-compute/1.7.2-SNAPSHOT/jclouds-compute-1.7.2-SNAPSHOT.pom
[INFO] Downloading: http://repository.apache.org/snapshots/org/apache/jclouds/jclouds-compute/1.7.2-SNAPSHOT/jclouds-compute-1.7.2-SNAPSHOT.pom
[WARNING] The POM for org.apache.jclouds:jclouds-compute:jar:1.7.2-SNAPSHOT is missing, no
dependency information available
[INFO] Downloading: https://repository-jclouds.forge.cloudbees.com/snapshot/org/apache/jclouds/jclouds-blobstore/1.7.2-SNAPSHOT/maven-metadata.xml
[INFO] Downloading: https://repository.apache.org/content/repositories/snapshots/org/apache/jclouds/jclouds-blobstore/1.7.2-SNAPSHOT/maven-metadata.xml
[INFO] Downloading: http://download.java.net/maven/2/org/apache/jclouds/jclouds-blobstore/1.7.2-SNAPSHOT/maven-metadata.xml
[INFO] Downloading: https://oss.sonatype.org/content/repositories/releases/org/apache/jclouds/jclouds-blobstore/1.7.2-SNAPSHOT/maven-metadata.xml
[INFO] Downloading: http://repository.apache.org/snapshots/org/apache/jclouds/jclouds-blobstore/1.7.2-SNAPSHOT/maven-metadata.xml
[INFO] Downloading: https://repository-jclouds.forge.cloudbees.com/snapshot/org/apache/jclouds/jclouds-blobstore/1.7.2-SNAPSHOT/jclouds-blobstore-1.7.2-SNAPSHOT.pom
[INFO] Downloading: https://repository.apache.org/content/repositories/snapshots/org/apache/jclouds/jclouds-blobstore/1.7.2-SNAPSHOT/jclouds-blobstore-1.7.2-SNAPSHOT.pom
[INFO] Downloading: https://oss.sonatype.org/content/repositories/releases/org/apache/jclouds/jclouds-blobstore/1.7.2-SNAPSHOT/jclouds-blobstore-1.7.2-SNAPSHOT.pom
[INFO] Downloading: http://download.java.net/maven/2/org/apache/jclouds/jclouds-blobstore/1.7.2-SNAPSHOT/jclouds-blobstore-1.7.2-SNAPSHOT.pom
[INFO] Downloading: http://repository.apache.org/snapshots/org/apache/jclouds/jclouds-blobstore/1.7.2-SNAPSHOT/jclouds-blobstore-1.7.2-SNAPSHOT.pom
[WARNING] The POM for org.apache.jclouds:jclouds-blobstore:jar:1.7.2-SNAPSHOT is missing,
no dependency information available
[INFO] Downloading: https://repository-jclouds.forge.cloudbees.com/snapshot/org/apache/jclouds/jclouds-scriptbuilder/1.7.2-SNAPSHOT/maven-metadata.xml
[INFO] Downloading: https://repository.apache.org/content/repositories/snapshots/org/apache/jclouds/jclouds-scriptbuilder/1.7.2-SNAPSHOT/maven-metadata.xml
[INFO] Downloading: https://oss.sonatype.org/content/repositories/releases/org/apache/jclouds/jclouds-scriptbuilder/1.7.2-SNAPSHOT/maven-metadata.xml
[INFO] Downloading: http://download.java.net/maven/2/org/apache/jclouds/jclouds-scriptbuilder/1.7.2-SNAPSHOT/maven-metadata.xml
[INFO] Downloading: http://repository.apache.org/snapshots/org/apache/jclouds/jclouds-scriptbuilder/1.7.2-SNAPSHOT/maven-metadata.xml
[INFO] Downloading: https://repository-jclouds.forge.cloudbees.com/snapshot/org/apache/jclouds/jclouds-scriptbuilder/1.7.2-SNAPSHOT/jclouds-scriptbuilder-1.7.2-SNAPSHOT.pom
[INFO] Downloading: https://repository.apache.org/content/repositories/snapshots/org/apache/jclouds/jclouds-scriptbuilder/1.7.2-SNAPSHOT/jclouds-scriptbuilder-1.7.2-SNAPSHOT.pom
[INFO] Downloading: https://oss.sonatype.org/content/repositories/releases/org/apache/jclouds/jclouds-scriptbuilder/1.7.2-SNAPSHOT/jclouds-scriptbuilder-1.7.2-SNAPSHOT.pom
[INFO] Downloading: http://download.java.net/maven/2/org/apache/jclouds/jclouds-scriptbuilder/1.7.2-SNAPSHOT/jclouds-scriptbuilder-1.7.2-SNAPSHOT.pom
[INFO] Downloading: http://repository.apache.org/snapshots/org/apache/jclouds/jclouds-scriptbuilder/1.7.2-SNAPSHOT/jclouds-scriptbuilder-1.7.2-SNAPSHOT.pom
[WARNING] The POM for org.apache.jclouds:jclouds-scriptbuilder:jar:1.7.2-SNAPSHOT is missing,
no dependency information available
[INFO] Downloading: http://repo.cloudbees.com/content/repositories/central/com/google/guava/guava/15.0/guava-15.0.jar
[INFO] Downloaded: http://repo.cloudbees.com/content/repositories/central/com/google/guava/guava/15.0/guava-15.0.jar
(2122 KB at 6095.6 KB/sec)
[INFO] Downloading: https://repository-jclouds.forge.cloudbees.com/release/com/google/guava/guava/15.0/guava-15.0.jar
[INFO] Downloading: https://oss.sonatype.org/content/repositories/releases/com/google/guava/guava/15.0/guava-15.0.jar
[INFO] Downloaded: https://oss.sonatype.org/content/repositories/releases/com/google/guava/guava/15.0/guava-15.0.jar
(2122 KB at 1471.1 KB/sec)
[INFO] Downloading: http://download.java.net/maven/2/com/google/guava/guava/15.0/guava-15.0.jar
[INFO] Downloading: https://repository-jclouds.forge.cloudbees.com/snapshot/org/apache/jclouds/jclouds-core/1.7.2-SNAPSHOT/jclouds-core-1.7.2-SNAPSHOT.jar
[INFO] Downloading: https://repository-jclouds.forge.cloudbees.com/snapshot/org/apache/jclouds/jclouds-compute/1.7.2-SNAPSHOT/jclouds-compute-1.7.2-SNAPSHOT.jar
[INFO] Downloading: https://repository-jclouds.forge.cloudbees.com/snapshot/org/apache/jclouds/jclouds-blobstore/1.7.2-SNAPSHOT/jclouds-blobstore-1.7.2-SNAPSHOT.jar
[INFO] Downloading: https://repository-jclouds.forge.cloudbees.com/snapshot/org/apache/jclouds/jclouds-scriptbuilder/1.7.2-SNAPSHOT/jclouds-scriptbuilder-1.7.2-SNAPSHOT.jar
[INFO] Downloading: https://repository.apache.org/content/repositories/snapshots/org/apache/jclouds/jclouds-core/1.7.2-SNAPSHOT/jclouds-core-1.7.2-SNAPSHOT.jar
[INFO] Downloading: https://repository.apache.org/content/repositories/snapshots/org/apache/jclouds/jclouds-compute/1.7.2-SNAPSHOT/jclouds-compute-1.7.2-SNAPSHOT.jar
[INFO] Downloading: https://repository.apache.org/content/repositories/snapshots/org/apache/jclouds/jclouds-blobstore/1.7.2-SNAPSHOT/jclouds-blobstore-1.7.2-SNAPSHOT.jar
[INFO] Downloading: https://repository.apache.org/content/repositories/snapshots/org/apache/jclouds/jclouds-scriptbuilder/1.7.2-SNAPSHOT/jclouds-scriptbuilder-1.7.2-SNAPSHOT.jar
[INFO] Downloading: https://oss.sonatype.org/content/repositories/releases/org/apache/jclouds/jclouds-core/1.7.2-SNAPSHOT/jclouds-core-1.7.2-SNAPSHOT.jar
[INFO] Downloading: https://oss.sonatype.org/content/repositories/releases/org/apache/jclouds/jclouds-compute/1.7.2-SNAPSHOT/jclouds-compute-1.7.2-SNAPSHOT.jar
[INFO] Downloading: https://oss.sonatype.org/content/repositories/releases/org/apache/jclouds/jclouds-blobstore/1.7.2-SNAPSHOT/jclouds-blobstore-1.7.2-SNAPSHOT.jar
[INFO] Downloading: https://oss.sonatype.org/content/repositories/releases/org/apache/jclouds/jclouds-scriptbuilder/1.7.2-SNAPSHOT/jclouds-scriptbuilder-1.7.2-SNAPSHOT.jar
[INFO] Downloading: http://download.java.net/maven/2/org/apache/jclouds/jclouds-core/1.7.2-SNAPSHOT/jclouds-core-1.7.2-SNAPSHOT.jar
[INFO] Downloading: http://download.java.net/maven/2/org/apache/jclouds/jclouds-compute/1.7.2-SNAPSHOT/jclouds-compute-1.7.2-SNAPSHOT.jar
[INFO] Downloading: http://download.java.net/maven/2/org/apache/jclouds/jclouds-blobstore/1.7.2-SNAPSHOT/jclouds-blobstore-1.7.2-SNAPSHOT.jar
[INFO] Downloading: http://download.java.net/maven/2/org/apache/jclouds/jclouds-scriptbuilder/1.7.2-SNAPSHOT/jclouds-scriptbuilder-1.7.2-SNAPSHOT.jar
[INFO] Downloading: http://repository.apache.org/snapshots/org/apache/jclouds/jclouds-core/1.7.2-SNAPSHOT/jclouds-core-1.7.2-SNAPSHOT.jar
[INFO] Downloading: http://repository.apache.org/snapshots/org/apache/jclouds/jclouds-compute/1.7.2-SNAPSHOT/jclouds-compute-1.7.2-SNAPSHOT.jar
[INFO] Downloading: http://repository.apache.org/snapshots/org/apache/jclouds/jclouds-blobstore/1.7.2-SNAPSHOT/jclouds-blobstore-1.7.2-SNAPSHOT.jar
[INFO] Downloading: http://repository.apache.org/snapshots/org/apache/jclouds/jclouds-scriptbuilder/1.7.2-SNAPSHOT/jclouds-scriptbuilder-1.7.2-SNAPSHOT.jar
[INFO] ------------------------------------------------------------------------
[INFO] Reactor Summary:
[INFO] 
[INFO] Apache jclouds :: Karaf ........................... SUCCESS [30.445s]
[INFO] jclouds :: Karaf :: Core .......................... FAILURE [14.456s]
[INFO] jclouds :: Karaf :: Utils ......................... SKIPPED
[INFO] jclouds :: Karaf :: Recipe ........................ SKIPPED
[INFO] jclouds :: Karaf :: Cache ......................... SKIPPED
[INFO] jclouds :: Karaf :: Services ...................... SKIPPED
[INFO] jclouds :: Karaf :: Commands ...................... SKIPPED
[INFO] jclouds :: Karaf :: URL Handler ................... SKIPPED
[INFO] jclouds :: Karaf :: Chef .......................... SKIPPED
[INFO] jclouds :: Karaf :: Chef :: Core .................. SKIPPED
[INFO] jclouds :: Karaf :: Chef :: Services .............. SKIPPED
[INFO] jclouds :: Karaf :: Chef :: Commands .............. SKIPPED
[INFO] jclouds :: Karaf :: Chef :: Cache ................. SKIPPED
[INFO] jclouds :: Karaf :: Feature ....................... SKIPPED
[INFO] jclouds :: Karaf :: Integration Tests ............. SKIPPED
[INFO] ------------------------------------------------------------------------
[INFO] BUILD FAILURE
[INFO] ------------------------------------------------------------------------
[INFO] Total time: 54.665s
[INFO] Finished at: Tue Feb 11 11:04:18 EST 2014
[Unloading class GregorSamsa$2]
[Unloading class GregorSamsa]
[Unloading class GregorSamsa$0]
[Unloading class GregorSamsa$1]
[INFO] Final Memory: 19M/129M
[INFO] ------------------------------------------------------------------------
[WARNING] The requested profile "doc" could not be activated because it does not exist.
[WARNING] The requested profile "src" could not be activated because it does not exist.
Waiting for Jenkins to finish collecting data
[ERROR] Failed to execute goal on project core: Could not resolve dependencies for project
org.apache.jclouds.karaf:core:bundle:1.7.2-SNAPSHOT: The following artifacts could not be
resolved: org.apache.jclouds:jclouds-core:jar:1.7.2-SNAPSHOT, org.apache.jclouds:jclouds-compute:jar:1.7.2-SNAPSHOT,
org.apache.jclouds:jclouds-blobstore:jar:1.7.2-SNAPSHOT, org.apache.jclouds:jclouds-scriptbuilder:jar:1.7.2-SNAPSHOT:
Could not find artifact org.apache.jclouds:jclouds-core:jar:1.7.2-SNAPSHOT in cloudbees-private-snapshot-repository
(https://repository-jclouds.forge.cloudbees.com/snapshot) -> [Help 1]
org.apache.maven.lifecycle.LifecycleExecutionException: Failed to execute goal on project
core: Could not resolve dependencies for project org.apache.jclouds.karaf:core:bundle:1.7.2-SNAPSHOT:
The following artifacts could not be resolved: org.apache.jclouds:jclouds-core:jar:1.7.2-SNAPSHOT,
org.apache.jclouds:jclouds-compute:jar:1.7.2-SNAPSHOT, org.apache.jclouds:jclouds-blobstore:jar:1.7.2-SNAPSHOT,
org.apache.jclouds:jclouds-scriptbuilder:jar:1.7.2-SNAPSHOT: Could not find artifact org.apache.jclouds:jclouds-core:jar:1.7.2-SNAPSHOT
in cloudbees-private-snapshot-repository (https://repository-jclouds.forge.cloudbees.com/snapshot)
	at org.apache.maven.lifecycle.internal.LifecycleDependencyResolver.getDependencies(LifecycleDependencyResolver.java:220)
	at org.apache.maven.lifecycle.internal.LifecycleDependencyResolver.resolveProjectDependencies(LifecycleDependencyResolver.java:127)
	at org.apache.maven.lifecycle.internal.MojoExecutor.ensureDependenciesAreResolved(MojoExecutor.java:257)
	at org.apache.maven.lifecycle.internal.MojoExecutor.execute(MojoExecutor.java:200)
	at org.apache.maven.lifecycle.internal.MojoExecutor.execute(MojoExecutor.java:153)
	at org.apache.maven.lifecycle.internal.MojoExecutor.execute(MojoExecutor.java:145)
	at org.apache.maven.lifecycle.internal.LifecycleModuleBuilder.buildProject(LifecycleModuleBuilder.java:84)
	at org.apache.maven.lifecycle.internal.LifecycleModuleBuilder.buildProject(LifecycleModuleBuilder.java:59)
	at org.apache.maven.lifecycle.internal.LifecycleStarter.singleThreadedBuild(LifecycleStarter.java:183)
	at org.apache.maven.lifecycle.internal.LifecycleStarter.execute(LifecycleStarter.java:161)
	at org.apache.maven.DefaultMaven.doExecute(DefaultMaven.java:318)
	at org.apache.maven.DefaultMaven.execute(DefaultMaven.java:153)
	at org.jvnet.hudson.maven3.launcher.Maven31Launcher.main(Maven31Launcher.java:132)
	at sun.reflect.NativeMethodAccessorImpl.invoke0(Native Method)
	at sun.reflect.NativeMethodAccessorImpl.invoke(NativeMethodAccessorImpl.java:39)
	at sun.reflect.DelegatingMethodAccessorImpl.invoke(DelegatingMethodAccessorImpl.java:25)
	at java.lang.reflect.Method.invoke(Method.java:597)
	at org.codehaus.plexus.classworlds.launcher.Launcher.launchStandard(Launcher.java:331)
	at org.codehaus.plexus.classworlds.launcher.Launcher.launch(Launcher.java:239)
	at jenkins.maven3.agent.Maven31Main.launch(Maven31Main.java:181)
	at sun.reflect.NativeMethodAccessorImpl.invoke0(Native Method)
	at sun.reflect.NativeMethodAccessorImpl.invoke(NativeMethodAccessorImpl.java:39)
	at sun.reflect.DelegatingMethodAccessorImpl.invoke(DelegatingMethodAccessorImpl.java:25)
	at java.lang.reflect.Method.invoke(Method.java:597)
	at hudson.maven.Maven3Builder.call(Maven3Builder.java:134)
	at hudson.maven.Maven3Builder.call(Maven3Builder.java:69)
	at hudson.remoting.UserRequest.perform(UserRequest.java:118)
[JENKINS] Archiving <https://jclouds.ci.cloudbees.com/job/jclouds-karaf-1.7.x-branch/ws/chef/commands/pom.xml>
to org.apache.jclouds.karaf.chef/commands/1.7.2-SNAPSHOT/commands-1.7.2-SNAPSHOT.pom
	at hudson.remoting.UserRequest.perform(UserRequest.java:48)
	at hudson.remoting.Request$2.run(Request.java:326)
	at hudson.remoting.InterceptingExecutorService$1.call(InterceptingExecutorService.java:72)
	at java.util.concurrent.FutureTask$Sync.innerRun(FutureTask.java:303)
	at java.util.concurrent.FutureTask.run(FutureTask.java:138)
	at java.util.concurrent.ThreadPoolExecutor$Worker.runTask(ThreadPoolExecutor.java:895)
	at java.util.concurrent.ThreadPoolExecutor$Worker.run(ThreadPoolExecutor.java:918)
	at java.lang.Thread.run(Thread.java:662)
Caused by: org.apache.maven.project.DependencyResolutionException: Could not resolve dependencies
for project org.apache.jclouds.karaf:core:bundle:1.7.2-SNAPSHOT: The following artifacts could
not be resolved: org.apache.jclouds:jclouds-core:jar:1.7.2-SNAPSHOT, org.apache.jclouds:jclouds-compute:jar:1.7.2-SNAPSHOT,
org.apache.jclouds:jclouds-blobstore:jar:1.7.2-SNAPSHOT, org.apache.jclouds:jclouds-scriptbuilder:jar:1.7.2-SNAPSHOT:
Could not find artifact org.apache.jclouds:jclouds-core:jar:1.7.2-SNAPSHOT in cloudbees-private-snapshot-repository
(https://repository-jclouds.forge.cloudbees.com/snapshot)
	at org.apache.maven.project.DefaultProjectDependenciesResolver.resolve(DefaultProjectDependenciesResolver.java:198)
	at org.apache.maven.lifecycle.internal.LifecycleDependencyResolver.getDependencies(LifecycleDependencyResolver.java:195)
	... 34 more
Caused by: org.eclipse.aether.resolution.DependencyResolutionException: The following artifacts
could not be resolved: org.apache.jclouds:jclouds-core:jar:1.7.2-SNAPSHOT, org.apache.jclouds:jclouds-compute:jar:1.7.2-SNAPSHOT,
org.apache.jclouds:jclouds-blobstore:jar:1.7.2-SNAPSHOT, org.apache.jclouds:jclouds-scriptbuilder:jar:1.7.2-SNAPSHOT:
Could not find artifact org.apache.jclouds:jclouds-core:jar:1.7.2-SNAPSHOT in cloudbees-private-snapshot-repository
(https://repository-jclouds.forge.cloudbees.com/snapshot)
	at org.eclipse.aether.internal.impl.DefaultRepositorySystem.resolveDependencies(DefaultRepositorySystem.java:384)
	at org.apache.maven.project.DefaultProjectDependenciesResolver.resolve(DefaultProjectDependenciesResolver.java:192)
	... 35 more
Caused by: org.eclipse.aether.resolution.ArtifactResolutionException: The following artifacts
could not be resolved: org.apache.jclouds:jclouds-core:jar:1.7.2-SNAPSHOT, org.apache.jclouds:jclouds-compute:jar:1.7.2-SNAPSHOT,
org.apache.jclouds:jclouds-blobstore:jar:1.7.2-SNAPSHOT, org.apache.jclouds:jclouds-scriptbuilder:jar:1.7.2-SNAPSHOT:
Could not find artifact org.apache.jclouds:jclouds-core:jar:1.7.2-SNAPSHOT in cloudbees-private-snapshot-repository
(https://repository-jclouds.forge.cloudbees.com/snapshot)
	at org.eclipse.aether.internal.impl.DefaultArtifactResolver.resolve(DefaultArtifactResolver.java:459)
	at org.eclipse.aether.internal.impl.DefaultArtifactResolver.resolveArtifacts(DefaultArtifactResolver.java:262)
	at org.eclipse.aether.internal.impl.DefaultRepositorySystem.resolveDependencies(DefaultRepositorySystem.java:367)
	... 36 more
Caused by: org.eclipse.aether.transfer.ArtifactNotFoundException: Could not find artifact
org.apache.jclouds:jclouds-core:jar:1.7.2-SNAPSHOT in cloudbees-private-snapshot-repository
(https://repository-jclouds.forge.cloudbees.com/snapshot)
	at org.eclipse.aether.connector.wagon.WagonRepositoryConnector$6.wrap(WagonRepositoryConnector.java:1012)
	at org.eclipse.aether.connector.wagon.WagonRepositoryConnector$6.wrap(WagonRepositoryConnector.java:1004)
	at org.eclipse.aether.connector.wagon.WagonRepositoryConnector$GetTask.run(WagonRepositoryConnector.java:725)
	at org.eclipse.aether.util.concurrency.RunnableErrorForwarder$1.run(RunnableErrorForwarder.java:67)
	... 3 more
[ERROR] 
[ERROR] Re-run Maven using the -X switch to enable full debug logging.
[ERROR] 
[ERROR] For more information about the errors and possible solutions, please read the following
articles:
[ERROR] [Help 1] http://cwiki.apache.org/confluence/display/MAVEN/DependencyResolutionException
[ERROR] 
[ERROR] After correcting the problems, you can resume the build with the command
[ERROR]   mvn <goals> -rf :core
[JENKINS] Archiving <https://jclouds.ci.cloudbees.com/job/jclouds-karaf-1.7.x-branch/ws/chef/cache/pom.xml>
to org.apache.jclouds.karaf.chef/cache/1.7.2-SNAPSHOT/cache-1.7.2-SNAPSHOT.pom
[JENKINS] Archiving <https://jclouds.ci.cloudbees.com/job/jclouds-karaf-1.7.x-branch/ws/commands/pom.xml>
to org.apache.jclouds.karaf/commands/1.7.2-SNAPSHOT/commands-1.7.2-SNAPSHOT.pom
[JENKINS] Archiving <https://jclouds.ci.cloudbees.com/job/jclouds-karaf-1.7.x-branch/ws/utils/pom.xml>
to org.apache.jclouds.karaf/utils/1.7.2-SNAPSHOT/utils-1.7.2-SNAPSHOT.pom
[JENKINS] Archiving <https://jclouds.ci.cloudbees.com/job/jclouds-karaf-1.7.x-branch/ws/feature/pom.xml>
to org.apache.jclouds.karaf/jclouds-karaf/1.7.2-SNAPSHOT/jclouds-karaf-1.7.2-SNAPSHOT.pom
[JENKINS] Archiving <https://jclouds.ci.cloudbees.com/job/jclouds-karaf-1.7.x-branch/ws/itests/pom.xml>
to org.apache.jclouds.karaf/itests/1.7.2-SNAPSHOT/itests-1.7.2-SNAPSHOT.pom
[JENKINS] Archiving <https://jclouds.ci.cloudbees.com/job/jclouds-karaf-1.7.x-branch/ws/chef/core/pom.xml>
to org.apache.jclouds.karaf.chef/core/1.7.2-SNAPSHOT/core-1.7.2-SNAPSHOT.pom
[JENKINS] Archiving <https://jclouds.ci.cloudbees.com/job/jclouds-karaf-1.7.x-branch/ws/urlhandler/pom.xml>
to org.apache.jclouds.karaf/urlhandler/1.7.2-SNAPSHOT/urlhandler-1.7.2-SNAPSHOT.pom
[JENKINS] Archiving <https://jclouds.ci.cloudbees.com/job/jclouds-karaf-1.7.x-branch/ws/services/pom.xml>
to org.apache.jclouds.karaf/services/1.7.2-SNAPSHOT/services-1.7.2-SNAPSHOT.pom
[JENKINS] Archiving <https://jclouds.ci.cloudbees.com/job/jclouds-karaf-1.7.x-branch/ws/core/pom.xml>
to org.apache.jclouds.karaf/core/1.7.2-SNAPSHOT/core-1.7.2-SNAPSHOT.pom
[JENKINS] Archiving <https://jclouds.ci.cloudbees.com/job/jclouds-karaf-1.7.x-branch/ws/recipe/pom.xml>
to org.apache.jclouds.karaf/recipe/1.7.2-SNAPSHOT/recipe-1.7.2-SNAPSHOT.pom
[JENKINS] Archiving <https://jclouds.ci.cloudbees.com/job/jclouds-karaf-1.7.x-branch/ws/chef/services/pom.xml>
to org.apache.jclouds.karaf.chef/services/1.7.2-SNAPSHOT/services-1.7.2-SNAPSHOT.pom
[JENKINS] Archiving <https://jclouds.ci.cloudbees.com/job/jclouds-karaf-1.7.x-branch/ws/chef/pom.xml>
to org.apache.jclouds.karaf/chef/1.7.2-SNAPSHOT/chef-1.7.2-SNAPSHOT.pom
[JENKINS] Archiving <https://jclouds.ci.cloudbees.com/job/jclouds-karaf-1.7.x-branch/ws/cache/pom.xml>
to org.apache.jclouds.karaf/cache/1.7.2-SNAPSHOT/cache-1.7.2-SNAPSHOT.pom
[JENKINS] Archiving <https://jclouds.ci.cloudbees.com/job/jclouds-karaf-1.7.x-branch/ws/pom.xml>
to org.apache.jclouds/jclouds-karaf/1.7.2-SNAPSHOT/jclouds-karaf-1.7.2-SNAPSHOT.pom
channel stopped

Mime
View raw message