jclouds-notifications mailing list archives

Site index · List index
Message view « Date » · « Thread »
Top « Date » · « Thread »
From jenkins-no-re...@cloudbees.com
Subject Build failed in Jenkins: jclouds-karaf #637
Date Mon, 02 Jun 2014 15:51:38 GMT
See <https://jclouds.ci.cloudbees.com/job/jclouds-karaf/637/>

------------------------------------------
[...truncated 945 lines...]
[INFO] --- maven-bundle-plugin:2.1.0:deploy (default-deploy) @ services ---
[INFO] Remote OBR update disabled (enable with -DremoteOBR)
[INFO]                                                                         
[INFO] ------------------------------------------------------------------------
[INFO] Building jclouds :: Karaf :: Commands 1.8.0-SNAPSHOT
[INFO] ------------------------------------------------------------------------
Downloading: https://repository-jclouds.forge.cloudbees.com/snapshot/org/apache/jclouds/api/ec2/1.8.0-SNAPSHOT/maven-metadata.xml
Downloading: https://oss.sonatype.org/content/repositories/releases/org/apache/jclouds/api/ec2/1.8.0-SNAPSHOT/maven-metadata.xml
Downloading: https://repository.apache.org/content/repositories/snapshots/org/apache/jclouds/api/ec2/1.8.0-SNAPSHOT/maven-metadata.xml
Downloading: http://download.java.net/maven/2/org/apache/jclouds/api/ec2/1.8.0-SNAPSHOT/maven-metadata.xml
Downloading: http://repository.apache.org/snapshots/org/apache/jclouds/api/ec2/1.8.0-SNAPSHOT/maven-metadata.xml
Downloaded: https://repository.apache.org/content/repositories/snapshots/org/apache/jclouds/api/ec2/1.8.0-SNAPSHOT/maven-metadata.xml
(2 KB at 2.5 KB/sec)
Downloaded: http://repository.apache.org/snapshots/org/apache/jclouds/api/ec2/1.8.0-SNAPSHOT/maven-metadata.xml
(2 KB at 2.1 KB/sec)
Downloading: https://repository-jclouds.forge.cloudbees.com/snapshot/org/apache/jclouds/api/ec2/1.8.0-SNAPSHOT/ec2-1.8.0-20140602.153249-179.pom
Downloading: https://repository.apache.org/content/repositories/snapshots/org/apache/jclouds/api/ec2/1.8.0-SNAPSHOT/ec2-1.8.0-20140602.153249-179.pom
Downloaded: https://repository.apache.org/content/repositories/snapshots/org/apache/jclouds/api/ec2/1.8.0-SNAPSHOT/ec2-1.8.0-20140602.153249-179.pom
(6 KB at 18.6 KB/sec)
Downloading: https://repository-jclouds.forge.cloudbees.com/snapshot/org/apache/jclouds/api/sts/1.8.0-SNAPSHOT/maven-metadata.xml
Downloading: https://repository.apache.org/content/repositories/snapshots/org/apache/jclouds/api/sts/1.8.0-SNAPSHOT/maven-metadata.xml
Downloading: https://oss.sonatype.org/content/repositories/releases/org/apache/jclouds/api/sts/1.8.0-SNAPSHOT/maven-metadata.xml
Downloading: http://download.java.net/maven/2/org/apache/jclouds/api/sts/1.8.0-SNAPSHOT/maven-metadata.xml
Downloading: http://repository.apache.org/snapshots/org/apache/jclouds/api/sts/1.8.0-SNAPSHOT/maven-metadata.xml
Downloaded: https://repository.apache.org/content/repositories/snapshots/org/apache/jclouds/api/sts/1.8.0-SNAPSHOT/maven-metadata.xml
(2 KB at 2.8 KB/sec)
Downloaded: http://repository.apache.org/snapshots/org/apache/jclouds/api/sts/1.8.0-SNAPSHOT/maven-metadata.xml
(2 KB at 2.3 KB/sec)
Downloading: https://repository-jclouds.forge.cloudbees.com/snapshot/org/apache/jclouds/api/sts/1.8.0-SNAPSHOT/sts-1.8.0-20140602.152657-186.pom
Downloading: https://repository.apache.org/content/repositories/snapshots/org/apache/jclouds/api/sts/1.8.0-SNAPSHOT/sts-1.8.0-20140602.152657-186.pom
Downloaded: https://repository.apache.org/content/repositories/snapshots/org/apache/jclouds/api/sts/1.8.0-SNAPSHOT/sts-1.8.0-20140602.152657-186.pom
(4 KB at 12.7 KB/sec)
Downloading: https://repository-jclouds.forge.cloudbees.com/snapshot/org/apache/jclouds/driver/jclouds-jsch/1.8.0-SNAPSHOT/maven-metadata.xml
Downloading: https://oss.sonatype.org/content/repositories/releases/org/apache/jclouds/driver/jclouds-jsch/1.8.0-SNAPSHOT/maven-metadata.xml
Downloading: http://download.java.net/maven/2/org/apache/jclouds/driver/jclouds-jsch/1.8.0-SNAPSHOT/maven-metadata.xml
Downloading: https://repository.apache.org/content/repositories/snapshots/org/apache/jclouds/driver/jclouds-jsch/1.8.0-SNAPSHOT/maven-metadata.xml
Downloading: http://repository.apache.org/snapshots/org/apache/jclouds/driver/jclouds-jsch/1.8.0-SNAPSHOT/maven-metadata.xml
Downloaded: https://repository.apache.org/content/repositories/snapshots/org/apache/jclouds/driver/jclouds-jsch/1.8.0-SNAPSHOT/maven-metadata.xml
(2 KB at 2.7 KB/sec)
Downloaded: http://repository.apache.org/snapshots/org/apache/jclouds/driver/jclouds-jsch/1.8.0-SNAPSHOT/maven-metadata.xml
(2 KB at 2.1 KB/sec)
Downloading: https://repository-jclouds.forge.cloudbees.com/snapshot/org/apache/jclouds/driver/jclouds-jsch/1.8.0-SNAPSHOT/jclouds-jsch-1.8.0-20140530.225134-166.pom
Downloading: https://repository.apache.org/content/repositories/snapshots/org/apache/jclouds/driver/jclouds-jsch/1.8.0-SNAPSHOT/jclouds-jsch-1.8.0-20140530.225134-166.pom
Downloaded: https://repository.apache.org/content/repositories/snapshots/org/apache/jclouds/driver/jclouds-jsch/1.8.0-SNAPSHOT/jclouds-jsch-1.8.0-20140530.225134-166.pom
(6 KB at 12.0 KB/sec)
Downloading: https://repository.apache.org/content/repositories/snapshots/org/apache/jclouds/api/ec2/1.8.0-SNAPSHOT/ec2-1.8.0-20140602.153249-179.jar
Downloading: https://repository.apache.org/content/repositories/snapshots/org/apache/jclouds/api/sts/1.8.0-SNAPSHOT/sts-1.8.0-20140602.152657-186.jar
Downloading: https://repository.apache.org/content/repositories/snapshots/org/apache/jclouds/driver/jclouds-jsch/1.8.0-SNAPSHOT/jclouds-jsch-1.8.0-20140530.225134-166.jar
Downloaded: https://repository.apache.org/content/repositories/snapshots/org/apache/jclouds/driver/jclouds-jsch/1.8.0-SNAPSHOT/jclouds-jsch-1.8.0-20140530.225134-166.jar
(37 KB at 39.2 KB/sec)
Downloaded: https://repository.apache.org/content/repositories/snapshots/org/apache/jclouds/api/sts/1.8.0-SNAPSHOT/sts-1.8.0-20140602.152657-186.jar
(64 KB at 64.8 KB/sec)
Downloaded: https://repository.apache.org/content/repositories/snapshots/org/apache/jclouds/api/ec2/1.8.0-SNAPSHOT/ec2-1.8.0-20140602.153249-179.jar
(392 KB at 305.3 KB/sec)
[INFO] 
[INFO] --- maven-clean-plugin:2.5:clean (default-clean) @ commands ---
[INFO] 
[INFO] --- maven-remote-resources-plugin:1.5:process (default) @ commands ---
Downloading: https://repository-jclouds.forge.cloudbees.com/snapshot/org/apache/jclouds/api/sts/1.8.0-SNAPSHOT/maven-metadata.xml
Downloading: https://repository.apache.org/content/repositories/snapshots/org/apache/jclouds/api/sts/1.8.0-SNAPSHOT/maven-metadata.xml
Downloading: http://download.java.net/maven/2/org/apache/jclouds/api/sts/1.8.0-SNAPSHOT/maven-metadata.xml
Downloading: https://oss.sonatype.org/content/repositories/releases/org/apache/jclouds/api/sts/1.8.0-SNAPSHOT/maven-metadata.xml
Downloading: http://repository.apache.org/snapshots/org/apache/jclouds/api/sts/1.8.0-SNAPSHOT/maven-metadata.xml
Downloaded: https://repository.apache.org/content/repositories/snapshots/org/apache/jclouds/api/sts/1.8.0-SNAPSHOT/maven-metadata.xml
(2 KB at 6.3 KB/sec)
Downloaded: http://repository.apache.org/snapshots/org/apache/jclouds/api/sts/1.8.0-SNAPSHOT/maven-metadata.xml
(2 KB at 6.5 KB/sec)
Downloading: https://repository-jclouds.forge.cloudbees.com/snapshot/org/apache/jclouds/driver/jclouds-jsch/1.8.0-SNAPSHOT/maven-metadata.xml
Downloading: https://oss.sonatype.org/content/repositories/releases/org/apache/jclouds/driver/jclouds-jsch/1.8.0-SNAPSHOT/maven-metadata.xml
Downloading: https://repository.apache.org/content/repositories/snapshots/org/apache/jclouds/driver/jclouds-jsch/1.8.0-SNAPSHOT/maven-metadata.xml
Downloading: http://download.java.net/maven/2/org/apache/jclouds/driver/jclouds-jsch/1.8.0-SNAPSHOT/maven-metadata.xml
Downloading: http://repository.apache.org/snapshots/org/apache/jclouds/driver/jclouds-jsch/1.8.0-SNAPSHOT/maven-metadata.xml
Downloaded: https://repository.apache.org/content/repositories/snapshots/org/apache/jclouds/driver/jclouds-jsch/1.8.0-SNAPSHOT/maven-metadata.xml
(2 KB at 6.6 KB/sec)
Downloaded: http://repository.apache.org/snapshots/org/apache/jclouds/driver/jclouds-jsch/1.8.0-SNAPSHOT/maven-metadata.xml
(2 KB at 6.7 KB/sec)
Downloading: https://repository-jclouds.forge.cloudbees.com/snapshot/org/apache/jclouds/api/ec2/1.8.0-SNAPSHOT/maven-metadata.xml
Downloading: https://repository.apache.org/content/repositories/snapshots/org/apache/jclouds/api/ec2/1.8.0-SNAPSHOT/maven-metadata.xml
Downloading: http://download.java.net/maven/2/org/apache/jclouds/api/ec2/1.8.0-SNAPSHOT/maven-metadata.xml
Downloading: https://oss.sonatype.org/content/repositories/releases/org/apache/jclouds/api/ec2/1.8.0-SNAPSHOT/maven-metadata.xml
Downloading: http://repository.apache.org/snapshots/org/apache/jclouds/api/ec2/1.8.0-SNAPSHOT/maven-metadata.xml
Downloaded: https://repository.apache.org/content/repositories/snapshots/org/apache/jclouds/api/ec2/1.8.0-SNAPSHOT/maven-metadata.xml
(2 KB at 6.6 KB/sec)
Downloaded: http://repository.apache.org/snapshots/org/apache/jclouds/api/ec2/1.8.0-SNAPSHOT/maven-metadata.xml
(2 KB at 2.1 KB/sec)
[INFO] 
[INFO] --- maven-resources-plugin:2.6:resources (default-resources) @ commands ---
[INFO] Using 'UTF-8' encoding to copy filtered resources.
[INFO] Copying 9 resources
[INFO] Copying 3 resources
[INFO] 
[INFO] --- maven-compiler-plugin:2.0.2:compile (default-compile) @ commands ---
[INFO] Compiling 69 source files to <https://jclouds.ci.cloudbees.com/job/jclouds-karaf/ws/commands/target/classes>
[INFO] ------------------------------------------------------------------------
[INFO] Reactor Summary:
[INFO] 
[INFO] Apache jclouds :: Karaf ........................... SUCCESS [22.715s]
[INFO] jclouds :: Karaf :: Core .......................... SUCCESS [19.013s]
[INFO] jclouds :: Karaf :: Utils ......................... SUCCESS [11.914s]
[INFO] jclouds :: Karaf :: Recipe ........................ SUCCESS [6.750s]
[INFO] jclouds :: Karaf :: Cache ......................... SUCCESS [7.505s]
[INFO] jclouds :: Karaf :: Services ...................... SUCCESS [33.251s]
[INFO] jclouds :: Karaf :: Commands ...................... FAILURE [12.558s]
[INFO] jclouds :: Karaf :: URL Handler ................... SKIPPED
[INFO] jclouds :: Karaf :: Chef .......................... SKIPPED
[INFO] jclouds :: Karaf :: Chef :: Core .................. SKIPPED
[INFO] jclouds :: Karaf :: Chef :: Services .............. SKIPPED
[INFO] jclouds :: Karaf :: Chef :: Commands .............. SKIPPED
[INFO] jclouds :: Karaf :: Chef :: Cache ................. SKIPPED
[INFO] jclouds :: Karaf :: Feature ....................... SKIPPED
[INFO] jclouds :: Karaf :: Integration Tests ............. SKIPPED
[INFO] ------------------------------------------------------------------------
[INFO] BUILD FAILURE
[INFO] ------------------------------------------------------------------------
[INFO] Total time: 1:58.727s
[INFO] Finished at: Mon Jun 02 11:51:33 EDT 2014
[Unloading class GregorSamsa$0]
[Unloading class GregorSamsa$0]
[Unloading class GregorSamsa]
[Unloading class GregorSamsa$1]
[Unloading class GregorSamsa]
[Unloading class GregorSamsa$1]
[Unloading class GregorSamsa$1]
[Unloading class GregorSamsa]
[Unloading class GregorSamsa$0]
[Unloading class GregorSamsa$0]
[Unloading class GregorSamsa$0]
[Unloading class GregorSamsa]
[Unloading class GregorSamsa]
[Unloading class GregorSamsa$2]
[Unloading class GregorSamsa]
[Unloading class GregorSamsa]
[Unloading class GregorSamsa$0]
[Unloading class GregorSamsa]
[Unloading class GregorSamsa]
[Unloading class GregorSamsa]
[Unloading class GregorSamsa$1]
[Unloading class GregorSamsa$1]
[Unloading class GregorSamsa$2]
[Unloading class GregorSamsa$1]
[Unloading class GregorSamsa$0]
[Unloading class GregorSamsa$0]
[Unloading class GregorSamsa$0]
[Unloading class GregorSamsa$0]
[Unloading class GregorSamsa]
[Unloading class GregorSamsa$0]
[Unloading class GregorSamsa$1]
[Unloading class GregorSamsa$1]
[Unloading class GregorSamsa]
[Unloading class GregorSamsa$0]
[Unloading class GregorSamsa$0]
[Unloading class GregorSamsa]
[Unloading class GregorSamsa]
[Unloading class GregorSamsa$0]
[Unloading class GregorSamsa$1]
[Unloading class GregorSamsa]
[Unloading class GregorSamsa$0]
[Unloading class GregorSamsa$0]
[Unloading class GregorSamsa$2]
[Unloading class GregorSamsa$0]
[Unloading class GregorSamsa$1]
[Unloading class GregorSamsa]
[Unloading class GregorSamsa]
[Unloading class GregorSamsa]
[Unloading class GregorSamsa$1]
[Unloading class GregorSamsa$0]
[Unloading class GregorSamsa]
[Unloading class GregorSamsa$0]
[Unloading class GregorSamsa$0]
[Unloading class GregorSamsa]
[Unloading class GregorSamsa]
[Unloading class GregorSamsa$0]
[Unloading class GregorSamsa$0]
[Unloading class GregorSamsa$0]
[Unloading class GregorSamsa$0]
[Unloading class GregorSamsa$2]
[Unloading class GregorSamsa$0]
[Unloading class GregorSamsa]
[Unloading class GregorSamsa]
[Unloading class GregorSamsa]
[Unloading class GregorSamsa]
[INFO] Final Memory: 50M/99M
[INFO] ------------------------------------------------------------------------
Waiting for Jenkins to finish collecting data
[JENKINS] Archiving <https://jclouds.ci.cloudbees.com/job/jclouds-karaf/ws/chef/commands/pom.xml>
to org.apache.jclouds.karaf.chef/commands/1.8.0-SNAPSHOT/commands-1.8.0-SNAPSHOT.pom
[ERROR] Failed to execute goal org.apache.maven.plugins:maven-compiler-plugin:2.0.2:compile
(default-compile) on project commands: Compilation failure
[ERROR] <https://jclouds.ci.cloudbees.com/job/jclouds-karaf/ws/commands/src/main/java/org/jclouds/karaf/commands/blobstore/BlobWriteCommand.java>:[78,43]
cannot find symbol
[ERROR] symbol  : method calculateMD5()
[ERROR] location: interface org.jclouds.blobstore.domain.BlobBuilder.PayloadBlobBuilder
[ERROR] -> [Help 1]
org.apache.maven.lifecycle.LifecycleExecutionException: Failed to execute goal org.apache.maven.plugins:maven-compiler-plugin:2.0.2:compile
(default-compile) on project commands: Compilation failure
<https://jclouds.ci.cloudbees.com/job/jclouds-karaf/ws/commands/src/main/java/org/jclouds/karaf/commands/blobstore/BlobWriteCommand.java>:[78,43]
cannot find symbol
symbol  : method calculateMD5()
location: interface org.jclouds.blobstore.domain.BlobBuilder.PayloadBlobBuilder


	at org.apache.maven.lifecycle.internal.MojoExecutor.execute(MojoExecutor.java:213)
	at org.apache.maven.lifecycle.internal.MojoExecutor.execute(MojoExecutor.java:153)
	at org.apache.maven.lifecycle.internal.MojoExecutor.execute(MojoExecutor.java:145)
	at org.apache.maven.lifecycle.internal.LifecycleModuleBuilder.buildProject(LifecycleModuleBuilder.java:84)
	at org.apache.maven.lifecycle.internal.LifecycleModuleBuilder.buildProject(LifecycleModuleBuilder.java:59)
	at org.apache.maven.lifecycle.internal.LifecycleStarter.singleThreadedBuild(LifecycleStarter.java:183)
	at org.apache.maven.lifecycle.internal.LifecycleStarter.execute(LifecycleStarter.java:161)
	at org.apache.maven.DefaultMaven.doExecute(DefaultMaven.java:319)
	at org.apache.maven.DefaultMaven.execute(DefaultMaven.java:156)
	at org.jvnet.hudson.maven3.launcher.Maven3Launcher.main(Maven3Launcher.java:117)
	at sun.reflect.NativeMethodAccessorImpl.invoke0(Native Method)
	at sun.reflect.NativeMethodAccessorImpl.invoke(NativeMethodAccessorImpl.java:39)
	at sun.reflect.DelegatingMethodAccessorImpl.invoke(DelegatingMethodAccessorImpl.java:25)
	at java.lang.reflect.Method.invoke(Method.java:597)
	at org.codehaus.plexus.classworlds.launcher.Launcher.launchStandard(Launcher.java:329)
	at org.codehaus.plexus.classworlds.launcher.Launcher.launch(Launcher.java:239)
	at org.jvnet.hudson.maven3.agent.Maven3Main.launch(Maven3Main.java:178)
	at sun.reflect.NativeMethodAccessorImpl.invoke0(Native Method)
	at sun.reflect.NativeMethodAccessorImpl.invoke(NativeMethodAccessorImpl.java:39)
	at sun.reflect.DelegatingMethodAccessorImpl.invoke(DelegatingMethodAccessorImpl.java:25)
	at java.lang.reflect.Method.invoke(Method.java:597)
	at hudson.maven.Maven3Builder.call(Maven3Builder.java:134)
	at hudson.maven.Maven3Builder.call(Maven3Builder.java:69)
	at hudson.remoting.UserRequest.perform(UserRequest.java:118)
	at hudson.remoting.UserRequest.perform(UserRequest.java:48)
	at hudson.remoting.Request$2.run(Request.java:328)
	at hudson.remoting.InterceptingExecutorService$1.call(InterceptingExecutorService.java:72)
	at java.util.concurrent.FutureTask$Sync.innerRun(FutureTask.java:303)
	at java.util.concurrent.FutureTask.run(FutureTask.java:138)
	at java.util.concurrent.ThreadPoolExecutor$Worker.runTask(ThreadPoolExecutor.java:895)
	at java.util.concurrent.ThreadPoolExecutor$Worker.run(ThreadPoolExecutor.java:918)
	at java.lang.Thread.run(Thread.java:662)
Caused by: org.apache.maven.plugin.CompilationFailureException: Compilation failure
<https://jclouds.ci.cloudbees.com/job/jclouds-karaf/ws/commands/src/main/java/org/jclouds/karaf/commands/blobstore/BlobWriteCommand.java>:[78,43]
cannot find symbol
symbol  : method calculateMD5()
location: interface org.jclouds.blobstore.domain.BlobBuilder.PayloadBlobBuilder


	at org.apache.maven.plugin.AbstractCompilerMojo.execute(AbstractCompilerMojo.java:516)
	at org.apache.maven.plugin.CompilerMojo.execute(CompilerMojo.java:114)
	at org.apache.maven.plugin.DefaultBuildPluginManager.executeMojo(DefaultBuildPluginManager.java:101)
	at org.apache.maven.lifecycle.internal.MojoExecutor.execute(MojoExecutor.java:209)
	... 31 more
[ERROR] 
[ERROR] Re-run Maven using the -X switch to enable full debug logging.
[ERROR] 
[ERROR] For more information about the errors and possible solutions, please read the following
articles:
[ERROR] [Help 1] http://cwiki.apache.org/confluence/display/MAVEN/MojoFailureException
[ERROR] 
[ERROR] After correcting the problems, you can resume the build with the command
[ERROR]   mvn <goals> -rf :commands
[JENKINS] Archiving <https://jclouds.ci.cloudbees.com/job/jclouds-karaf/ws/chef/cache/pom.xml>
to org.apache.jclouds.karaf.chef/cache/1.8.0-SNAPSHOT/cache-1.8.0-SNAPSHOT.pom
[JENKINS] Archiving <https://jclouds.ci.cloudbees.com/job/jclouds-karaf/ws/commands/pom.xml>
to org.apache.jclouds.karaf/commands/1.8.0-SNAPSHOT/commands-1.8.0-SNAPSHOT.pom
[JENKINS] Archiving <https://jclouds.ci.cloudbees.com/job/jclouds-karaf/ws/utils/pom.xml>
to org.apache.jclouds.karaf/utils/1.8.0-SNAPSHOT/utils-1.8.0-SNAPSHOT.pom
[JENKINS] Archiving <https://jclouds.ci.cloudbees.com/job/jclouds-karaf/ws/utils/target/utils-1.8.0-SNAPSHOT.jar>
to org.apache.jclouds.karaf/utils/1.8.0-20140602.155028-194/utils-1.8.0-20140602.155028-194.jar
[JENKINS] Archiving <https://jclouds.ci.cloudbees.com/job/jclouds-karaf/ws/feature/pom.xml>
to org.apache.jclouds.karaf/jclouds-karaf/1.8.0-SNAPSHOT/jclouds-karaf-1.8.0-SNAPSHOT.pom
[JENKINS] Archiving <https://jclouds.ci.cloudbees.com/job/jclouds-karaf/ws/itests/pom.xml>
to org.apache.jclouds.karaf/itests/1.8.0-SNAPSHOT/itests-1.8.0-SNAPSHOT.pom
[JENKINS] Archiving <https://jclouds.ci.cloudbees.com/job/jclouds-karaf/ws/chef/core/pom.xml>
to org.apache.jclouds.karaf.chef/core/1.8.0-SNAPSHOT/core-1.8.0-SNAPSHOT.pom
[JENKINS] Archiving <https://jclouds.ci.cloudbees.com/job/jclouds-karaf/ws/urlhandler/pom.xml>
to org.apache.jclouds.karaf/urlhandler/1.8.0-SNAPSHOT/urlhandler-1.8.0-SNAPSHOT.pom
[JENKINS] Archiving <https://jclouds.ci.cloudbees.com/job/jclouds-karaf/ws/services/pom.xml>
to org.apache.jclouds.karaf/services/1.8.0-SNAPSHOT/services-1.8.0-SNAPSHOT.pom
[JENKINS] Archiving <https://jclouds.ci.cloudbees.com/job/jclouds-karaf/ws/services/target/services-1.8.0-SNAPSHOT.jar>
to org.apache.jclouds.karaf/services/1.8.0-20140602.155117-192/services-1.8.0-20140602.155117-192.jar
[JENKINS] Archiving <https://jclouds.ci.cloudbees.com/job/jclouds-karaf/ws/core/pom.xml>
to org.apache.jclouds.karaf/core/1.8.0-SNAPSHOT/core-1.8.0-SNAPSHOT.pom
[JENKINS] Archiving <https://jclouds.ci.cloudbees.com/job/jclouds-karaf/ws/core/target/core-1.8.0-SNAPSHOT.jar>
to org.apache.jclouds.karaf/core/1.8.0-20140602.155016-194/core-1.8.0-20140602.155016-194.jar
[JENKINS] Archiving <https://jclouds.ci.cloudbees.com/job/jclouds-karaf/ws/recipe/pom.xml>
to org.apache.jclouds.karaf/recipe/1.8.0-SNAPSHOT/recipe-1.8.0-SNAPSHOT.pom
[JENKINS] Archiving <https://jclouds.ci.cloudbees.com/job/jclouds-karaf/ws/recipe/target/recipe-1.8.0-SNAPSHOT.jar>
to org.apache.jclouds.karaf/recipe/1.8.0-20140602.155036-194/recipe-1.8.0-20140602.155036-194.jar
[JENKINS] Archiving <https://jclouds.ci.cloudbees.com/job/jclouds-karaf/ws/chef/services/pom.xml>
to org.apache.jclouds.karaf.chef/services/1.8.0-SNAPSHOT/services-1.8.0-SNAPSHOT.pom
[JENKINS] Archiving <https://jclouds.ci.cloudbees.com/job/jclouds-karaf/ws/chef/pom.xml>
to org.apache.jclouds.karaf/chef/1.8.0-SNAPSHOT/chef-1.8.0-SNAPSHOT.pom
[JENKINS] Archiving <https://jclouds.ci.cloudbees.com/job/jclouds-karaf/ws/cache/pom.xml>
to org.apache.jclouds.karaf/cache/1.8.0-SNAPSHOT/cache-1.8.0-SNAPSHOT.pom
[JENKINS] Archiving <https://jclouds.ci.cloudbees.com/job/jclouds-karaf/ws/cache/target/cache-1.8.0-SNAPSHOT.jar>
to org.apache.jclouds.karaf/cache/1.8.0-20140602.155044-194/cache-1.8.0-20140602.155044-194.jar
[JENKINS] Archiving <https://jclouds.ci.cloudbees.com/job/jclouds-karaf/ws/pom.xml>
to org.apache.jclouds/jclouds-karaf/1.8.0-SNAPSHOT/jclouds-karaf-1.8.0-SNAPSHOT.pom
channel stopped

Mime
View raw message