jclouds-notifications mailing list archives

Site index · List index
Message view « Date » · « Thread »
Top « Date » · « Thread »
From BuildHive <buildhive-git...@cloudbees.com>
Subject Build failed in Jenkins: jclouds » jclouds-karaf #1006
Date Mon, 02 Jun 2014 14:49:04 GMT
See <https://buildhive.cloudbees.com/job/jclouds/job/jclouds-karaf/1006/>

------------------------------------------
[...truncated 500 lines...]
Downloading: http://download.java.net/maven/2/org/apache/jclouds/driver/jclouds-slf4j/1.8.0-SNAPSHOT/maven-metadata.xml
Downloading: https://oss.sonatype.org/content/repositories/releases/org/apache/jclouds/driver/jclouds-slf4j/1.8.0-SNAPSHOT/maven-metadata.xml
Downloading: http://repository.apache.org/snapshots/org/apache/jclouds/driver/jclouds-slf4j/1.8.0-SNAPSHOT/maven-metadata.xml
Downloading: https://oss.sonatype.org/content/repositories/snapshots/org/apache/jclouds/driver/jclouds-slf4j/1.8.0-SNAPSHOT/maven-metadata.xml
Downloaded: https://repository.apache.org/content/repositories/snapshots/org/apache/jclouds/driver/jclouds-slf4j/1.8.0-SNAPSHOT/maven-metadata.xml
(2 KB at 1.7 KB/sec)
Downloaded: http://repository.apache.org/snapshots/org/apache/jclouds/driver/jclouds-slf4j/1.8.0-SNAPSHOT/maven-metadata.xml
(2 KB at 1.6 KB/sec)
Downloading: https://repository.apache.org/content/repositories/snapshots/org/apache/jclouds/driver/jclouds-bouncycastle/1.8.0-SNAPSHOT/maven-metadata.xml
Downloading: http://download.java.net/maven/2/org/apache/jclouds/driver/jclouds-bouncycastle/1.8.0-SNAPSHOT/maven-metadata.xml
Downloading: https://oss.sonatype.org/content/repositories/releases/org/apache/jclouds/driver/jclouds-bouncycastle/1.8.0-SNAPSHOT/maven-metadata.xml
Downloading: http://repository.apache.org/snapshots/org/apache/jclouds/driver/jclouds-bouncycastle/1.8.0-SNAPSHOT/maven-metadata.xml
Downloading: https://oss.sonatype.org/content/repositories/snapshots/org/apache/jclouds/driver/jclouds-bouncycastle/1.8.0-SNAPSHOT/maven-metadata.xml
Downloaded: http://repository.apache.org/snapshots/org/apache/jclouds/driver/jclouds-bouncycastle/1.8.0-SNAPSHOT/maven-metadata.xml
(2 KB at 3.4 KB/sec)
Downloaded: https://repository.apache.org/content/repositories/snapshots/org/apache/jclouds/driver/jclouds-bouncycastle/1.8.0-SNAPSHOT/maven-metadata.xml
(2 KB at 2.4 KB/sec)
Downloading: https://repository.apache.org/content/repositories/snapshots/org/apache/jclouds/labs/management/management-core/1.8.0-SNAPSHOT/management-core-1.8.0-20140602.144548-137.jar
Downloading: https://repository.apache.org/content/repositories/snapshots/org/apache/jclouds/labs/representations/representations-codec/1.8.0-SNAPSHOT/representations-codec-1.8.0-20140602.144456-137.jar
Downloading: https://repository.apache.org/content/repositories/snapshots/org/apache/jclouds/labs/representations/representations-core/1.8.0-SNAPSHOT/representations-core-1.8.0-20140602.144436-137.jar
Downloaded: https://repository.apache.org/content/repositories/snapshots/org/apache/jclouds/labs/management/management-core/1.8.0-SNAPSHOT/management-core-1.8.0-20140602.144548-137.jar
(33 KB at 102.7 KB/sec)
Downloaded: https://repository.apache.org/content/repositories/snapshots/org/apache/jclouds/labs/representations/representations-codec/1.8.0-SNAPSHOT/representations-codec-1.8.0-20140602.144456-137.jar
(35 KB at 56.3 KB/sec)
Downloaded: https://repository.apache.org/content/repositories/snapshots/org/apache/jclouds/labs/representations/representations-core/1.8.0-SNAPSHOT/representations-core-1.8.0-20140602.144436-137.jar
(49 KB at 67.1 KB/sec)
[INFO] 
[INFO] --- maven-clean-plugin:2.5:clean (default-clean) @ services ---
[INFO] 
[INFO] --- maven-remote-resources-plugin:1.5:process (default) @ services ---
Downloading: https://oss.sonatype.org/content/repositories/snapshots/org/apache/jclouds/jclouds-project/1.8.0-SNAPSHOT/maven-metadata.xml
Downloading: https://oss.sonatype.org/content/repositories/snapshots/org/apache/jclouds/jclouds-core/1.8.0-SNAPSHOT/maven-metadata.xml
Downloading: https://oss.sonatype.org/content/repositories/snapshots/org/apache/jclouds/labs/jclouds-labs/1.8.0-SNAPSHOT/maven-metadata.xml
Downloading: https://oss.sonatype.org/content/repositories/snapshots/org/apache/jclouds/jclouds-compute/1.8.0-SNAPSHOT/maven-metadata.xml
Downloading: https://oss.sonatype.org/content/repositories/snapshots/org/apache/jclouds/jclouds-blobstore/1.8.0-SNAPSHOT/maven-metadata.xml
Downloading: https://oss.sonatype.org/content/repositories/snapshots/org/apache/jclouds/jclouds-project/1.8.0-SNAPSHOT/maven-metadata.xml
Downloading: https://oss.sonatype.org/content/repositories/snapshots/org/apache/jclouds/jclouds-core/1.8.0-SNAPSHOT/maven-metadata.xml
Downloading: https://oss.sonatype.org/content/repositories/snapshots/org/apache/jclouds/jclouds-compute/1.8.0-SNAPSHOT/maven-metadata.xml
[INFO] 
[INFO] --- maven-resources-plugin:2.6:resources (default-resources) @ services ---
[INFO] Using 'UTF-8' encoding to copy filtered resources.
[INFO] Copying 1 resource
[INFO] Copying 3 resources
[INFO] 
[INFO] --- maven-compiler-plugin:2.0.2:compile (default-compile) @ services ---
[INFO] Compiling 7 source files to <https://buildhive.cloudbees.com/job/jclouds/job/jclouds-karaf/ws/services/target/classes>
[INFO] 
[INFO] --- maven-bundle-plugin:2.1.0:manifest (bundle-manifest) @ services ---
[INFO] 
[INFO] --- maven-resources-plugin:2.6:testResources (default-testResources) @ services ---
[INFO] Using 'UTF-8' encoding to copy filtered resources.
[INFO] skip non existing resourceDirectory <https://buildhive.cloudbees.com/job/jclouds/job/jclouds-karaf/ws/services/src/test/resources>
[INFO] Copying 3 resources
[INFO] 
[INFO] --- maven-compiler-plugin:2.0.2:testCompile (default-testCompile) @ services ---
[INFO] Compiling 1 source file to <https://buildhive.cloudbees.com/job/jclouds/job/jclouds-karaf/ws/services/target/test-classes>
[INFO] 
[INFO] --- maven-surefire-plugin:2.16:test (default-test) @ services ---
[INFO] Surefire report directory: <https://buildhive.cloudbees.com/job/jclouds/job/jclouds-karaf/ws/services/target/surefire-reports>

-------------------------------------------------------
 T E S T S
-------------------------------------------------------
Running org.jclouds.karaf.services.ServiceFactoryValidationTest
Tests run: 7, Failures: 0, Errors: 0, Skipped: 0, Time elapsed: 1.02 sec - in org.jclouds.karaf.services.ServiceFactoryValidationTest

Results :

Tests run: 7, Failures: 0, Errors: 0, Skipped: 0

[JENKINS] Recording test results
[INFO] 
[INFO] --- maven-bundle-plugin:2.1.0:bundle (default-bundle) @ services ---
[WARNING] Warning building bundle org.apache.jclouds.karaf:services:bundle:1.8.0-SNAPSHOT
: Did not find matching referal for org.jclouds.ec2*
[INFO] Expanding: <https://buildhive.cloudbees.com/job/jclouds/job/jclouds-karaf/ws/services/target/services-1.8.0-SNAPSHOT.jar>
into <https://buildhive.cloudbees.com/job/jclouds/job/jclouds-karaf/ws/services/target/classes>
[INFO] 
[INFO] --- maven-site-plugin:3.3:attach-descriptor (attach-descriptor) @ services ---
[INFO] 
[INFO] --- apache-rat-plugin:0.10:check (default) @ services ---
[INFO] 51 implicit excludes (use -debug for more details).
[INFO] Exclude: **/LICENSE.txt
[INFO] Exclude: **/header.txt
[INFO] Exclude: **/NOTICE.txt
[INFO] Exclude: **/DISCLAIMER
[INFO] Exclude: **/BUILD.txt
[INFO] Exclude: **/CHANGES.txt
[INFO] Exclude: **/README.md
[INFO] Exclude: **/README.txt
[INFO] Exclude: **/DEPENDENCIES
[INFO] Exclude: .git/**
[INFO] Exclude: **/.gitignore
[INFO] Exclude: **/*.json
[INFO] Exclude: **/*.log*
[INFO] Exclude: **/TODO
[INFO] Exclude: .mailmap
[INFO] Exclude: .idea/**
[INFO] Exclude: **/*.iml
[INFO] Exclude: **/.project
[INFO] Exclude: **/.classpath
[INFO] Exclude: **/.settings/**
[INFO] Exclude: **/.checkstyle
[INFO] Exclude: **/target/**
[INFO] Exclude: .repository/**
[INFO] Exclude: **/src/main/resources/**/*.txt
[INFO] 10 resources included (use -debug for more details)
Warning:  org.apache.xerces.jaxp.SAXParserImpl$JAXPSAXParser: Property 'http://www.oracle.com/xml/jaxp/properties/entityExpansionLimit'
is not recognized.
Compiler warnings:
  WARNING:  'org.apache.xerces.jaxp.SAXParserImpl: Property 'http://javax.xml.XMLConstants/property/accessExternalDTD'
is not recognized.'
Warning:  org.apache.xerces.parsers.SAXParser: Feature 'http://javax.xml.XMLConstants/feature/secure-processing'
is not recognized.
Warning:  org.apache.xerces.parsers.SAXParser: Property 'http://javax.xml.XMLConstants/property/accessExternalDTD'
is not recognized.
Warning:  org.apache.xerces.parsers.SAXParser: Property 'http://www.oracle.com/xml/jaxp/properties/entityExpansionLimit'
is not recognized.
[INFO] Rat check: Summary of files. Unapproved: 0 unknown: 0 generated: 0 approved: 10 licence.
[INFO] 
[INFO] --- maven-install-plugin:2.5.1:install (default-install) @ services ---
[INFO] Installing <https://buildhive.cloudbees.com/job/jclouds/job/jclouds-karaf/ws/services/target/services-1.8.0-SNAPSHOT.jar>
to /home/jenkins/.m2/repository/org/apache/jclouds/karaf/services/1.8.0-SNAPSHOT/services-1.8.0-SNAPSHOT.jar
[INFO] Installing <https://buildhive.cloudbees.com/job/jclouds/job/jclouds-karaf/ws/services/pom.xml>
to /home/jenkins/.m2/repository/org/apache/jclouds/karaf/services/1.8.0-SNAPSHOT/services-1.8.0-SNAPSHOT.pom
[INFO] 
[INFO] --- maven-bundle-plugin:2.1.0:install (default-install) @ services ---
[INFO] Installing org/apache/jclouds/karaf/services/1.8.0-SNAPSHOT/services-1.8.0-SNAPSHOT.jar
[INFO] Writing OBR metadata
[INFO]                                                                         
[INFO] ------------------------------------------------------------------------
[INFO] Building jclouds :: Karaf :: Commands 1.8.0-SNAPSHOT
[INFO] ------------------------------------------------------------------------
Downloading: https://repository.apache.org/content/repositories/snapshots/org/apache/jclouds/api/ec2/1.8.0-SNAPSHOT/maven-metadata.xml
Downloading: https://oss.sonatype.org/content/repositories/releases/org/apache/jclouds/api/ec2/1.8.0-SNAPSHOT/maven-metadata.xml
Downloading: http://repository.apache.org/snapshots/org/apache/jclouds/api/ec2/1.8.0-SNAPSHOT/maven-metadata.xml
Downloading: http://download.java.net/maven/2/org/apache/jclouds/api/ec2/1.8.0-SNAPSHOT/maven-metadata.xml
Downloaded: http://repository.apache.org/snapshots/org/apache/jclouds/api/ec2/1.8.0-SNAPSHOT/maven-metadata.xml
(2 KB at 3.5 KB/sec)
Downloaded: https://repository.apache.org/content/repositories/snapshots/org/apache/jclouds/api/ec2/1.8.0-SNAPSHOT/maven-metadata.xml
(2 KB at 3.4 KB/sec)
Downloading: https://repository.apache.org/content/repositories/snapshots/org/apache/jclouds/api/sts/1.8.0-SNAPSHOT/maven-metadata.xml
Downloading: http://download.java.net/maven/2/org/apache/jclouds/api/sts/1.8.0-SNAPSHOT/maven-metadata.xml
Downloading: https://oss.sonatype.org/content/repositories/releases/org/apache/jclouds/api/sts/1.8.0-SNAPSHOT/maven-metadata.xml
Downloading: http://repository.apache.org/snapshots/org/apache/jclouds/api/sts/1.8.0-SNAPSHOT/maven-metadata.xml
Downloaded: http://repository.apache.org/snapshots/org/apache/jclouds/api/sts/1.8.0-SNAPSHOT/maven-metadata.xml
(2 KB at 6.6 KB/sec)
Downloaded: https://repository.apache.org/content/repositories/snapshots/org/apache/jclouds/api/sts/1.8.0-SNAPSHOT/maven-metadata.xml
(2 KB at 6.2 KB/sec)
Downloading: https://repository.apache.org/content/repositories/snapshots/org/apache/jclouds/driver/jclouds-jsch/1.8.0-SNAPSHOT/maven-metadata.xml
Downloading: https://oss.sonatype.org/content/repositories/releases/org/apache/jclouds/driver/jclouds-jsch/1.8.0-SNAPSHOT/maven-metadata.xml
Downloading: http://download.java.net/maven/2/org/apache/jclouds/driver/jclouds-jsch/1.8.0-SNAPSHOT/maven-metadata.xml
Downloading: http://repository.apache.org/snapshots/org/apache/jclouds/driver/jclouds-jsch/1.8.0-SNAPSHOT/maven-metadata.xml
Downloaded: https://repository.apache.org/content/repositories/snapshots/org/apache/jclouds/driver/jclouds-jsch/1.8.0-SNAPSHOT/maven-metadata.xml
(2 KB at 1.4 KB/sec)
Downloaded: http://repository.apache.org/snapshots/org/apache/jclouds/driver/jclouds-jsch/1.8.0-SNAPSHOT/maven-metadata.xml
(2 KB at 1.0 KB/sec)
[INFO] 
[INFO] --- maven-clean-plugin:2.5:clean (default-clean) @ commands ---
[INFO] 
[INFO] --- maven-remote-resources-plugin:1.5:process (default) @ commands ---
[INFO] 
[INFO] --- maven-resources-plugin:2.6:resources (default-resources) @ commands ---
[INFO] Using 'UTF-8' encoding to copy filtered resources.
[INFO] Copying 9 resources
[INFO] Copying 3 resources
[INFO] 
[INFO] --- maven-compiler-plugin:2.0.2:compile (default-compile) @ commands ---
[INFO] Compiling 69 source files to <https://buildhive.cloudbees.com/job/jclouds/job/jclouds-karaf/ws/commands/target/classes>
[INFO] ------------------------------------------------------------------------
[INFO] Reactor Summary:
[INFO] 
[INFO] Apache jclouds :: Karaf ........................... SUCCESS [24.318s]
[INFO] jclouds :: Karaf :: Core .......................... SUCCESS [16.844s]
[INFO] jclouds :: Karaf :: Utils ......................... SUCCESS [7.460s]
[INFO] jclouds :: Karaf :: Recipe ........................ SUCCESS [5.852s]
[INFO] jclouds :: Karaf :: Cache ......................... SUCCESS [6.088s]
[INFO] jclouds :: Karaf :: Services ...................... SUCCESS [33.916s]
[INFO] jclouds :: Karaf :: Commands ...................... FAILURE [17.473s]
[INFO] jclouds :: Karaf :: URL Handler ................... SKIPPED
[INFO] jclouds :: Karaf :: Chef .......................... SKIPPED
[INFO] jclouds :: Karaf :: Chef :: Core .................. SKIPPED
[INFO] jclouds :: Karaf :: Chef :: Services .............. SKIPPED
[INFO] jclouds :: Karaf :: Chef :: Commands .............. SKIPPED
[INFO] jclouds :: Karaf :: Chef :: Cache ................. SKIPPED
[INFO] jclouds :: Karaf :: Feature ....................... SKIPPED
[INFO] jclouds :: Karaf :: Integration Tests ............. SKIPPED
[INFO] ------------------------------------------------------------------------
[INFO] BUILD FAILURE
[INFO] ------------------------------------------------------------------------
[INFO] Total time: 2:01.679s
[INFO] Finished at: Mon Jun 02 14:49:00 UTC 2014
[INFO] Final Memory: 60M/145M
[INFO] ------------------------------------------------------------------------
Waiting for Jenkins to finish collecting data
[JENKINS] Archiving <https://buildhive.cloudbees.com/job/jclouds/job/jclouds-karaf/ws/chef/cache/pom.xml>
to org.apache.jclouds.karaf.chef/cache/1.8.0-SNAPSHOT/cache-1.8.0-SNAPSHOT.pom
[ERROR] Failed to execute goal org.apache.maven.plugins:maven-compiler-plugin:2.0.2:compile
(default-compile) on project commands: Compilation failure
[ERROR] <https://buildhive.cloudbees.com/job/jclouds/job/jclouds-karaf/ws/commands/src/main/java/org/jclouds/karaf/commands/blobstore/BlobWriteCommand.java>:[78,43]
error: cannot find symbol
[ERROR] -> [Help 1]
org.apache.maven.lifecycle.LifecycleExecutionException: Failed to execute goal org.apache.maven.plugins:maven-compiler-plugin:2.0.2:compile
(default-compile) on project commands: Compilation failure
<https://buildhive.cloudbees.com/job/jclouds/job/jclouds-karaf/ws/commands/src/main/java/org/jclouds/karaf/commands/blobstore/BlobWriteCommand.java>:[78,43]
error: cannot find symbol


	at org.apache.maven.lifecycle.internal.MojoExecutor.execute(MojoExecutor.java:213)
	at org.apache.maven.lifecycle.internal.MojoExecutor.execute(MojoExecutor.java:153)
	at org.apache.maven.lifecycle.internal.MojoExecutor.execute(MojoExecutor.java:145)
	at org.apache.maven.lifecycle.internal.LifecycleModuleBuilder.buildProject(LifecycleModuleBuilder.java:84)
	at org.apache.maven.lifecycle.internal.LifecycleModuleBuilder.buildProject(LifecycleModuleBuilder.java:59)
	at org.apache.maven.lifecycle.internal.LifecycleStarter.singleThreadedBuild(LifecycleStarter.java:183)
	at org.apache.maven.lifecycle.internal.LifecycleStarter.execute(LifecycleStarter.java:161)
	at org.apache.maven.DefaultMaven.doExecute(DefaultMaven.java:320)
	at org.apache.maven.DefaultMaven.execute(DefaultMaven.java:156)
	at org.jvnet.hudson.maven3.launcher.Maven3Launcher.main(Maven3Launcher.java:117)
	at sun.reflect.NativeMethodAccessorImpl.invoke0(Native Method)
	at sun.reflect.NativeMethodAccessorImpl.invoke(NativeMethodAccessorImpl.java:57)
	at sun.reflect.DelegatingMethodAccessorImpl.invoke(DelegatingMethodAccessorImpl.java:43)
	at java.lang.reflect.Method.invoke(Method.java:606)
	at org.codehaus.plexus.classworlds.launcher.Launcher.launchStandard(Launcher.java:329)
	at org.codehaus.plexus.classworlds.launcher.Launcher.launch(Launcher.java:239)
	at org.jvnet.hudson.maven3.agent.Maven3Main.launch(Maven3Main.java:178)
	at sun.reflect.NativeMethodAccessorImpl.invoke0(Native Method)
	at sun.reflect.NativeMethodAccessorImpl.invoke(NativeMethodAccessorImpl.java:57)
	at sun.reflect.DelegatingMethodAccessorImpl.invoke(DelegatingMethodAccessorImpl.java:43)
	at java.lang.reflect.Method.invoke(Method.java:606)
	at hudson.maven.Maven3Builder.call(Maven3Builder.java:134)
	at hudson.maven.Maven3Builder.call(Maven3Builder.java:69)
	at hudson.remoting.UserRequest.perform(UserRequest.java:118)
	at hudson.remoting.UserRequest.perform(UserRequest.java:48)
	at hudson.remoting.Request$2.run(Request.java:328)
	at hudson.remoting.InterceptingExecutorService$1.call(InterceptingExecutorService.java:72)
	at java.util.concurrent.FutureTask.run(FutureTask.java:262)
	at java.util.concurrent.ThreadPoolExecutor.runWorker(ThreadPoolExecutor.java:1145)
	at java.util.concurrent.ThreadPoolExecutor$Worker.run(ThreadPoolExecutor.java:615)
	at java.lang.Thread.run(Thread.java:744)
Caused by: org.apache.maven.plugin.CompilationFailureException: Compilation failure
<https://buildhive.cloudbees.com/job/jclouds/job/jclouds-karaf/ws/commands/src/main/java/org/jclouds/karaf/commands/blobstore/BlobWriteCommand.java>:[78,43]
error: cannot find symbol


	at org.apache.maven.plugin.AbstractCompilerMojo.execute(AbstractCompilerMojo.java:516)
	at org.apache.maven.plugin.CompilerMojo.execute(CompilerMojo.java:114)
	at org.apache.maven.plugin.DefaultBuildPluginManager.executeMojo(DefaultBuildPluginManager.java:101)
	at org.apache.maven.lifecycle.internal.MojoExecutor.execute(MojoExecutor.java:209)
	... 30 more
[ERROR] 
[ERROR] Re-run Maven using the -X switch to enable full debug logging.
[ERROR] 
[ERROR] For more information about the errors and possible solutions, please read the following
articles:
[ERROR] [Help 1] http://cwiki.apache.org/confluence/display/MAVEN/MojoFailureException
[ERROR] 
[ERROR] After correcting the problems, you can resume the build with the command
[ERROR]   mvn <goals> -rf :commands
[JENKINS] Archiving <https://buildhive.cloudbees.com/job/jclouds/job/jclouds-karaf/ws/core/pom.xml>
to org.apache.jclouds.karaf/core/1.8.0-SNAPSHOT/core-1.8.0-SNAPSHOT.pom
[JENKINS] Archiving <https://buildhive.cloudbees.com/job/jclouds/job/jclouds-karaf/ws/core/target/core-1.8.0-SNAPSHOT.jar>
to org.apache.jclouds.karaf/core/1.8.0-SNAPSHOT/core-1.8.0-SNAPSHOT.jar
[JENKINS] Archiving <https://buildhive.cloudbees.com/job/jclouds/job/jclouds-karaf/ws/urlhandler/pom.xml>
to org.apache.jclouds.karaf/urlhandler/1.8.0-SNAPSHOT/urlhandler-1.8.0-SNAPSHOT.pom
[JENKINS] Archiving <https://buildhive.cloudbees.com/job/jclouds/job/jclouds-karaf/ws/chef/core/pom.xml>
to org.apache.jclouds.karaf.chef/core/1.8.0-SNAPSHOT/core-1.8.0-SNAPSHOT.pom
[JENKINS] Archiving <https://buildhive.cloudbees.com/job/jclouds/job/jclouds-karaf/ws/pom.xml>
to org.apache.jclouds/jclouds-karaf/1.8.0-SNAPSHOT/jclouds-karaf-1.8.0-SNAPSHOT.pom
[JENKINS] Archiving <https://buildhive.cloudbees.com/job/jclouds/job/jclouds-karaf/ws/chef/commands/pom.xml>
to org.apache.jclouds.karaf.chef/commands/1.8.0-SNAPSHOT/commands-1.8.0-SNAPSHOT.pom
[JENKINS] Archiving <https://buildhive.cloudbees.com/job/jclouds/job/jclouds-karaf/ws/utils/pom.xml>
to org.apache.jclouds.karaf/utils/1.8.0-SNAPSHOT/utils-1.8.0-SNAPSHOT.pom
[JENKINS] Archiving <https://buildhive.cloudbees.com/job/jclouds/job/jclouds-karaf/ws/utils/target/utils-1.8.0-SNAPSHOT.jar>
to org.apache.jclouds.karaf/utils/1.8.0-SNAPSHOT/utils-1.8.0-SNAPSHOT.jar
[JENKINS] Archiving <https://buildhive.cloudbees.com/job/jclouds/job/jclouds-karaf/ws/commands/pom.xml>
to org.apache.jclouds.karaf/commands/1.8.0-SNAPSHOT/commands-1.8.0-SNAPSHOT.pom
[JENKINS] Archiving <https://buildhive.cloudbees.com/job/jclouds/job/jclouds-karaf/ws/feature/pom.xml>
to org.apache.jclouds.karaf/jclouds-karaf/1.8.0-SNAPSHOT/jclouds-karaf-1.8.0-SNAPSHOT.pom
[JENKINS] Archiving <https://buildhive.cloudbees.com/job/jclouds/job/jclouds-karaf/ws/itests/pom.xml>
to org.apache.jclouds.karaf/itests/1.8.0-SNAPSHOT/itests-1.8.0-SNAPSHOT.pom
[JENKINS] Archiving <https://buildhive.cloudbees.com/job/jclouds/job/jclouds-karaf/ws/services/pom.xml>
to org.apache.jclouds.karaf/services/1.8.0-SNAPSHOT/services-1.8.0-SNAPSHOT.pom
[JENKINS] Archiving <https://buildhive.cloudbees.com/job/jclouds/job/jclouds-karaf/ws/services/target/services-1.8.0-SNAPSHOT.jar>
to org.apache.jclouds.karaf/services/1.8.0-SNAPSHOT/services-1.8.0-SNAPSHOT.jar
[JENKINS] Archiving <https://buildhive.cloudbees.com/job/jclouds/job/jclouds-karaf/ws/recipe/pom.xml>
to org.apache.jclouds.karaf/recipe/1.8.0-SNAPSHOT/recipe-1.8.0-SNAPSHOT.pom
[JENKINS] Archiving <https://buildhive.cloudbees.com/job/jclouds/job/jclouds-karaf/ws/recipe/target/recipe-1.8.0-SNAPSHOT.jar>
to org.apache.jclouds.karaf/recipe/1.8.0-SNAPSHOT/recipe-1.8.0-SNAPSHOT.jar
[JENKINS] Archiving <https://buildhive.cloudbees.com/job/jclouds/job/jclouds-karaf/ws/cache/pom.xml>
to org.apache.jclouds.karaf/cache/1.8.0-SNAPSHOT/cache-1.8.0-SNAPSHOT.pom
[JENKINS] Archiving <https://buildhive.cloudbees.com/job/jclouds/job/jclouds-karaf/ws/cache/target/cache-1.8.0-SNAPSHOT.jar>
to org.apache.jclouds.karaf/cache/1.8.0-SNAPSHOT/cache-1.8.0-SNAPSHOT.jar
[JENKINS] Archiving <https://buildhive.cloudbees.com/job/jclouds/job/jclouds-karaf/ws/chef/pom.xml>
to org.apache.jclouds.karaf/chef/1.8.0-SNAPSHOT/chef-1.8.0-SNAPSHOT.pom
[JENKINS] Archiving <https://buildhive.cloudbees.com/job/jclouds/job/jclouds-karaf/ws/chef/services/pom.xml>
to org.apache.jclouds.karaf.chef/services/1.8.0-SNAPSHOT/services-1.8.0-SNAPSHOT.pom
channel stopped

Mime
View raw message