jclouds-notifications mailing list archives

Site index · List index
Message view « Date » · « Thread »
Top « Date » · « Thread »
From jenkins-no-re...@cloudbees.com
Subject Build failed in Jenkins: jclouds-karaf #635
Date Mon, 02 Jun 2014 12:33:30 GMT
See <https://jclouds.ci.cloudbees.com/job/jclouds-karaf/635/>

------------------------------------------
[...truncated 2295 lines...]
[Unloading class GregorSamsa$1]
[Unloading class GregorSamsa]
[Unloading class GregorSamsa]
[Unloading class GregorSamsa$1]
[Unloading class GregorSamsa$0]
[Unloading class GregorSamsa]
[Unloading class GregorSamsa]
[Unloading class GregorSamsa$0]
[Unloading class GregorSamsa$1]
[Unloading class GregorSamsa]
[Unloading class GregorSamsa]
[Unloading class GregorSamsa$0]
[Unloading class GregorSamsa]
[Unloading class GregorSamsa]
[Unloading class GregorSamsa]
[Unloading class GregorSamsa$0]
[Unloading class GregorSamsa]
[Unloading class GregorSamsa$1]
[Unloading class GregorSamsa$1]
[Unloading class GregorSamsa]
[Unloading class GregorSamsa$0]
[Unloading class GregorSamsa]
[Unloading class GregorSamsa]
[Unloading class GregorSamsa]
[Unloading class GregorSamsa$2]
[Unloading class GregorSamsa]
[Unloading class GregorSamsa$1]
[Unloading class GregorSamsa]
[Unloading class GregorSamsa]
[Unloading class GregorSamsa$0]
[Unloading class GregorSamsa$0]
[Unloading class GregorSamsa$0]
[Unloading class GregorSamsa]
[Unloading class GregorSamsa$0]
[Unloading class GregorSamsa$0]
[Unloading class GregorSamsa$2]
[Unloading class GregorSamsa$1]
[Unloading class GregorSamsa$1]
[Unloading class GregorSamsa$2]
[Unloading class GregorSamsa$0]
[Unloading class GregorSamsa$0]
[Unloading class GregorSamsa$0]
[Unloading class GregorSamsa$0]
[Unloading class GregorSamsa$0]
[Unloading class GregorSamsa$0]
[Unloading class GregorSamsa$0]
[Unloading class GregorSamsa]
[Unloading class GregorSamsa]
[Unloading class GregorSamsa$0]
Downloading: http://repo.cloudbees.com/content/repositories/central/org/apache/felix/org.apache.felix.gogo.runtime/0.10.0/org.apache.felix.gogo.runtime-0.10.0.pom
Downloaded: http://repo.cloudbees.com/content/repositories/central/org/apache/felix/org.apache.felix.gogo.runtime/0.10.0/org.apache.felix.gogo.runtime-0.10.0.pom
(5 KB at 128.0 KB/sec)
Downloading: http://repo.cloudbees.com/content/repositories/central/org/apache/felix/gogo-parent/0.6.0/gogo-parent-0.6.0.pom
Downloaded: http://repo.cloudbees.com/content/repositories/central/org/apache/felix/gogo-parent/0.6.0/gogo-parent-0.6.0.pom
(4 KB at 104.0 KB/sec)
Downloading: http://repo.cloudbees.com/content/repositories/central/org/apache/sshd/sshd-core/0.8.0/sshd-core-0.8.0.pom
Downloaded: http://repo.cloudbees.com/content/repositories/central/org/apache/sshd/sshd-core/0.8.0/sshd-core-0.8.0.pom
(6 KB at 140.0 KB/sec)
Downloading: http://repo.cloudbees.com/content/repositories/central/org/apache/sshd/sshd/0.8.0/sshd-0.8.0.pom
Downloaded: http://repo.cloudbees.com/content/repositories/central/org/apache/sshd/sshd/0.8.0/sshd-0.8.0.pom
(9 KB at 138.3 KB/sec)
Downloading: http://repo.cloudbees.com/content/repositories/central/org/apache/mina/mina-core/2.0.5/mina-core-2.0.5.pom
Downloaded: http://repo.cloudbees.com/content/repositories/central/org/apache/mina/mina-core/2.0.5/mina-core-2.0.5.pom
(2 KB at 52.0 KB/sec)
Downloading: http://repo.cloudbees.com/content/repositories/central/org/apache/mina/mina-parent/2.0.5/mina-parent-2.0.5.pom
Downloaded: http://repo.cloudbees.com/content/repositories/central/org/apache/mina/mina-parent/2.0.5/mina-parent-2.0.5.pom
(30 KB at 428.7 KB/sec)
Downloading: http://repo.cloudbees.com/content/repositories/central/org/codehaus/groovy/groovy-all/1.8.6/groovy-all-1.8.6.pom
Downloaded: http://repo.cloudbees.com/content/repositories/central/org/codehaus/groovy/groovy-all/1.8.6/groovy-all-1.8.6.pom
(30 KB at 1751.5 KB/sec)
Downloading: https://repository.apache.org/content/repositories/snapshots/org/apache/jclouds/api/ec2/1.8.0-SNAPSHOT/ec2-1.8.0-20140530.221946-178.jar
Downloading: https://repository.apache.org/content/repositories/snapshots/org/apache/jclouds/api/sts/1.8.0-SNAPSHOT/sts-1.8.0-20140530.221315-185.jar
Downloading: https://repository.apache.org/content/repositories/snapshots/org/apache/jclouds/driver/jclouds-jsch/1.8.0-SNAPSHOT/jclouds-jsch-1.8.0-20140530.225134-166.jar
Downloaded: https://repository.apache.org/content/repositories/snapshots/org/apache/jclouds/driver/jclouds-jsch/1.8.0-SNAPSHOT/jclouds-jsch-1.8.0-20140530.225134-166.jar
(37 KB at 35.0 KB/sec)
Downloaded: https://repository.apache.org/content/repositories/snapshots/org/apache/jclouds/api/sts/1.8.0-SNAPSHOT/sts-1.8.0-20140530.221315-185.jar
(64 KB at 48.9 KB/sec)
Downloaded: https://repository.apache.org/content/repositories/snapshots/org/apache/jclouds/api/ec2/1.8.0-SNAPSHOT/ec2-1.8.0-20140530.221946-178.jar
(392 KB at 289.5 KB/sec)
Downloading: http://repo.cloudbees.com/content/repositories/central/com/jcraft/jsch/0.1.49/jsch-0.1.49.jar
Downloading: http://repo.cloudbees.com/content/repositories/central/com/jcraft/jsch.agentproxy.jsch/0.0.7/jsch.agentproxy.jsch-0.0.7.jar
Downloading: http://repo.cloudbees.com/content/repositories/central/org/apache/karaf/shell/org.apache.karaf.shell.console/2.3.2/org.apache.karaf.shell.console-2.3.2.jar
Downloading: http://repo.cloudbees.com/content/repositories/central/org/fusesource/jansi/jansi/1.9/jansi-1.9.jar
Downloading: http://repo.cloudbees.com/content/repositories/central/jline/jline/2.9/jline-2.9.jar
Downloaded: http://repo.cloudbees.com/content/repositories/central/org/fusesource/jansi/jansi/1.9/jansi-1.9.jar
(112 KB at 1821.8 KB/sec)
Downloading: http://repo.cloudbees.com/content/repositories/central/org/apache/karaf/jaas/org.apache.karaf.jaas.boot/2.3.2/org.apache.karaf.jaas.boot-2.3.2.jar
Downloaded: http://repo.cloudbees.com/content/repositories/central/com/jcraft/jsch.agentproxy.jsch/0.0.7/jsch.agentproxy.jsch-0.0.7.jar
(5 KB at 38.5 KB/sec)
Downloading: http://repo.cloudbees.com/content/repositories/central/org/apache/karaf/jaas/org.apache.karaf.jaas.modules/2.3.2/org.apache.karaf.jaas.modules-2.3.2.jar
Downloaded: http://repo.cloudbees.com/content/repositories/central/jline/jline/2.9/jline-2.9.jar
(200 KB at 1694.5 KB/sec)
Downloading: http://repo.cloudbees.com/content/repositories/central/org/apache/karaf/jaas/org.apache.karaf.jaas.config/2.3.2/org.apache.karaf.jaas.config-2.3.2.jar
Downloaded: http://repo.cloudbees.com/content/repositories/central/org/apache/karaf/jaas/org.apache.karaf.jaas.boot/2.3.2/org.apache.karaf.jaas.boot-2.3.2.jar
(17 KB at 223.1 KB/sec)
Downloading: http://repo.cloudbees.com/content/repositories/central/org/apache/felix/org.apache.felix.utils/1.2.0/org.apache.felix.utils-1.2.0.jar
Downloaded: http://repo.cloudbees.com/content/repositories/central/org/apache/karaf/shell/org.apache.karaf.shell.console/2.3.2/org.apache.karaf.shell.console-2.3.2.jar
(432 KB at 2974.7 KB/sec)
Downloading: http://repo.cloudbees.com/content/repositories/central/org/apache/karaf/org.apache.karaf.util/2.3.2/org.apache.karaf.util-2.3.2.jar
Downloaded: http://repo.cloudbees.com/content/repositories/central/com/jcraft/jsch/0.1.49/jsch-0.1.49.jar
(224 KB at 1398.2 KB/sec)
Downloading: http://repo.cloudbees.com/content/repositories/central/org/apache/aries/blueprint/org.apache.aries.blueprint.core/1.1.0/org.apache.aries.blueprint.core-1.1.0.jar
Downloaded: http://repo.cloudbees.com/content/repositories/central/org/apache/karaf/jaas/org.apache.karaf.jaas.config/2.3.2/org.apache.karaf.jaas.config-2.3.2.jar
(43 KB at 992.8 KB/sec)
Downloading: http://repo.cloudbees.com/content/repositories/central/org/apache/aries/blueprint/org.apache.aries.blueprint.api/1.0.0/org.apache.aries.blueprint.api-1.0.0.jar
Downloaded: http://repo.cloudbees.com/content/repositories/central/org/apache/karaf/jaas/org.apache.karaf.jaas.modules/2.3.2/org.apache.karaf.jaas.modules-2.3.2.jar
(110 KB at 2097.5 KB/sec)
Downloading: http://repo.cloudbees.com/content/repositories/central/org/apache/aries/org.apache.aries.util/1.0.0/org.apache.aries.util-1.0.0.jar
Downloaded: http://repo.cloudbees.com/content/repositories/central/org/apache/karaf/org.apache.karaf.util/2.3.2/org.apache.karaf.util-2.3.2.jar
(38 KB at 716.0 KB/sec)
Downloading: http://repo.cloudbees.com/content/repositories/central/org/apache/aries/quiesce/org.apache.aries.quiesce.api/1.0.0/org.apache.aries.quiesce.api-1.0.0.jar
Downloaded: http://repo.cloudbees.com/content/repositories/central/org/apache/felix/org.apache.felix.utils/1.2.0/org.apache.felix.utils-1.2.0.jar
(60 KB at 814.2 KB/sec)
Downloading: http://repo.cloudbees.com/content/repositories/central/org/apache/aries/proxy/org.apache.aries.proxy.api/1.0.0/org.apache.aries.proxy.api-1.0.0.jar
Downloaded: http://repo.cloudbees.com/content/repositories/central/org/apache/aries/blueprint/org.apache.aries.blueprint.api/1.0.0/org.apache.aries.blueprint.api-1.0.0.jar
(33 KB at 541.5 KB/sec)
Downloading: http://repo.cloudbees.com/content/repositories/central/org/apache/felix/org.apache.felix.gogo.runtime/0.10.0/org.apache.felix.gogo.runtime-0.10.0.jar
Downloaded: http://repo.cloudbees.com/content/repositories/central/org/apache/aries/org.apache.aries.util/1.0.0/org.apache.aries.util-1.0.0.jar
(107 KB at 1312.0 KB/sec)
Downloading: http://repo.cloudbees.com/content/repositories/central/org/apache/sshd/sshd-core/0.8.0/sshd-core-0.8.0.jar
Downloaded: http://repo.cloudbees.com/content/repositories/central/org/apache/aries/blueprint/org.apache.aries.blueprint.core/1.1.0/org.apache.aries.blueprint.core-1.1.0.jar
(381 KB at 3280.1 KB/sec)
Downloading: http://repo.cloudbees.com/content/repositories/central/org/apache/mina/mina-core/2.0.5/mina-core-2.0.5.jar
Downloaded: http://repo.cloudbees.com/content/repositories/central/org/apache/aries/proxy/org.apache.aries.proxy.api/1.0.0/org.apache.aries.proxy.api-1.0.0.jar
(15 KB at 155.6 KB/sec)
Downloading: http://repo.cloudbees.com/content/repositories/central/org/codehaus/groovy/groovy-all/1.8.6/groovy-all-1.8.6.jar
Downloaded: http://repo.cloudbees.com/content/repositories/central/org/apache/aries/quiesce/org.apache.aries.quiesce.api/1.0.0/org.apache.aries.quiesce.api-1.0.0.jar
(11 KB at 82.4 KB/sec)
Downloaded: http://repo.cloudbees.com/content/repositories/central/org/apache/felix/org.apache.felix.gogo.runtime/0.10.0/org.apache.felix.gogo.runtime-0.10.0.jar
(66 KB at 558.9 KB/sec)
Downloaded: http://repo.cloudbees.com/content/repositories/central/org/apache/sshd/sshd-core/0.8.0/sshd-core-0.8.0.jar
(368 KB at 3497.9 KB/sec)
Downloaded: http://repo.cloudbees.com/content/repositories/central/org/apache/mina/mina-core/2.0.5/mina-core-2.0.5.jar
(631 KB at 4967.7 KB/sec)
Downloaded: http://repo.cloudbees.com/content/repositories/central/org/codehaus/groovy/groovy-all/1.8.6/groovy-all-1.8.6.jar
(6023 KB at 24483.0 KB/sec)
[INFO] 
[INFO] --- maven-clean-plugin:2.5:clean (default-clean) @ commands ---
[INFO] 
[INFO] --- maven-remote-resources-plugin:1.5:process (default) @ commands ---
Downloading: https://oss.sonatype.org/content/repositories/releases/org/apache/jclouds/api/sts/1.8.0-SNAPSHOT/maven-metadata.xml
Downloading: https://repository-jclouds.forge.cloudbees.com/snapshot/org/apache/jclouds/api/sts/1.8.0-SNAPSHOT/maven-metadata.xml
Downloading: https://repository.apache.org/content/repositories/snapshots/org/apache/jclouds/api/sts/1.8.0-SNAPSHOT/maven-metadata.xml
Downloading: http://download.java.net/maven/2/org/apache/jclouds/api/sts/1.8.0-SNAPSHOT/maven-metadata.xml
Downloading: http://repository.apache.org/snapshots/org/apache/jclouds/api/sts/1.8.0-SNAPSHOT/maven-metadata.xml
Downloaded: https://repository.apache.org/content/repositories/snapshots/org/apache/jclouds/api/sts/1.8.0-SNAPSHOT/maven-metadata.xml
(2 KB at 6.6 KB/sec)
Downloaded: http://repository.apache.org/snapshots/org/apache/jclouds/api/sts/1.8.0-SNAPSHOT/maven-metadata.xml
(2 KB at 6.5 KB/sec)
Downloading: https://repository-jclouds.forge.cloudbees.com/snapshot/org/apache/jclouds/api/ec2/1.8.0-SNAPSHOT/maven-metadata.xml
Downloading: https://repository.apache.org/content/repositories/snapshots/org/apache/jclouds/api/ec2/1.8.0-SNAPSHOT/maven-metadata.xml
Downloading: http://download.java.net/maven/2/org/apache/jclouds/api/ec2/1.8.0-SNAPSHOT/maven-metadata.xml
Downloading: https://oss.sonatype.org/content/repositories/releases/org/apache/jclouds/api/ec2/1.8.0-SNAPSHOT/maven-metadata.xml
Downloading: http://repository.apache.org/snapshots/org/apache/jclouds/api/ec2/1.8.0-SNAPSHOT/maven-metadata.xml
Downloaded: https://repository.apache.org/content/repositories/snapshots/org/apache/jclouds/api/ec2/1.8.0-SNAPSHOT/maven-metadata.xml
(2 KB at 6.4 KB/sec)
Downloaded: http://repository.apache.org/snapshots/org/apache/jclouds/api/ec2/1.8.0-SNAPSHOT/maven-metadata.xml
(2 KB at 6.1 KB/sec)
Downloading: https://repository-jclouds.forge.cloudbees.com/snapshot/org/apache/jclouds/driver/jclouds-jsch/1.8.0-SNAPSHOT/maven-metadata.xml
Downloading: http://download.java.net/maven/2/org/apache/jclouds/driver/jclouds-jsch/1.8.0-SNAPSHOT/maven-metadata.xml
Downloading: https://repository.apache.org/content/repositories/snapshots/org/apache/jclouds/driver/jclouds-jsch/1.8.0-SNAPSHOT/maven-metadata.xml
Downloading: https://oss.sonatype.org/content/repositories/releases/org/apache/jclouds/driver/jclouds-jsch/1.8.0-SNAPSHOT/maven-metadata.xml
Downloading: http://repository.apache.org/snapshots/org/apache/jclouds/driver/jclouds-jsch/1.8.0-SNAPSHOT/maven-metadata.xml
Downloaded: https://repository.apache.org/content/repositories/snapshots/org/apache/jclouds/driver/jclouds-jsch/1.8.0-SNAPSHOT/maven-metadata.xml
(2 KB at 6.8 KB/sec)
Downloaded: http://repository.apache.org/snapshots/org/apache/jclouds/driver/jclouds-jsch/1.8.0-SNAPSHOT/maven-metadata.xml
(2 KB at 6.6 KB/sec)
[INFO] 
[INFO] --- maven-resources-plugin:2.6:resources (default-resources) @ commands ---
[INFO] Using 'UTF-8' encoding to copy filtered resources.
[INFO] Copying 9 resources
[INFO] Copying 3 resources
[INFO] 
[INFO] --- maven-compiler-plugin:2.0.2:compile (default-compile) @ commands ---
[INFO] Compiling 69 source files to <https://jclouds.ci.cloudbees.com/job/jclouds-karaf/ws/commands/target/classes>
[INFO] ------------------------------------------------------------------------
[INFO] Reactor Summary:
[INFO] 
[INFO] Apache jclouds :: Karaf ........................... SUCCESS [17.686s]
[INFO] jclouds :: Karaf :: Core .......................... SUCCESS [22.904s]
[INFO] jclouds :: Karaf :: Utils ......................... SUCCESS [4.342s]
[INFO] jclouds :: Karaf :: Recipe ........................ SUCCESS [5.872s]
[INFO] jclouds :: Karaf :: Cache ......................... SUCCESS [4.871s]
[INFO] jclouds :: Karaf :: Services ...................... SUCCESS [27.379s]
[INFO] jclouds :: Karaf :: Commands ...................... FAILURE [10.623s]
[INFO] jclouds :: Karaf :: URL Handler ................... SKIPPED
[INFO] jclouds :: Karaf :: Chef .......................... SKIPPED
[INFO] jclouds :: Karaf :: Chef :: Core .................. SKIPPED
[INFO] jclouds :: Karaf :: Chef :: Services .............. SKIPPED
[INFO] jclouds :: Karaf :: Chef :: Commands .............. SKIPPED
[INFO] jclouds :: Karaf :: Chef :: Cache ................. SKIPPED
[INFO] jclouds :: Karaf :: Feature ....................... SKIPPED
[INFO] jclouds :: Karaf :: Integration Tests ............. SKIPPED
[INFO] ------------------------------------------------------------------------
[INFO] BUILD FAILURE
[INFO] ------------------------------------------------------------------------
[INFO] Total time: 1:40.706s
[INFO] Finished at: Mon Jun 02 08:33:26 EDT 2014
[INFO] Final Memory: 51M/167M
[INFO] ------------------------------------------------------------------------
Waiting for Jenkins to finish collecting data
[JENKINS] Archiving <https://jclouds.ci.cloudbees.com/job/jclouds-karaf/ws/chef/commands/pom.xml>
to org.apache.jclouds.karaf.chef/commands/1.8.0-SNAPSHOT/commands-1.8.0-SNAPSHOT.pom
[ERROR] Failed to execute goal org.apache.maven.plugins:maven-compiler-plugin:2.0.2:compile
(default-compile) on project commands: Compilation failure
[ERROR] <https://jclouds.ci.cloudbees.com/job/jclouds-karaf/ws/commands/src/main/java/org/jclouds/karaf/commands/blobstore/BlobWriteCommand.java>:[78,43]
cannot find symbol
[ERROR] symbol  : method calculateMD5()
[ERROR] location: interface org.jclouds.blobstore.domain.BlobBuilder.PayloadBlobBuilder
[ERROR] -> [Help 1]
org.apache.maven.lifecycle.LifecycleExecutionException: Failed to execute goal org.apache.maven.plugins:maven-compiler-plugin:2.0.2:compile
(default-compile) on project commands: Compilation failure
<https://jclouds.ci.cloudbees.com/job/jclouds-karaf/ws/commands/src/main/java/org/jclouds/karaf/commands/blobstore/BlobWriteCommand.java>:[78,43]
cannot find symbol
symbol  : method calculateMD5()
location: interface org.jclouds.blobstore.domain.BlobBuilder.PayloadBlobBuilder


	at org.apache.maven.lifecycle.internal.MojoExecutor.execute(MojoExecutor.java:213)
	at org.apache.maven.lifecycle.internal.MojoExecutor.execute(MojoExecutor.java:153)
	at org.apache.maven.lifecycle.internal.MojoExecutor.execute(MojoExecutor.java:145)
	at org.apache.maven.lifecycle.internal.LifecycleModuleBuilder.buildProject(LifecycleModuleBuilder.java:84)
	at org.apache.maven.lifecycle.internal.LifecycleModuleBuilder.buildProject(LifecycleModuleBuilder.java:59)
	at org.apache.maven.lifecycle.internal.LifecycleStarter.singleThreadedBuild(LifecycleStarter.java:183)
	at org.apache.maven.lifecycle.internal.LifecycleStarter.execute(LifecycleStarter.java:161)
	at org.apache.maven.DefaultMaven.doExecute(DefaultMaven.java:319)
	at org.apache.maven.DefaultMaven.execute(DefaultMaven.java:156)
	at org.jvnet.hudson.maven3.launcher.Maven3Launcher.main(Maven3Launcher.java:117)
	at sun.reflect.NativeMethodAccessorImpl.invoke0(Native Method)
	at sun.reflect.NativeMethodAccessorImpl.invoke(NativeMethodAccessorImpl.java:39)
	at sun.reflect.DelegatingMethodAccessorImpl.invoke(DelegatingMethodAccessorImpl.java:25)
	at java.lang.reflect.Method.invoke(Method.java:597)
	at org.codehaus.plexus.classworlds.launcher.Launcher.launchStandard(Launcher.java:329)
	at org.codehaus.plexus.classworlds.launcher.Launcher.launch(Launcher.java:239)
	at org.jvnet.hudson.maven3.agent.Maven3Main.launch(Maven3Main.java:178)
	at sun.reflect.NativeMethodAccessorImpl.invoke0(Native Method)
	at sun.reflect.NativeMethodAccessorImpl.invoke(NativeMethodAccessorImpl.java:39)
	at sun.reflect.DelegatingMethodAccessorImpl.invoke(DelegatingMethodAccessorImpl.java:25)
	at java.lang.reflect.Method.invoke(Method.java:597)
	at hudson.maven.Maven3Builder.call(Maven3Builder.java:134)
	at hudson.maven.Maven3Builder.call(Maven3Builder.java:69)
	at hudson.remoting.UserRequest.perform(UserRequest.java:118)
	at hudson.remoting.UserRequest.perform(UserRequest.java:48)
	at hudson.remoting.Request$2.run(Request.java:328)
	at hudson.remoting.InterceptingExecutorService$1.call(InterceptingExecutorService.java:72)
	at java.util.concurrent.FutureTask$Sync.innerRun(FutureTask.java:303)
	at java.util.concurrent.FutureTask.run(FutureTask.java:138)
	at java.util.concurrent.ThreadPoolExecutor$Worker.runTask(ThreadPoolExecutor.java:895)
	at java.util.concurrent.ThreadPoolExecutor$Worker.run(ThreadPoolExecutor.java:918)
	at java.lang.Thread.run(Thread.java:662)
Caused by: org.apache.maven.plugin.CompilationFailureException: Compilation failure
<https://jclouds.ci.cloudbees.com/job/jclouds-karaf/ws/commands/src/main/java/org/jclouds/karaf/commands/blobstore/BlobWriteCommand.java>:[78,43]
cannot find symbol
symbol  : method calculateMD5()
location: interface org.jclouds.blobstore.domain.BlobBuilder.PayloadBlobBuilder


	at org.apache.maven.plugin.AbstractCompilerMojo.execute(AbstractCompilerMojo.java:516)
	at org.apache.maven.plugin.CompilerMojo.execute(CompilerMojo.java:114)
	at org.apache.maven.plugin.DefaultBuildPluginManager.executeMojo(DefaultBuildPluginManager.java:101)
	at org.apache.maven.lifecycle.internal.MojoExecutor.execute(MojoExecutor.java:209)
	... 31 more
[ERROR] 
[ERROR] Re-run Maven using the -X switch to enable full debug logging.
[ERROR] 
[ERROR] For more information about the errors and possible solutions, please read the following
articles:
[ERROR] [Help 1] http://cwiki.apache.org/confluence/display/MAVEN/MojoFailureException
[ERROR] 
[ERROR] After correcting the problems, you can resume the build with the command
[ERROR]   mvn <goals> -rf :commands
[JENKINS] Archiving <https://jclouds.ci.cloudbees.com/job/jclouds-karaf/ws/chef/cache/pom.xml>
to org.apache.jclouds.karaf.chef/cache/1.8.0-SNAPSHOT/cache-1.8.0-SNAPSHOT.pom
[JENKINS] Archiving <https://jclouds.ci.cloudbees.com/job/jclouds-karaf/ws/commands/pom.xml>
to org.apache.jclouds.karaf/commands/1.8.0-SNAPSHOT/commands-1.8.0-SNAPSHOT.pom
[JENKINS] Archiving <https://jclouds.ci.cloudbees.com/job/jclouds-karaf/ws/utils/pom.xml>
to org.apache.jclouds.karaf/utils/1.8.0-SNAPSHOT/utils-1.8.0-SNAPSHOT.pom
[JENKINS] Archiving <https://jclouds.ci.cloudbees.com/job/jclouds-karaf/ws/utils/target/utils-1.8.0-SNAPSHOT.jar>
to org.apache.jclouds.karaf/utils/1.8.0-20140602.123233-192/utils-1.8.0-20140602.123233-192.jar
[JENKINS] Archiving <https://jclouds.ci.cloudbees.com/job/jclouds-karaf/ws/feature/pom.xml>
to org.apache.jclouds.karaf/jclouds-karaf/1.8.0-SNAPSHOT/jclouds-karaf-1.8.0-SNAPSHOT.pom
[JENKINS] Archiving <https://jclouds.ci.cloudbees.com/job/jclouds-karaf/ws/itests/pom.xml>
to org.apache.jclouds.karaf/itests/1.8.0-SNAPSHOT/itests-1.8.0-SNAPSHOT.pom
[JENKINS] Archiving <https://jclouds.ci.cloudbees.com/job/jclouds-karaf/ws/chef/core/pom.xml>
to org.apache.jclouds.karaf.chef/core/1.8.0-SNAPSHOT/core-1.8.0-SNAPSHOT.pom
[JENKINS] Archiving <https://jclouds.ci.cloudbees.com/job/jclouds-karaf/ws/urlhandler/pom.xml>
to org.apache.jclouds.karaf/urlhandler/1.8.0-SNAPSHOT/urlhandler-1.8.0-SNAPSHOT.pom
[JENKINS] Archiving <https://jclouds.ci.cloudbees.com/job/jclouds-karaf/ws/services/pom.xml>
to org.apache.jclouds.karaf/services/1.8.0-SNAPSHOT/services-1.8.0-SNAPSHOT.pom
[JENKINS] Archiving <https://jclouds.ci.cloudbees.com/job/jclouds-karaf/ws/services/target/services-1.8.0-SNAPSHOT.jar>
to org.apache.jclouds.karaf/services/1.8.0-20140602.123312-190/services-1.8.0-20140602.123312-190.jar
[JENKINS] Archiving <https://jclouds.ci.cloudbees.com/job/jclouds-karaf/ws/core/pom.xml>
to org.apache.jclouds.karaf/core/1.8.0-SNAPSHOT/core-1.8.0-SNAPSHOT.pom
[JENKINS] Archiving <https://jclouds.ci.cloudbees.com/job/jclouds-karaf/ws/core/target/core-1.8.0-SNAPSHOT.jar>
to org.apache.jclouds.karaf/core/1.8.0-20140602.123228-192/core-1.8.0-20140602.123228-192.jar
[JENKINS] Archiving <https://jclouds.ci.cloudbees.com/job/jclouds-karaf/ws/recipe/pom.xml>
to org.apache.jclouds.karaf/recipe/1.8.0-SNAPSHOT/recipe-1.8.0-SNAPSHOT.pom
[JENKINS] Archiving <https://jclouds.ci.cloudbees.com/job/jclouds-karaf/ws/recipe/target/recipe-1.8.0-SNAPSHOT.jar>
to org.apache.jclouds.karaf/recipe/1.8.0-20140602.123238-192/recipe-1.8.0-20140602.123238-192.jar
[JENKINS] Archiving <https://jclouds.ci.cloudbees.com/job/jclouds-karaf/ws/chef/services/pom.xml>
to org.apache.jclouds.karaf.chef/services/1.8.0-SNAPSHOT/services-1.8.0-SNAPSHOT.pom
[JENKINS] Archiving <https://jclouds.ci.cloudbees.com/job/jclouds-karaf/ws/chef/pom.xml>
to org.apache.jclouds.karaf/chef/1.8.0-SNAPSHOT/chef-1.8.0-SNAPSHOT.pom
[JENKINS] Archiving <https://jclouds.ci.cloudbees.com/job/jclouds-karaf/ws/cache/pom.xml>
to org.apache.jclouds.karaf/cache/1.8.0-SNAPSHOT/cache-1.8.0-SNAPSHOT.pom
[JENKINS] Archiving <https://jclouds.ci.cloudbees.com/job/jclouds-karaf/ws/cache/target/cache-1.8.0-SNAPSHOT.jar>
to org.apache.jclouds.karaf/cache/1.8.0-20140602.123244-192/cache-1.8.0-20140602.123244-192.jar
[JENKINS] Archiving <https://jclouds.ci.cloudbees.com/job/jclouds-karaf/ws/pom.xml>
to org.apache.jclouds/jclouds-karaf/1.8.0-SNAPSHOT/jclouds-karaf-1.8.0-SNAPSHOT.pom
channel stopped

Mime
View raw message