jclouds-notifications mailing list archives

Site index · List index
Message view « Date » · « Thread »
Top « Date » · « Thread »
From BuildHive <buildhive-git...@cloudbees.com>
Subject Build failed in Jenkins: jclouds » jclouds-chef #1032
Date Mon, 02 Jun 2014 17:04:17 GMT
See <https://buildhive.cloudbees.com/job/jclouds/job/jclouds-chef/1032/>

------------------------------------------
[...truncated 25 lines...]
[WARNING] It is highly recommended to fix these problems because they threaten the stability
of your build.
[WARNING] 
[WARNING] For this reason, future Maven versions might no longer support building such malformed
projects.
[WARNING] 
[INFO] ------------------------------------------------------------------------
[INFO] Reactor Build Order:
[INFO] 
[INFO] Apache jclouds Chef :: Project
[INFO] Apache jclouds Chef :: Core
[INFO] Apache jclouds Chef :: Compute
[INFO] Apache jclouds Chef :: Enterprise
[INFO] Apache jclouds Chef
[INFO]                                                                         
[INFO] ------------------------------------------------------------------------
[INFO] Building Apache jclouds Chef :: Project 1.8.0-SNAPSHOT
[INFO] ------------------------------------------------------------------------
[INFO] 
[INFO] --- maven-clean-plugin:2.5:clean (default-clean) @ chef-project ---
[INFO] 
[INFO] --- maven-remote-resources-plugin:1.3:process (default) @ chef-project ---
[INFO] 
[INFO] --- apache-rat-plugin:0.10:check (default) @ chef-project ---
[INFO] 51 implicit excludes (use -debug for more details).
[INFO] Exclude: **/src/test/resources/**/*.sh
[INFO] Exclude: **/src/test/resources/**/*.bat
[INFO] Exclude: **/src/test/resources/**/*.cmd
[INFO] Exclude: **/src/test/resources/**/*.txt
[INFO] Exclude: **/src/test/resources/**/*.gz
[INFO] Exclude: **/src/test/resources/**/*.xml
[INFO] Exclude: **/src/test/resources/**/*.json
[INFO] Exclude: **/LICENSE.txt
[INFO] Exclude: **/header.txt
[INFO] Exclude: **/NOTICE.txt
[INFO] Exclude: **/DISCLAIMER
[INFO] Exclude: **/BUILD.txt
[INFO] Exclude: **/CHANGES.txt
[INFO] Exclude: **/README.md
[INFO] Exclude: **/README.txt
[INFO] Exclude: **/DEPENDENCIES
[INFO] Exclude: **/*ProviderMetadata
[INFO] Exclude: **/*ApiMetadata
[INFO] Exclude: **/target/**
[INFO] Exclude: **/test-output/**
[INFO] Exclude: **/bin/**
[INFO] Exclude: **/.settings/**
[INFO] Exclude: **/.classpath
[INFO] Exclude: **/.dir-locals.el
[INFO] Exclude: **/.project
[INFO] Exclude: **/.idea/**
[INFO] Exclude: **/*.iml
[INFO] Exclude: **/*.eml
[INFO] Exclude: **/*.ipr
[INFO] Exclude: **/*.iws
[INFO] Exclude: **/*.DS_STORE
[INFO] Exclude: **/TAGS
[INFO] Exclude: **/.metadata/**
[INFO] Exclude: **/atlassian-ide-plugin.xml
[INFO] Exclude: **/.DS_Store
[INFO] Exclude: .mailmap
[INFO] Exclude: .git/**
[INFO] Exclude: **/.gitignore
[INFO] Exclude: **/.gitattributes
[INFO] Exclude: .repository/**
[INFO] Exclude: gc.log
[INFO] 1 resources included (use -debug for more details)
Warning:  org.apache.xerces.jaxp.SAXParserImpl$JAXPSAXParser: Property 'http://www.oracle.com/xml/jaxp/properties/entityExpansionLimit'
is not recognized.
Compiler warnings:
  WARNING:  'org.apache.xerces.jaxp.SAXParserImpl: Property 'http://javax.xml.XMLConstants/property/accessExternalDTD'
is not recognized.'
Warning:  org.apache.xerces.parsers.SAXParser: Feature 'http://javax.xml.XMLConstants/feature/secure-processing'
is not recognized.
Warning:  org.apache.xerces.parsers.SAXParser: Property 'http://javax.xml.XMLConstants/property/accessExternalDTD'
is not recognized.
Warning:  org.apache.xerces.parsers.SAXParser: Property 'http://www.oracle.com/xml/jaxp/properties/entityExpansionLimit'
is not recognized.
[INFO] Rat check: Summary of files. Unapproved: 0 unknown: 0 generated: 0 approved: 1 licence.
[INFO] 
[INFO] --- maven-jar-plugin:2.4:test-jar (default) @ chef-project ---
[WARNING] JAR will be empty - no content was marked for inclusion!
[INFO] Building jar: <https://buildhive.cloudbees.com/job/jclouds/job/jclouds-chef/ws/project/target/chef-project-1.8.0-SNAPSHOT-tests.jar>
[INFO] 
[INFO] --- maven-site-plugin:3.3:attach-descriptor (attach-descriptor) @ chef-project ---
[INFO] 
[INFO] --- maven-surefire-plugin:2.12:test (integration) @ chef-project ---
[INFO] No tests to run.
[INFO] Surefire report directory: <https://buildhive.cloudbees.com/job/jclouds/job/jclouds-chef/ws/project/target/surefire-reports>

-------------------------------------------------------
 T E S T S
-------------------------------------------------------

Results :

Tests run: 0, Failures: 0, Errors: 0, Skipped: 0

[JENKINS] Recording test results
[INFO]                                                                         
[INFO] ------------------------------------------------------------------------
[INFO] Building Apache jclouds Chef :: Core 1.8.0-SNAPSHOT
[INFO] ------------------------------------------------------------------------
Downloading: http://repository.apache.org/snapshots/org/apache/jclouds/jclouds-core/1.8.0-SNAPSHOT/maven-metadata.xml
Downloading: https://repository.apache.org/content/repositories/snapshots/org/apache/jclouds/jclouds-core/1.8.0-SNAPSHOT/maven-metadata.xml
Downloading: http://clojars.org/repo/org/apache/jclouds/jclouds-core/1.8.0-SNAPSHOT/maven-metadata.xml
Downloaded: http://repository.apache.org/snapshots/org/apache/jclouds/jclouds-core/1.8.0-SNAPSHOT/maven-metadata.xml
(2 KB at 1.1 KB/sec)
Downloaded: https://repository.apache.org/content/repositories/snapshots/org/apache/jclouds/jclouds-core/1.8.0-SNAPSHOT/maven-metadata.xml
(2 KB at 0.7 KB/sec)
Downloading: https://repository.apache.org/content/repositories/snapshots/org/apache/jclouds/jclouds-core/1.8.0-SNAPSHOT/jclouds-core-1.8.0-20140602.152256-188.pom
Downloaded: https://repository.apache.org/content/repositories/snapshots/org/apache/jclouds/jclouds-core/1.8.0-SNAPSHOT/jclouds-core-1.8.0-20140602.152256-188.pom
(6 KB at 25.7 KB/sec)
Downloading: https://repository.apache.org/content/repositories/snapshots/org/apache/jclouds/jclouds-project/1.8.0-SNAPSHOT/maven-metadata.xml
Downloading: http://clojars.org/repo/org/apache/jclouds/jclouds-project/1.8.0-SNAPSHOT/maven-metadata.xml
Downloading: http://repository.apache.org/snapshots/org/apache/jclouds/jclouds-project/1.8.0-SNAPSHOT/maven-metadata.xml
Downloaded: https://repository.apache.org/content/repositories/snapshots/org/apache/jclouds/jclouds-project/1.8.0-SNAPSHOT/maven-metadata.xml
(828 B at 3.5 KB/sec)
Downloaded: http://repository.apache.org/snapshots/org/apache/jclouds/jclouds-project/1.8.0-SNAPSHOT/maven-metadata.xml
(828 B at 2.5 KB/sec)
Downloading: https://repository.apache.org/content/repositories/snapshots/org/apache/jclouds/jclouds-project/1.8.0-SNAPSHOT/jclouds-project-1.8.0-20140602.152045-188.pom
Downloaded: https://repository.apache.org/content/repositories/snapshots/org/apache/jclouds/jclouds-project/1.8.0-SNAPSHOT/jclouds-project-1.8.0-20140602.152045-188.pom
(38 KB at 76.6 KB/sec)
Downloading: http://repository.apache.org/snapshots/org/apache/jclouds/jclouds-scriptbuilder/1.8.0-SNAPSHOT/maven-metadata.xml
Downloading: https://repository.apache.org/content/repositories/snapshots/org/apache/jclouds/jclouds-scriptbuilder/1.8.0-SNAPSHOT/maven-metadata.xml
Downloading: http://clojars.org/repo/org/apache/jclouds/jclouds-scriptbuilder/1.8.0-SNAPSHOT/maven-metadata.xml
Downloaded: https://repository.apache.org/content/repositories/snapshots/org/apache/jclouds/jclouds-scriptbuilder/1.8.0-SNAPSHOT/maven-metadata.xml
(2 KB at 6.1 KB/sec)
Downloaded: http://repository.apache.org/snapshots/org/apache/jclouds/jclouds-scriptbuilder/1.8.0-SNAPSHOT/maven-metadata.xml
(2 KB at 1.5 KB/sec)
Downloading: https://repository.apache.org/content/repositories/snapshots/org/apache/jclouds/jclouds-scriptbuilder/1.8.0-SNAPSHOT/jclouds-scriptbuilder-1.8.0-20140602.152442-187.pom
Downloaded: https://repository.apache.org/content/repositories/snapshots/org/apache/jclouds/jclouds-scriptbuilder/1.8.0-SNAPSHOT/jclouds-scriptbuilder-1.8.0-20140602.152442-187.pom
(4 KB at 16.1 KB/sec)
Downloading: https://repository.apache.org/content/repositories/snapshots/org/apache/jclouds/jclouds-blobstore/1.8.0-SNAPSHOT/maven-metadata.xml
Downloading: http://clojars.org/repo/org/apache/jclouds/jclouds-blobstore/1.8.0-SNAPSHOT/maven-metadata.xml
Downloading: http://repository.apache.org/snapshots/org/apache/jclouds/jclouds-blobstore/1.8.0-SNAPSHOT/maven-metadata.xml
Downloaded: https://repository.apache.org/content/repositories/snapshots/org/apache/jclouds/jclouds-blobstore/1.8.0-SNAPSHOT/maven-metadata.xml
(2 KB at 5.6 KB/sec)
Downloaded: http://repository.apache.org/snapshots/org/apache/jclouds/jclouds-blobstore/1.8.0-SNAPSHOT/maven-metadata.xml
(2 KB at 5.4 KB/sec)
Downloading: https://repository.apache.org/content/repositories/snapshots/org/apache/jclouds/jclouds-blobstore/1.8.0-SNAPSHOT/jclouds-blobstore-1.8.0-20140602.153014-182.pom
Downloaded: https://repository.apache.org/content/repositories/snapshots/org/apache/jclouds/jclouds-blobstore/1.8.0-SNAPSHOT/jclouds-blobstore-1.8.0-20140602.153014-182.pom
(4 KB at 15.9 KB/sec)
Downloading: https://repository.apache.org/content/repositories/snapshots/org/apache/jclouds/driver/jclouds-slf4j/1.8.0-SNAPSHOT/maven-metadata.xml
Downloading: http://clojars.org/repo/org/apache/jclouds/driver/jclouds-slf4j/1.8.0-SNAPSHOT/maven-metadata.xml
Downloading: http://repository.apache.org/snapshots/org/apache/jclouds/driver/jclouds-slf4j/1.8.0-SNAPSHOT/maven-metadata.xml
Downloaded: https://repository.apache.org/content/repositories/snapshots/org/apache/jclouds/driver/jclouds-slf4j/1.8.0-SNAPSHOT/maven-metadata.xml
(2 KB at 5.1 KB/sec)
Downloaded: http://repository.apache.org/snapshots/org/apache/jclouds/driver/jclouds-slf4j/1.8.0-SNAPSHOT/maven-metadata.xml
(2 KB at 0.4 KB/sec)
Downloading: https://repository.apache.org/content/repositories/snapshots/org/apache/jclouds/driver/jclouds-slf4j/1.8.0-SNAPSHOT/jclouds-slf4j-1.8.0-20140602.152733-185.pom
Downloaded: https://repository.apache.org/content/repositories/snapshots/org/apache/jclouds/driver/jclouds-slf4j/1.8.0-SNAPSHOT/jclouds-slf4j-1.8.0-20140602.152733-185.pom
(3 KB at 12.1 KB/sec)
Downloading: https://repository.apache.org/content/repositories/snapshots/org/apache/jclouds/jclouds-blobstore/1.8.0-SNAPSHOT/jclouds-blobstore-1.8.0-20140602.153014-182.jar
Downloading: https://repository.apache.org/content/repositories/snapshots/org/apache/jclouds/jclouds-core/1.8.0-SNAPSHOT/jclouds-core-1.8.0-20140602.152256-188.jar
Downloading: https://repository.apache.org/content/repositories/snapshots/org/apache/jclouds/jclouds-scriptbuilder/1.8.0-SNAPSHOT/jclouds-scriptbuilder-1.8.0-20140602.152442-187-tests.jar
Downloading: https://repository.apache.org/content/repositories/snapshots/org/apache/jclouds/jclouds-scriptbuilder/1.8.0-SNAPSHOT/jclouds-scriptbuilder-1.8.0-20140602.152442-187.jar
Downloading: https://repository.apache.org/content/repositories/snapshots/org/apache/jclouds/jclouds-core/1.8.0-SNAPSHOT/jclouds-core-1.8.0-20140602.152256-188-tests.jar
Downloaded: https://repository.apache.org/content/repositories/snapshots/org/apache/jclouds/jclouds-scriptbuilder/1.8.0-SNAPSHOT/jclouds-scriptbuilder-1.8.0-20140602.152442-187-tests.jar
(98 KB at 136.3 KB/sec)
Downloading: https://repository.apache.org/content/repositories/snapshots/org/apache/jclouds/driver/jclouds-slf4j/1.8.0-SNAPSHOT/jclouds-slf4j-1.8.0-20140602.152733-185.jar
Downloaded: https://repository.apache.org/content/repositories/snapshots/org/apache/jclouds/driver/jclouds-slf4j/1.8.0-SNAPSHOT/jclouds-slf4j-1.8.0-20140602.152733-185.jar
(12 KB at 53.8 KB/sec)
Downloaded: https://repository.apache.org/content/repositories/snapshots/org/apache/jclouds/jclouds-scriptbuilder/1.8.0-SNAPSHOT/jclouds-scriptbuilder-1.8.0-20140602.152442-187.jar
(169 KB at 153.9 KB/sec)
Downloaded: https://repository.apache.org/content/repositories/snapshots/org/apache/jclouds/jclouds-blobstore/1.8.0-SNAPSHOT/jclouds-blobstore-1.8.0-20140602.153014-182.jar
(167 KB at 135.2 KB/sec)
Downloaded: https://repository.apache.org/content/repositories/snapshots/org/apache/jclouds/jclouds-core/1.8.0-SNAPSHOT/jclouds-core-1.8.0-20140602.152256-188-tests.jar
(601 KB at 311.1 KB/sec)
Downloaded: https://repository.apache.org/content/repositories/snapshots/org/apache/jclouds/jclouds-core/1.8.0-SNAPSHOT/jclouds-core-1.8.0-20140602.152256-188.jar
(754 KB at 389.6 KB/sec)
[INFO] 
[INFO] --- maven-clean-plugin:2.5:clean (default-clean) @ chef ---
[INFO] 
[INFO] --- maven-remote-resources-plugin:1.5:process (default) @ chef ---
Downloading: https://oss.sonatype.org/content/repositories/snapshots/org/apache/jclouds/jclouds-project/1.8.0-SNAPSHOT/maven-metadata.xml
Downloading: https://oss.sonatype.org/content/repositories/snapshots/org/apache/jclouds/jclouds-core/1.8.0-SNAPSHOT/maven-metadata.xml
[INFO] 
[INFO] --- maven-resources-plugin:2.6:resources (default-resources) @ chef ---
[INFO] Using 'UTF-8' encoding to copy filtered resources.
[INFO] Copying 1 resource
[INFO] Copying 3 resources
[INFO] 
[INFO] --- maven-compiler-plugin:2.5:compile (default-compile) @ chef ---
[INFO] Compiling 101 source files to <https://buildhive.cloudbees.com/job/jclouds/job/jclouds-chef/ws/core/target/classes>
[INFO] 
[INFO] --- maven-resources-plugin:2.6:testResources (default-testResources) @ chef ---
[INFO] Using 'UTF-8' encoding to copy filtered resources.
[INFO] Copying 21 resources
[INFO] Copying 3 resources
[INFO] 
[INFO] --- maven-compiler-plugin:2.5:testCompile (default-testCompile) @ chef ---
[INFO] Compiling 52 source files to <https://buildhive.cloudbees.com/job/jclouds/job/jclouds-chef/ws/core/target/test-classes>
[INFO] -------------------------------------------------------------
[ERROR] COMPILATION ERROR : 
[INFO] -------------------------------------------------------------
[ERROR] <https://buildhive.cloudbees.com/job/jclouds/job/jclouds-chef/ws/core/src/test/java/org/jclouds/chef/strategy/internal/ListCookbookVersionsInEnvironmentImplLiveTest.java>:[103,14]
error: cannot find symbol
[ERROR]   symbol:   method calculateMD5(FilePayload)
  location: class Payloads
<https://buildhive.cloudbees.com/job/jclouds/job/jclouds-chef/ws/core/src/test/java/org/jclouds/chef/internal/BaseChefApiLiveTest.java>:[93,14]
error: cannot find symbol
[INFO] 2 errors 
[INFO] -------------------------------------------------------------
[INFO] ------------------------------------------------------------------------
[INFO] Reactor Summary:
[INFO] 
[INFO] Apache jclouds Chef :: Project .................... SUCCESS [33.038s]
[INFO] Apache jclouds Chef :: Core ....................... FAILURE [54.907s]
[INFO] Apache jclouds Chef :: Compute .................... SKIPPED
[INFO] Apache jclouds Chef :: Enterprise ................. SKIPPED
[INFO] Apache jclouds Chef ............................... SKIPPED
[INFO] ------------------------------------------------------------------------
[INFO] BUILD FAILURE
[INFO] ------------------------------------------------------------------------
[INFO] Total time: 1:35.193s
[INFO] Finished at: Mon Jun 02 17:04:08 UTC 2014
[INFO] Final Memory: 29M/73M
[INFO] ------------------------------------------------------------------------
[ERROR] Failed to execute goal org.apache.maven.plugins:maven-compiler-plugin:2.5:testCompile
(default-testCompile) on project chef: Compilation failure: Compilation failure:
Waiting for Jenkins to finish collecting data[ERROR] <https://buildhive.cloudbees.com/job/jclouds/job/jclouds-chef/ws/core/src/test/java/org/jclouds/chef/strategy/internal/ListCookbookVersionsInEnvironmentImplLiveTest.java>:[103,14]
error: cannot find symbol
[ERROR] symbol:   method calculateMD5(FilePayload)

[JENKINS] Archiving <https://buildhive.cloudbees.com/job/jclouds/job/jclouds-chef/ws/project/pom.xml>
to org.apache.jclouds.chef/chef-project/1.8.0-SNAPSHOT/chef-project-1.8.0-SNAPSHOT.pom
[JENKINS] Archiving <https://buildhive.cloudbees.com/job/jclouds/job/jclouds-chef/ws/project/target/chef-project-1.8.0-SNAPSHOT-tests.jar>
to org.apache.jclouds.chef/chef-project/1.8.0-SNAPSHOT/chef-project-1.8.0-SNAPSHOT-tests.jar
[ERROR] location: class Payloads
[ERROR] <https://buildhive.cloudbees.com/job/jclouds/job/jclouds-chef/ws/core/src/test/java/org/jclouds/chef/internal/BaseChefApiLiveTest.java>:[93,14]
error: cannot find symbol
[ERROR] -> [Help 1]
org.apache.maven.lifecycle.LifecycleExecutionException: Failed to execute goal org.apache.maven.plugins:maven-compiler-plugin:2.5:testCompile
(default-testCompile) on project chef: Compilation failure
	at org.apache.maven.lifecycle.internal.MojoExecutor.execute(MojoExecutor.java:213)
	at org.apache.maven.lifecycle.internal.MojoExecutor.execute(MojoExecutor.java:153)
	at org.apache.maven.lifecycle.internal.MojoExecutor.execute(MojoExecutor.java:145)
	at org.apache.maven.lifecycle.internal.LifecycleModuleBuilder.buildProject(LifecycleModuleBuilder.java:84)
	at org.apache.maven.lifecycle.internal.LifecycleModuleBuilder.buildProject(LifecycleModuleBuilder.java:59)
	at org.apache.maven.lifecycle.internal.LifecycleStarter.singleThreadedBuild(LifecycleStarter.java:183)
	at org.apache.maven.lifecycle.internal.LifecycleStarter.execute(LifecycleStarter.java:161)
	at org.apache.maven.DefaultMaven.doExecute(DefaultMaven.java:320)
	at org.apache.maven.DefaultMaven.execute(DefaultMaven.java:156)
	at org.jvnet.hudson.maven3.launcher.Maven3Launcher.main(Maven3Launcher.java:117)
	at sun.reflect.NativeMethodAccessorImpl.invoke0(Native Method)
	at sun.reflect.NativeMethodAccessorImpl.invoke(NativeMethodAccessorImpl.java:57)
	at sun.reflect.DelegatingMethodAccessorImpl.invoke(DelegatingMethodAccessorImpl.java:43)
	at java.lang.reflect.Method.invoke(Method.java:606)
	at org.codehaus.plexus.classworlds.launcher.Launcher.launchStandard(Launcher.java:329)
	at org.codehaus.plexus.classworlds.launcher.Launcher.launch(Launcher.java:239)
	at org.jvnet.hudson.maven3.agent.Maven3Main.launch(Maven3Main.java:178)
	at sun.reflect.NativeMethodAccessorImpl.invoke0(Native Method)
	at sun.reflect.NativeMethodAccessorImpl.invoke(NativeMethodAccessorImpl.java:57)
	at sun.reflect.DelegatingMethodAccessorImpl.invoke(DelegatingMethodAccessorImpl.java:43)
	at java.lang.reflect.Method.invoke(Method.java:606)
	at hudson.maven.Maven3Builder.call(Maven3Builder.java:134)
	at hudson.maven.Maven3Builder.call(Maven3Builder.java:69)
	at hudson.remoting.UserRequest.perform(UserRequest.java:118)
	at hudson.remoting.UserRequest.perform(UserRequest.java:48)
	at hudson.remoting.Request$2.run(Request.java:328)
	at hudson.remoting.InterceptingExecutorService$1.call(InterceptingExecutorService.java:72)
	at java.util.concurrent.FutureTask.run(FutureTask.java:262)
	at java.util.concurrent.ThreadPoolExecutor.runWorker(ThreadPoolExecutor.java:1145)
	at java.util.concurrent.ThreadPoolExecutor$Worker.run(ThreadPoolExecutor.java:615)
	at java.lang.Thread.run(Thread.java:744)
Caused by: org.apache.maven.plugin.CompilationFailureException: Compilation failure
	at org.apache.maven.plugin.AbstractCompilerMojo.execute(AbstractCompilerMojo.java:729)
	at org.apache.maven.plugin.TestCompilerMojo.execute(TestCompilerMojo.java:161)
	at org.apache.maven.plugin.DefaultBuildPluginManager.executeMojo(DefaultBuildPluginManager.java:101)
	at org.apache.maven.lifecycle.internal.MojoExecutor.execute(MojoExecutor.java:209)
	... 30 more
[ERROR] 
[ERROR] Re-run Maven using the -X switch to enable full debug logging.
[ERROR] 
[ERROR] For more information about the errors and possible solutions, please read the following
articles:
[ERROR] [Help 1] http://cwiki.apache.org/confluence/display/MAVEN/MojoFailureException
[ERROR] 
[ERROR] After correcting the problems, you can resume the build with the command
[ERROR]   mvn <goals> -rf :chef
[JENKINS] Archiving <https://buildhive.cloudbees.com/job/jclouds/job/jclouds-chef/ws/enterprise/pom.xml>
to org.apache.jclouds.provider/enterprisechef/1.8.0-SNAPSHOT/enterprisechef-1.8.0-SNAPSHOT.pom
[JENKINS] Archiving <https://buildhive.cloudbees.com/job/jclouds/job/jclouds-chef/ws/compute/pom.xml>
to org.apache.jclouds.chef/chef-compute/1.8.0-SNAPSHOT/chef-compute-1.8.0-SNAPSHOT.pom
[JENKINS] Archiving <https://buildhive.cloudbees.com/job/jclouds/job/jclouds-chef/ws/core/pom.xml>
to org.apache.jclouds.api/chef/1.8.0-SNAPSHOT/chef-1.8.0-SNAPSHOT.pom
[JENKINS] Archiving <https://buildhive.cloudbees.com/job/jclouds/job/jclouds-chef/ws/pom.xml>
to org.apache.jclouds.chef/jclouds-chef/1.8.0-SNAPSHOT/jclouds-chef-1.8.0-SNAPSHOT.pom
channel stopped

Mime
View raw message