jclouds-notifications mailing list archives

Site index · List index
Message view « Date » · « Thread »
Top « Date » · « Thread »
From BuildHive <buildhive-git...@cloudbees.com>
Subject Build failed in Jenkins: jclouds » jclouds-labs-aws #1238
Date Sun, 03 Aug 2014 11:39:19 GMT
See <https://buildhive.cloudbees.com/job/jclouds/job/jclouds-labs-aws/1238/changes>

Changes:

[romancoedo] JCLOUDS-457: Fix some nits

[romancoedo] Fixed putBlob javadoc

[romancoedo] changed @demobox suggestions

------------------------------------------
[...truncated 999 lines...]
Test suite progress: tests succeeded: 52, failed: 0, skipped: 0.
[pool-13-thread-1] Test testListWithOptionsWhenResponseIs2xx(org.jclouds.rds.features.SubnetGroupApiExpectTest)
succeeded: 1358ms
Test suite progress: tests succeeded: 53, failed: 0, skipped: 0.
[pool-13-thread-2] Test testListWhenResponseIs404(org.jclouds.rds.features.SubnetGroupApiExpectTest)
succeeded: 1493ms
Test suite progress: tests succeeded: 54, failed: 0, skipped: 0.
Tests run: 54, Failures: 0, Errors: 0, Skipped: 0, Time elapsed: 38.173 sec - in TestSuite

Results :

Tests run: 54, Failures: 0, Errors: 0, Skipped: 0

[JENKINS] Recording test results
[INFO] 
[INFO] --- maven-bundle-plugin:2.3.7:bundle (default-bundle) @ rds ---
[WARNING] Bundle org.apache.jclouds.labs:rds:bundle:1.8.0-SNAPSHOT : Did not find matching
referal for org.jclouds.labs*
[INFO] 
[INFO] --- maven-site-plugin:3.3:attach-descriptor (attach-descriptor) @ rds ---
[INFO] 
[INFO] --- apache-rat-plugin:0.10:check (default) @ rds ---
[INFO] 51 implicit excludes (use -debug for more details).
[INFO] Exclude: **/src/test/resources/**/*.sh
[INFO] Exclude: **/src/test/resources/**/*.bat
[INFO] Exclude: **/src/test/resources/**/*.cmd
[INFO] Exclude: **/src/test/resources/**/*.txt
[INFO] Exclude: **/src/test/resources/**/*.gz
[INFO] Exclude: **/src/test/resources/**/*.xml
[INFO] Exclude: **/src/test/resources/**/*.iso
[INFO] Exclude: **/LICENSE.txt
[INFO] Exclude: **/header.txt
[INFO] Exclude: **/NOTICE.txt
[INFO] Exclude: **/DISCLAIMER
[INFO] Exclude: **/BUILD.txt
[INFO] Exclude: **/CHANGES.txt
[INFO] Exclude: **/README.md
[INFO] Exclude: **/README.txt
[INFO] Exclude: **/DEPENDENCIES
[INFO] Exclude: **/CONTRIBUTING.md
[INFO] Exclude: **/*json
[INFO] Exclude: **/*readme
[INFO] Exclude: **/*ProviderMetadata
[INFO] Exclude: **/*ApiMetadata
[INFO] Exclude: **/*LoggingModule
[INFO] Exclude: **/*ViewMBeanFactory
[INFO] Exclude: **/target/**
[INFO] Exclude: **/test-output/**
[INFO] Exclude: **/bin/**
[INFO] Exclude: **/.settings/**
[INFO] Exclude: **/.classpath
[INFO] Exclude: **/.dir-locals.el
[INFO] Exclude: **/.project
[INFO] Exclude: **/.idea/**
[INFO] Exclude: **/*.iml
[INFO] Exclude: **/*.eml
[INFO] Exclude: **/*.ipr
[INFO] Exclude: **/*.iws
[INFO] Exclude: **/*.DS_STORE
[INFO] Exclude: **/TAGS
[INFO] Exclude: **/.metadata/**
[INFO] Exclude: **/atlassian-ide-plugin.xml
[INFO] Exclude: **/.DS_Store
[INFO] Exclude: .mailmap
[INFO] Exclude: .git/**
[INFO] Exclude: **/.gitignore
[INFO] Exclude: **/.gitattributes
[INFO] Exclude: .repository/**
[INFO] Exclude: gc.log
[INFO] 52 resources included (use -debug for more details)
Warning:  org.apache.xerces.jaxp.SAXParserImpl$JAXPSAXParser: Property 'http://www.oracle.com/xml/jaxp/properties/entityExpansionLimit'
is not recognized.
Compiler warnings:
  WARNING:  'org.apache.xerces.jaxp.SAXParserImpl: Property 'http://javax.xml.XMLConstants/property/accessExternalDTD'
is not recognized.'
Warning:  org.apache.xerces.parsers.SAXParser: Feature 'http://javax.xml.XMLConstants/feature/secure-processing'
is not recognized.
Warning:  org.apache.xerces.parsers.SAXParser: Property 'http://javax.xml.XMLConstants/property/accessExternalDTD'
is not recognized.
Warning:  org.apache.xerces.parsers.SAXParser: Property 'http://www.oracle.com/xml/jaxp/properties/entityExpansionLimit'
is not recognized.
[INFO] Rat check: Summary of files. Unapproved: 0 unknown: 0 generated: 0 approved: 52 licence.
[INFO] 
[INFO] --- maven-jar-plugin:2.4:test-jar (default) @ rds ---
[INFO] Building jar: <https://buildhive.cloudbees.com/job/jclouds/job/jclouds-labs-aws/ws/rds/target/rds-1.8.0-SNAPSHOT-tests.jar>
[INFO] 
[INFO] --- maven-surefire-plugin:2.17:test (integration) @ rds ---
[JENKINS] Recording test results[INFO] 
[INFO] --- maven-duplicate-finder-plugin:1.0.5:check (default) @ rds ---

[INFO] Checking compile classpath
[INFO] Checking runtime classpath
[INFO] Checking test classpath
[INFO]                                                                         
[INFO] ------------------------------------------------------------------------
[INFO] Building jclouds glacier api 1.8.0-SNAPSHOT
[INFO] ------------------------------------------------------------------------
[INFO] Downloading: https://repository.apache.org/content/repositories/snapshots/org/apache/jclouds/jclouds-blobstore/1.8.0-SNAPSHOT/maven-metadata.xml
[INFO] Downloading: https://oss.sonatype.org/content/repositories/snapshots/org/apache/jclouds/jclouds-blobstore/1.8.0-SNAPSHOT/maven-metadata.xml
[INFO] Downloading: http://repository.apache.org/snapshots/org/apache/jclouds/jclouds-blobstore/1.8.0-SNAPSHOT/maven-metadata.xml
[INFO] Downloaded: https://repository.apache.org/content/repositories/snapshots/org/apache/jclouds/jclouds-blobstore/1.8.0-SNAPSHOT/maven-metadata.xml
(2 KB at 2.2 KB/sec)
[INFO] Downloaded: http://repository.apache.org/snapshots/org/apache/jclouds/jclouds-blobstore/1.8.0-SNAPSHOT/maven-metadata.xml
(2 KB at 2.1 KB/sec)
[INFO] Downloading: https://repository.apache.org/content/repositories/snapshots/org/apache/jclouds/driver/jclouds-log4j/1.8.0-SNAPSHOT/maven-metadata.xml
[INFO] Downloading: https://oss.sonatype.org/content/repositories/snapshots/org/apache/jclouds/driver/jclouds-log4j/1.8.0-SNAPSHOT/maven-metadata.xml
[INFO] Downloading: http://repository.apache.org/snapshots/org/apache/jclouds/driver/jclouds-log4j/1.8.0-SNAPSHOT/maven-metadata.xml
[INFO] Downloaded: https://repository.apache.org/content/repositories/snapshots/org/apache/jclouds/driver/jclouds-log4j/1.8.0-SNAPSHOT/maven-metadata.xml
(2 KB at 5.0 KB/sec)
[INFO] Downloaded: http://repository.apache.org/snapshots/org/apache/jclouds/driver/jclouds-log4j/1.8.0-SNAPSHOT/maven-metadata.xml
(2 KB at 4.2 KB/sec)
[INFO] 
[INFO] --- maven-clean-plugin:2.5:clean (default-clean) @ glacier ---
[INFO] 
[INFO] --- maven-enforcer-plugin:1.1.1:enforce (enforce-banned-dependencies) @ glacier ---
[INFO] 
[INFO] --- maven-enforcer-plugin:1.1.1:enforce (enforce-java) @ glacier ---
[INFO] 
[INFO] --- maven-remote-resources-plugin:1.5:process (default) @ glacier ---
[INFO] 
[INFO] --- maven-resources-plugin:2.6:resources (default-resources) @ glacier ---
[INFO] Using 'UTF-8' encoding to copy filtered resources.
[INFO] skip non existing resourceDirectory <https://buildhive.cloudbees.com/job/jclouds/job/jclouds-labs-aws/ws/glacier/src/main/clojure>
[INFO] Copying 1 resource
[INFO] Copying 3 resources
[INFO] 
[INFO] --- maven-compiler-plugin:3.1:compile (default-compile) @ glacier ---
[INFO] Changes detected - recompiling the module!
[INFO] Compiling 68 source files to <https://buildhive.cloudbees.com/job/jclouds/job/jclouds-labs-aws/ws/glacier/target/classes>
[WARNING] bootstrap class path not set in conjunction with -source 1.6
[WARNING] <https://buildhive.cloudbees.com/job/jclouds/job/jclouds-labs-aws/ws/glacier/src/main/java/org/jclouds/glacier/blobstore/strategy/internal/BaseSlicingStrategy.java>:[62,25]
redundant cast to long
[WARNING] <https://buildhive.cloudbees.com/job/jclouds/job/jclouds-labs-aws/ws/glacier/src/main/java/org/jclouds/glacier/GlacierApiMetadata.java>:
Some input files use or override a deprecated API.
[WARNING] <https://buildhive.cloudbees.com/job/jclouds/job/jclouds-labs-aws/ws/glacier/src/main/java/org/jclouds/glacier/GlacierApiMetadata.java>:
Recompile with -Xlint:deprecation for details.
[WARNING] <https://buildhive.cloudbees.com/job/jclouds/job/jclouds-labs-aws/ws/glacier/src/main/java/org/jclouds/glacier/binders/BindPartSizeToHeaders.java>:
<https://buildhive.cloudbees.com/job/jclouds/job/jclouds-labs-aws/ws/glacier/src/main/java/org/jclouds/glacier/binders/BindPartSizeToHeaders.java>
uses unchecked or unsafe operations.
[WARNING] <https://buildhive.cloudbees.com/job/jclouds/job/jclouds-labs-aws/ws/glacier/src/main/java/org/jclouds/glacier/binders/BindPartSizeToHeaders.java>:
Recompile with -Xlint:unchecked for details.
[INFO] 
[INFO] --- maven-resources-plugin:2.6:testResources (default-testResources) @ glacier ---
[INFO] Using 'UTF-8' encoding to copy filtered resources.
[INFO] skip non existing resourceDirectory <https://buildhive.cloudbees.com/job/jclouds/job/jclouds-labs-aws/ws/glacier/src/test/clojure>
[INFO] Copying 11 resources
[INFO] Copying 3 resources
[INFO] 
[INFO] --- maven-compiler-plugin:3.1:testCompile (default-testCompile) @ glacier ---
[INFO] Changes detected - recompiling the module!
[INFO] Compiling 14 source files to <https://buildhive.cloudbees.com/job/jclouds/job/jclouds-labs-aws/ws/glacier/target/test-classes>
[INFO] -------------------------------------------------------------
[WARNING] COMPILATION WARNING : 
[INFO] -------------------------------------------------------------
[WARNING] bootstrap class path not set in conjunction with -source 1.6
[INFO] 1 warning
[INFO] -------------------------------------------------------------
[INFO] -------------------------------------------------------------
[ERROR] COMPILATION ERROR : 
[INFO] -------------------------------------------------------------
[ERROR] <https://buildhive.cloudbees.com/job/jclouds/job/jclouds-labs-aws/ws/glacier/src/test/java/org/jclouds/glacier/GlacierClientLongLiveTest.java>:[115,7]
no suitable constructor found for BasePollingStrategy(int,long,org.jclouds.glacier.GlacierClient)
    constructor org.jclouds.glacier.blobstore.strategy.internal.BasePollingStrategy.BasePollingStrategy(org.jclouds.glacier.GlacierClient)
is not applicable
      (actual and formal argument lists differ in length)
    constructor org.jclouds.glacier.blobstore.strategy.internal.BasePollingStrategy.BasePollingStrategy(org.jclouds.glacier.GlacierClient,long,long)
is not applicable
      (actual argument int cannot be converted to org.jclouds.glacier.GlacierClient by method
invocation conversion)
[INFO] 1 error
[INFO] -------------------------------------------------------------
[INFO] ------------------------------------------------------------------------
[INFO] Reactor Summary:
[INFO] 
[INFO] Apache jclouds labs aws ........................... SUCCESS [28.726s]
[INFO] jcloud elb api .................................... SUCCESS [1:29.350s]
[INFO] jcloud iam api .................................... SUCCESS [49.756s]
[INFO] jcloud rds api .................................... SUCCESS [47.523s]
[INFO] jclouds glacier api ............................... FAILURE [6.591s]
[INFO] jclouds Amazon Elastic Load Balancer provider ..... SKIPPED
[INFO] jclouds Amazon Identity and Access Management (IAM) provider  SKIPPED
[INFO] jclouds Amazon Relational Database Service provider  SKIPPED
[INFO] ------------------------------------------------------------------------
[INFO] BUILD FAILURE
[INFO] ------------------------------------------------------------------------
[INFO] Total time: 3:53.807s
[INFO] Finished at: Sun Aug 03 11:39:15 UTC 2014
[INFO] Final Memory: 42M/102M
[INFO] ------------------------------------------------------------------------
Waiting for Jenkins to finish collecting data
[ERROR] Failed to execute goal org.apache.maven.plugins:maven-compiler-plugin:3.1:testCompile
(default-testCompile) on project glacier: Compilation failure
[ERROR] <https://buildhive.cloudbees.com/job/jclouds/job/jclouds-labs-aws/ws/glacier/src/test/java/org/jclouds/glacier/GlacierClientLongLiveTest.java>:[115,7]
no suitable constructor found for BasePollingStrategy(int,long,org.jclouds.glacier.GlacierClient)
[ERROR] constructor org.jclouds.glacier.blobstore.strategy.internal.BasePollingStrategy.BasePollingStrategy(org.jclouds.glacier.GlacierClient)
is not applicable
[ERROR] (actual and formal argument lists differ in length)
[ERROR] constructor org.jclouds.glacier.blobstore.strategy.internal.BasePollingStrategy.BasePollingStrategy(org.jclouds.glacier.GlacierClient,long,long)
is not applicable
[ERROR] (actual argument int cannot be converted to org.jclouds.glacier.GlacierClient by method
invocation conversion)
[ERROR] -> [Help 1]
org.apache.maven.lifecycle.LifecycleExecutionException: Failed to execute goal org.apache.maven.plugins:maven-compiler-plugin:3.1:testCompile
(default-testCompile) on project glacier: Compilation failure
<https://buildhive.cloudbees.com/job/jclouds/job/jclouds-labs-aws/ws/glacier/src/test/java/org/jclouds/glacier/GlacierClientLongLiveTest.java>:[115,7]
no suitable constructor found for BasePollingStrategy(int,long,org.jclouds.glacier.GlacierClient)
    constructor org.jclouds.glacier.blobstore.strategy.internal.BasePollingStrategy.BasePollingStrategy(org.jclouds.glacier.GlacierClient)
is not applicable
      (actual and formal argument lists differ in length)
    constructor org.jclouds.glacier.blobstore.strategy.internal.BasePollingStrategy.BasePollingStrategy(org.jclouds.glacier.GlacierClient,long,long)
is not applicable
      (actual argument int cannot be converted to org.jclouds.glacier.GlacierClient by method
invocation conversion)

	at org.apache.maven.lifecycle.internal.MojoExecutor.execute(MojoExecutor.java:212)
	at org.apache.maven.lifecycle.internal.MojoExecutor.execute(MojoExecutor.java:153)
	at org.apache.maven.lifecycle.internal.MojoExecutor.execute(MojoExecutor.java:145)
	at org.apache.maven.lifecycle.internal.LifecycleModuleBuilder.buildProject(LifecycleModuleBuilder.java:84)
	at org.apache.maven.lifecycle.internal.LifecycleModuleBuilder.buildProject(LifecycleModuleBuilder.java:59)
	at org.apache.maven.lifecycle.internal.LifecycleStarter.singleThreadedBuild(LifecycleStarter.java:183)
	at org.apache.maven.lifecycle.internal.LifecycleStarter.execute(LifecycleStarter.java:161)
	at org.apache.maven.DefaultMaven.doExecute(DefaultMaven.java:317)
	at org.apache.maven.DefaultMaven.execute(DefaultMaven.java:152)
	at org.jvnet.hudson.maven3.launcher.Maven31Launcher.main(Maven31Launcher.java:132)
	at sun.reflect.NativeMethodAccessorImpl.invoke0(Native Method)
	at sun.reflect.NativeMethodAccessorImpl.invoke(NativeMethodAccessorImpl.java:57)
	at sun.reflect.DelegatingMethodAccessorImpl.invoke(DelegatingMethodAccessorImpl.java:43)
	at java.lang.reflect.Method.invoke(Method.java:606)
	at org.codehaus.plexus.classworlds.launcher.Launcher.launchStandard(Launcher.java:330)
	at org.codehaus.plexus.classworlds.launcher.Launcher.launch(Launcher.java:238)
	at jenkins.maven3.agent.Maven31Main.launch(Maven31Main.java:181)
	at sun.reflect.NativeMethodAccessorImpl.invoke0(Native Method)
	at sun.reflect.NativeMethodAccessorImpl.invoke(NativeMethodAccessorImpl.java:57)
	at sun.reflect.DelegatingMethodAccessorImpl.invoke(DelegatingMethodAccessorImpl.java:43)
	at java.lang.reflect.Method.invoke(Method.java:606)
	at hudson.maven.Maven3Builder.call(Maven3Builder.java:134)
	at hudson.maven.Maven3Builder.call(Maven3Builder.java:69)
	at hudson.remoting.UserRequest.perform(UserRequest.java:118)
	at hudson.remoting.UserRequest.perform(UserRequest.java:48)
	at hudson.remoting.Request$2.run(Request.java:328)
	at hudson.remoting.InterceptingExecutorService$1.call(InterceptingExecutorService.java:72)
	at java.util.concurrent.FutureTask.run(FutureTask.java:262)
	at java.util.concurrent.ThreadPoolExecutor.runWorker(ThreadPoolExecutor.java:1145)
	at java.util.concurrent.ThreadPoolExecutor$Worker.run(ThreadPoolExecutor.java:615)
	at java.lang.Thread.run(Thread.java:744)
Caused by: org.apache.maven.plugin.compiler.CompilationFailureException: Compilation failure
<https://buildhive.cloudbees.com/job/jclouds/job/jclouds-labs-aws/ws/glacier/src/test/java/org/jclouds/glacier/GlacierClientLongLiveTest.java>:[115,7]
no suitable constructor found for BasePollingStrategy(int,long,org.jclouds.glacier.GlacierClient)
    constructor org.jclouds.glacier.blobstore.strategy.internal.BasePollingStrategy.BasePollingStrategy(org.jclouds.glacier.GlacierClient)
is not applicable
      (actual and formal argument lists differ in length)
    constructor org.jclouds.glacier.blobstore.strategy.internal.BasePollingStrategy.BasePollingStrategy(org.jclouds.glacier.GlacierClient,long,long)
is not applicable
      (actual argument int cannot be converted to org.jclouds.glacier.GlacierClient by method
invocation conversion)

	at org.apache.maven.plugin.compiler.AbstractCompilerMojo.execute(AbstractCompilerMojo.java:858)
	at org.apache.maven.plugin.compiler.TestCompilerMojo.execute(TestCompilerMojo.java:152)
	at org.apache.maven.plugin.DefaultBuildPluginManager.executeMojo(DefaultBuildPluginManager.java:106)
	at org.apache.maven.lifecycle.internal.MojoExecutor.execute(MojoExecutor.java:208)
	... 30 more
[ERROR] 
[ERROR] Re-run Maven using the -X switch to enable full debug logging.
[ERROR] 
[ERROR] For more information about the errors and possible solutions, please read the following
articles:
[ERROR] [Help 1] http://cwiki.apache.org/confluence/display/MAVEN/MojoFailureException
[JENKINS] Archiving <https://buildhive.cloudbees.com/job/jclouds/job/jclouds-labs-aws/ws/aws-elb/pom.xml>
to org.apache.jclouds.labs/aws-elb/1.8.0-SNAPSHOT/aws-elb-1.8.0-SNAPSHOT.pom
[ERROR] 
[ERROR] After correcting the problems, you can resume the build with the command
[ERROR]   mvn <goals> -rf :glacier
[JENKINS] Archiving <https://buildhive.cloudbees.com/job/jclouds/job/jclouds-labs-aws/ws/glacier/pom.xml>
to org.apache.jclouds.labs/glacier/1.8.0-SNAPSHOT/glacier-1.8.0-SNAPSHOT.pom
[JENKINS] Archiving <https://buildhive.cloudbees.com/job/jclouds/job/jclouds-labs-aws/ws/aws-iam/pom.xml>
to org.apache.jclouds.labs/aws-iam/1.8.0-SNAPSHOT/aws-iam-1.8.0-SNAPSHOT.pom
[JENKINS] Archiving <https://buildhive.cloudbees.com/job/jclouds/job/jclouds-labs-aws/ws/pom.xml>
to org.apache.jclouds.labs/jclouds-labs-aws/1.8.0-SNAPSHOT/jclouds-labs-aws-1.8.0-SNAPSHOT.pom
[JENKINS] Archiving <https://buildhive.cloudbees.com/job/jclouds/job/jclouds-labs-aws/ws/target/jclouds-labs-aws-1.8.0-SNAPSHOT-tests.jar>
to org.apache.jclouds.labs/jclouds-labs-aws/1.8.0-SNAPSHOT/jclouds-labs-aws-1.8.0-SNAPSHOT-tests.jar
[JENKINS] Archiving <https://buildhive.cloudbees.com/job/jclouds/job/jclouds-labs-aws/ws/rds/pom.xml>
to org.apache.jclouds.labs/rds/1.8.0-SNAPSHOT/rds-1.8.0-SNAPSHOT.pom
[JENKINS] Archiving <https://buildhive.cloudbees.com/job/jclouds/job/jclouds-labs-aws/ws/rds/target/rds-1.8.0-SNAPSHOT.jar>
to org.apache.jclouds.labs/rds/1.8.0-SNAPSHOT/rds-1.8.0-SNAPSHOT.jar
[JENKINS] Archiving <https://buildhive.cloudbees.com/job/jclouds/job/jclouds-labs-aws/ws/rds/target/rds-1.8.0-SNAPSHOT-tests.jar>
to org.apache.jclouds.labs/rds/1.8.0-SNAPSHOT/rds-1.8.0-SNAPSHOT-tests.jar
[JENKINS] Archiving <https://buildhive.cloudbees.com/job/jclouds/job/jclouds-labs-aws/ws/elb/pom.xml>
to org.apache.jclouds.labs/elb/1.8.0-SNAPSHOT/elb-1.8.0-SNAPSHOT.pom
[JENKINS] Archiving <https://buildhive.cloudbees.com/job/jclouds/job/jclouds-labs-aws/ws/elb/target/elb-1.8.0-SNAPSHOT.jar>
to org.apache.jclouds.labs/elb/1.8.0-SNAPSHOT/elb-1.8.0-SNAPSHOT.jar
[JENKINS] Archiving <https://buildhive.cloudbees.com/job/jclouds/job/jclouds-labs-aws/ws/elb/target/elb-1.8.0-SNAPSHOT-tests.jar>
to org.apache.jclouds.labs/elb/1.8.0-SNAPSHOT/elb-1.8.0-SNAPSHOT-tests.jar
[JENKINS] Archiving <https://buildhive.cloudbees.com/job/jclouds/job/jclouds-labs-aws/ws/iam/pom.xml>
to org.apache.jclouds.labs/iam/1.8.0-SNAPSHOT/iam-1.8.0-SNAPSHOT.pom
[JENKINS] Archiving <https://buildhive.cloudbees.com/job/jclouds/job/jclouds-labs-aws/ws/iam/target/iam-1.8.0-SNAPSHOT.jar>
to org.apache.jclouds.labs/iam/1.8.0-SNAPSHOT/iam-1.8.0-SNAPSHOT.jar
[JENKINS] Archiving <https://buildhive.cloudbees.com/job/jclouds/job/jclouds-labs-aws/ws/iam/target/iam-1.8.0-SNAPSHOT-tests.jar>
to org.apache.jclouds.labs/iam/1.8.0-SNAPSHOT/iam-1.8.0-SNAPSHOT-tests.jar
[JENKINS] Archiving <https://buildhive.cloudbees.com/job/jclouds/job/jclouds-labs-aws/ws/aws-rds/pom.xml>
to org.apache.jclouds.labs/aws-rds/1.8.0-SNAPSHOT/aws-rds-1.8.0-SNAPSHOT.pom
channel stopped

Mime
View raw message