jclouds-notifications mailing list archives

Site index · List index
Message view « Date » · « Thread »
Top « Date » · « Thread »
From BuildHive <buildhive-git...@cloudbees.com>
Subject Build failed in Jenkins: jclouds » jclouds-chef #1241
Date Tue, 05 Aug 2014 08:47:31 GMT
See <https://buildhive.cloudbees.com/job/jclouds/job/jclouds-chef/1241/changes>

Changes:

[Andrew Phillips] Up to 2.0.0-SNAPSHOT after the 1.8.0 release

------------------------------------------
Started by GitHub push by jclouds-mirror
Building remotely on s-3949919a in workspace <https://buildhive.cloudbees.com/job/jclouds/job/jclouds-chef/ws/>
Fetching changes from the remote Git repository
Fetching upstream changes from git://github.com/jclouds/jclouds-chef.git
Checking out Revision 82b23fcb0ab2087c6cc2fc25374d6fec1aa70bba (origin/master)
Cleaning workspace
Resetting working tree
Parsing POMs
ERROR: Failed to parse POMs
hudson.util.IOException2: remote file operation failed: <https://buildhive.cloudbees.com/job/jclouds/job/jclouds-chef/ws/>
at hudson.remoting.Channel@1112bbe8:s-3949919a
	at hudson.FilePath.act(FilePath.java:907)
	at hudson.FilePath.act(FilePath.java:884)
	at hudson.maven.MavenModuleSetBuild$MavenModuleSetBuildExecution.parsePoms(MavenModuleSetBuild.java:933)
	at hudson.maven.MavenModuleSetBuild$MavenModuleSetBuildExecution.doRun(MavenModuleSetBuild.java:661)
	at hudson.model.AbstractBuild$AbstractBuildExecution.run(AbstractBuild.java:566)
	at hudson.model.Run.execute(Run.java:1665)
	at hudson.maven.MavenModuleSetBuild.run(MavenModuleSetBuild.java:509)
	at hudson.model.ResourceController.execute(ResourceController.java:88)
	at hudson.model.Executor.run(Executor.java:246)
Caused by: hudson.remoting.ProxyException: hudson.maven.MavenModuleSetBuild$MavenExecutionException:
org.apache.maven.project.ProjectBuildingException: Some problems were encountered while processing
the POMs:
[FATAL] Non-resolvable parent POM: Could not find artifact org.apache.jclouds.chef:chef-project:pom:1.8.0-SNAPSHOT
and 'parent.relativePath' points at wrong local POM @ line 22, column 11

	at hudson.maven.MavenModuleSetBuild$PomParser.invoke(MavenModuleSetBuild.java:1337)
	at hudson.maven.MavenModuleSetBuild$PomParser.invoke(MavenModuleSetBuild.java:1071)
	at hudson.FilePath$FileCallableWrapper.call(FilePath.java:2439)
	at hudson.remoting.UserRequest.perform(UserRequest.java:118)
	at hudson.remoting.UserRequest.perform(UserRequest.java:48)
	at hudson.remoting.Request$2.run(Request.java:328)
	at hudson.remoting.InterceptingExecutorService$1.call(InterceptingExecutorService.java:72)
	at java.util.concurrent.FutureTask.run(FutureTask.java:262)
	at java.util.concurrent.ThreadPoolExecutor.runWorker(ThreadPoolExecutor.java:1145)
	at java.util.concurrent.ThreadPoolExecutor$Worker.run(ThreadPoolExecutor.java:615)
	at java.lang.Thread.run(Thread.java:744)
Caused by: hudson.remoting.ProxyException: org.apache.maven.project.ProjectBuildingException:
Some problems were encountered while processing the POMs:
[FATAL] Non-resolvable parent POM: Could not find artifact org.apache.jclouds.chef:chef-project:pom:1.8.0-SNAPSHOT
and 'parent.relativePath' points at wrong local POM @ line 22, column 11

	at org.apache.maven.project.DefaultProjectBuilder.build(DefaultProjectBuilder.java:364)
	at hudson.maven.MavenEmbedder.buildProjects(MavenEmbedder.java:361)
	at hudson.maven.MavenEmbedder.readProjects(MavenEmbedder.java:331)
	at hudson.maven.MavenModuleSetBuild$PomParser.invoke(MavenModuleSetBuild.java:1274)
	... 10 more

Mime
View raw message