jclouds-notifications mailing list archives

Site index · List index
Message view « Date » · « Thread »
Top « Date » · « Thread »
From jenkins-no-re...@cloudbees.com
Subject Build failed in Jenkins: jclouds-labs-aws #172
Date Tue, 05 Aug 2014 09:33:20 GMT
See <https://jclouds.ci.cloudbees.com/job/jclouds-labs-aws/172/changes>

Changes:

[Andrew Phillips] Updating project and jclouds.version to 2.0.0-SNAPSHOT

------------------------------------------
[...truncated 364 lines...]
[ERROR] central (http://repo.cloudbees.com/content/repositories/central, releases=true, snapshots=false),
[ERROR] cloudbees-private-snapshot-repository (https://repository-jclouds.forge.cloudbees.com/snapshot,
releases=false, snapshots=true),
[ERROR] cloudbees-private-release-repository (https://repository-jclouds.forge.cloudbees.com/release,
releases=true, snapshots=false),
[ERROR] apache-snapshots (https://repository.apache.org/content/repositories/snapshots, releases=false,
snapshots=true),
[ERROR] sonatype-nexus-snapshots (https://oss.sonatype.org/content/repositories/snapshots,
releases=false, snapshots=true),
[ERROR] apache.snapshots (http://repository.apache.org/snapshots, releases=false, snapshots=true)
[ERROR] -> [Help 1]
org.apache.maven.lifecycle.LifecycleExecutionException: Failed to execute goal org.apache.maven.plugins:maven-javadoc-plugin:2.9:aggregate-jar
(javadoc) on project jclouds-labs-aws: MavenReportException: Error while creating archive:
Missing:
----------
1) org.apache.jclouds.labs:elb:jar:2.0.0-SNAPSHOT

  Try downloading the file manually from the project website.

  Then, install it using the command: 
      mvn install:install-file -DgroupId=org.apache.jclouds.labs -DartifactId=elb -Dversion=2.0.0-SNAPSHOT
-Dpackaging=jar -Dfile=/path/to/file

  Alternatively, if you host your own repository you can deploy the file there: 
      mvn deploy:deploy-file -DgroupId=org.apache.jclouds.labs -DartifactId=elb -Dversion=2.0.0-SNAPSHOT
-Dpackaging=jar -Dfile=/path/to/file -Durl=[url] -DrepositoryId=[id]

  Path to dependency: 
  	1) org.apache.jclouds.labs:aws-elb:bundle:2.0.0-SNAPSHOT
  	2) org.apache.jclouds.labs:elb:jar:2.0.0-SNAPSHOT

2) org.apache.jclouds.labs:elb:test-jar:tests:2.0.0-SNAPSHOT

  Try downloading the file manually from the project website.

  Then, install it using the command: 
      mvn install:install-file -DgroupId=org.apache.jclouds.labs -DartifactId=elb -Dversion=2.0.0-SNAPSHOT
-Dclassifier=tests -Dpackaging=test-jar -Dfile=/path/to/file

  Alternatively, if you host your own repository you can deploy the file there: 
      mvn deploy:deploy-file -DgroupId=org.apache.jclouds.labs -DartifactId=elb -Dversion=2.0.0-SNAPSHOT
-Dclassifier=tests -Dpackaging=test-jar -Dfile=/path/to/file -Durl=[url] -DrepositoryId=[id]

  Path to dependency: 
  	1) org.apache.jclouds.labs:aws-elb:bundle:2.0.0-SNAPSHOT
  	2) org.apache.jclouds.labs:elb:test-jar:tests:2.0.0-SNAPSHOT

----------
2 required artifacts are missing.

for artifact: 
  org.apache.jclouds.labs:aws-elb:bundle:2.0.0-SNAPSHOT

from the specified remote repositories:
  central (http://repo.cloudbees.com/content/repositories/central, releases=true, snapshots=false),
  cloudbees-private-snapshot-repository (https://repository-jclouds.forge.cloudbees.com/snapshot,
releases=false, snapshots=true),
  cloudbees-private-release-repository (https://repository-jclouds.forge.cloudbees.com/release,
releases=true, snapshots=false),
  apache-snapshots (https://repository.apache.org/content/repositories/snapshots, releases=false,
snapshots=true),
  sonatype-nexus-snapshots (https://oss.sonatype.org/content/repositories/snapshots, releases=false,
snapshots=true),
  apache.snapshots (http://repository.apache.org/snapshots, releases=false, snapshots=true)

	at org.apache.maven.lifecycle.internal.MojoExecutor.execute(MojoExecutor.java:217)
	at org.apache.maven.lifecycle.internal.MojoExecutor.execute(MojoExecutor.java:153)
	at org.apache.maven.lifecycle.internal.MojoExecutor.execute(MojoExecutor.java:145)
	at org.apache.maven.lifecycle.internal.LifecycleModuleBuilder.buildProject(LifecycleModuleBuilder.java:84)
	at org.apache.maven.lifecycle.internal.LifecycleModuleBuilder.buildProject(LifecycleModuleBuilder.java:59)
	at org.apache.maven.lifecycle.internal.LifecycleStarter.singleThreadedBuild(LifecycleStarter.java:183)
	at org.apache.maven.lifecycle.internal.LifecycleStarter.execute(LifecycleStarter.java:161)
	at org.apache.maven.DefaultMaven.doExecute(DefaultMaven.java:319)
	at org.apache.maven.DefaultMaven.execute(DefaultMaven.java:156)
	at org.jvnet.hudson.maven3.launcher.Maven3Launcher.main(Maven3Launcher.java:117)
	at sun.reflect.NativeMethodAccessorImpl.invoke0(Native Method)
	at sun.reflect.NativeMethodAccessorImpl.invoke(NativeMethodAccessorImpl.java:39)
	at sun.reflect.DelegatingMethodAccessorImpl.invoke(DelegatingMethodAccessorImpl.java:25)
	at java.lang.reflect.Method.invoke(Method.java:597)
	at org.codehaus.plexus.classworlds.launcher.Launcher.launchStandard(Launcher.java:329)
	at org.codehaus.plexus.classworlds.launcher.Launcher.launch(Launcher.java:239)
	at org.jvnet.hudson.maven3.agent.Maven3Main.launch(Maven3Main.java:178)
	at sun.reflect.NativeMethodAccessorImpl.invoke0(Native Method)
	at sun.reflect.NativeMethodAccessorImpl.invoke(NativeMethodAccessorImpl.java:39)
	at sun.reflect.DelegatingMethodAccessorImpl.invoke(DelegatingMethodAccessorImpl.java:25)
	at java.lang.reflect.Method.invoke(Method.java:597)
	at hudson.maven.Maven3Builder.call(Maven3Builder.java:134)
	at hudson.maven.Maven3Builder.call(Maven3Builder.java:69)
	at hudson.remoting.UserRequest.perform(UserRequest.java:118)
	at hudson.remoting.UserRequest.perform(UserRequest.java:48)
	at hudson.remoting.Request$2.run(Request.java:328)
	at hudson.remoting.InterceptingExecutorService$1.call(InterceptingExecutorService.java:72)
	at java.util.concurrent.FutureTask$Sync.innerRun(FutureTask.java:303)
	at java.util.concurrent.FutureTask.run(FutureTask.java:138)
	at java.util.concurrent.ThreadPoolExecutor$Worker.runTask(ThreadPoolExecutor.java:895)
	at java.util.concurrent.ThreadPoolExecutor$Worker.run(ThreadPoolExecutor.java:918)
	at java.lang.Thread.run(Thread.java:662)
Caused by: org.apache.maven.plugin.MojoExecutionException: MavenReportException: Error while
creating archive: Missing:
----------
1) org.apache.jclouds.labs:elb:jar:2.0.0-SNAPSHOT

  Try downloading the file manually from the project website.

  Then, install it using the command: 
      mvn install:install-file -DgroupId=org.apache.jclouds.labs -DartifactId=elb -Dversion=2.0.0-SNAPSHOT
-Dpackaging=jar -Dfile=/path/to/file

  Alternatively, if you host your own repository you can deploy the file there: 
      mvn deploy:deploy-file -DgroupId=org.apache.jclouds.labs -DartifactId=elb -Dversion=2.0.0-SNAPSHOT
-Dpackaging=jar -Dfile=/path/to/file -Durl=[url] -DrepositoryId=[id]

  Path to dependency: 
  	1) org.apache.jclouds.labs:aws-elb:bundle:2.0.0-SNAPSHOT
  	2) org.apache.jclouds.labs:elb:jar:2.0.0-SNAPSHOT

2) org.apache.jclouds.labs:elb:test-jar:tests:2.0.0-SNAPSHOT

  Try downloading the file manually from the project website.

  Then, install it using the command: 
      mvn install:install-file -DgroupId=org.apache.jclouds.labs -DartifactId=elb -Dversion=2.0.0-SNAPSHOT
-Dclassifier=tests -Dpackaging=test-jar -Dfile=/path/to/file

  Alternatively, if you host your own repository you can deploy the file there: 
      mvn deploy:deploy-file -DgroupId=org.apache.jclouds.labs -DartifactId=elb -Dversion=2.0.0-SNAPSHOT
-Dclassifier=tests -Dpackaging=test-jar -Dfile=/path/to/file -Durl=[url] -DrepositoryId=[id]

  Path to dependency: 
  	1) org.apache.jclouds.labs:aws-elb:bundle:2.0.0-SNAPSHOT
  	2) org.apache.jclouds.labs:elb:test-jar:tests:2.0.0-SNAPSHOT

----------
2 required artifacts are missing.

for artifact: 
  org.apache.jclouds.labs:aws-elb:bundle:2.0.0-SNAPSHOT

from the specified remote repositories:
  central (http://repo.cloudbees.com/content/repositories/central, releases=true, snapshots=false),
  cloudbees-private-snapshot-repository (https://repository-jclouds.forge.cloudbees.com/snapshot,
releases=false, snapshots=true),
  cloudbees-private-release-repository (https://repository-jclouds.forge.cloudbees.com/release,
releases=true, snapshots=false),
  apache-snapshots (https://repository.apache.org/content/repositories/snapshots, releases=false,
snapshots=true),
  sonatype-nexus-snapshots (https://oss.sonatype.org/content/repositories/snapshots, releases=false,
snapshots=true),
  apache.snapshots (http://repository.apache.org/snapshots, releases=false, snapshots=true)

	at org.apache.maven.plugin.javadoc.AbstractJavadocMojo.failOnError(AbstractJavadocMojo.java:5826)
	at org.apache.maven.plugin.javadoc.JavadocJar.execute(JavadocJar.java:209)
	at org.apache.maven.plugin.DefaultBuildPluginManager.executeMojo(DefaultBuildPluginManager.java:101)
	at org.apache.maven.lifecycle.internal.MojoExecutor.execute(MojoExecutor.java:209)
	... 31 more
Caused by: org.apache.maven.reporting.MavenReportException: Missing:
----------
1) org.apache.jclouds.labs:elb:jar:2.0.0-SNAPSHOT

  Try downloading the file manually from the project website.

  Then, install it using the command: 
      mvn install:install-file -DgroupId=org.apache.jclouds.labs -DartifactId=elb -Dversion=2.0.0-SNAPSHOT
-Dpackaging=jar -Dfile=/path/to/file

  Alternatively, if you host your own repository you can deploy the file there: 
      mvn deploy:deploy-file -DgroupId=org.apache.jclouds.labs -DartifactId=elb -Dversion=2.0.0-SNAPSHOT
-Dpackaging=jar -Dfile=/path/to/file -Durl=[url] -DrepositoryId=[id]

  Path to dependency: 
  	1) org.apache.jclouds.labs:aws-elb:bundle:2.0.0-SNAPSHOT
  	2) org.apache.jclouds.labs:elb:jar:2.0.0-SNAPSHOT

2) org.apache.jclouds.labs:elb:test-jar:tests:2.0.0-SNAPSHOT

  Try downloading the file manually from the project website.

  Then, install it using the command: 
      mvn install:install-file -DgroupId=org.apache.jclouds.labs -DartifactId=elb -Dversion=2.0.0-SNAPSHOT
-Dclassifier=tests -Dpackaging=test-jar -Dfile=/path/to/file

  Alternatively, if you host your own repository you can deploy the file there: 
      mvn deploy:deploy-file -DgroupId=org.apache.jclouds.labs -DartifactId=elb -Dversion=2.0.0-SNAPSHOT
-Dclassifier=tests -Dpackaging=test-jar -Dfile=/path/to/file -Durl=[url] -DrepositoryId=[id]

  Path to dependency: 
  	1) org.apache.jclouds.labs:aws-elb:bundle:2.0.0-SNAPSHOT
  	2) org.apache.jclouds.labs:elb:test-jar:tests:2.0.0-SNAPSHOT

----------
2 required artifacts are missing.

for artifact: 
  org.apache.jclouds.labs:aws-elb:bundle:2.0.0-SNAPSHOT

from the specified remote repositories:
  central (http://repo.cloudbees.com/content/repositories/central, releases=true, snapshots=false),
  cloudbees-private-snapshot-repository (https://repository-jclouds.forge.cloudbees.com/snapshot,
releases=false, snapshots=true),
  cloudbees-private-release-repository (https://repository-jclouds.forge.cloudbees.com/release,
releases=true, snapshots=false),
  apache-snapshots (https://repository.apache.org/content/repositories/snapshots, releases=false,
snapshots=true),
  sonatype-nexus-snapshots (https://oss.sonatype.org/content/repositories/snapshots, releases=false,
snapshots=true),
  apache.snapshots (http://repository.apache.org/snapshots, releases=false, snapshots=true)

	at org.apache.maven.plugin.javadoc.AbstractJavadocMojo.getClasspath(AbstractJavadocMojo.java:2438)
	at org.apache.maven.plugin.javadoc.AbstractJavadocMojo.addJavadocOptions(AbstractJavadocMojo.java:4536)
	at org.apache.maven.plugin.javadoc.AbstractJavadocMojo.executeReport(AbstractJavadocMojo.java:1937)
	at org.apache.maven.plugin.javadoc.JavadocJar.execute(JavadocJar.java:181)
	... 33 more
Caused by: org.apache.maven.artifact.resolver.MultipleArtifactsNotFoundException: Missing:
----------
1) org.apache.jclouds.labs:elb:jar:2.0.0-SNAPSHOT

  Try downloading the file manually from the project website.

  Then, install it using the command: 
      mvn install:install-file -DgroupId=org.apache.jclouds.labs -DartifactId=elb -Dversion=2.0.0-SNAPSHOT
-Dpackaging=jar -Dfile=/path/to/file

  Alternatively, if you host your own repository you can deploy the file there: 
      mvn deploy:deploy-file -DgroupId=org.apache.jclouds.labs -DartifactId=elb -Dversion=2.0.0-SNAPSHOT
-Dpackaging=jar -Dfile=/path/to/file -Durl=[url] -DrepositoryId=[id]

  Path to dependency: 
  	1) org.apache.jclouds.labs:aws-elb:bundle:2.0.0-SNAPSHOT
  	2) org.apache.jclouds.labs:elb:jar:2.0.0-SNAPSHOT

2) org.apache.jclouds.labs:elb:test-jar:tests:2.0.0-SNAPSHOT

  Try downloading the file manually from the project website.

  Then, install it using the command: 
      mvn install:install-file -DgroupId=org.apache.jclouds.labs -DartifactId=elb -Dversion=2.0.0-SNAPSHOT
-Dclassifier=tests -Dpackaging=test-jar -Dfile=/path/to/file

  Alternatively, if you host your own repository you can deploy the file there: 
      mvn deploy:deploy-file -DgroupId=org.apache.jclouds.labs -DartifactId=elb -Dversion=2.0.0-SNAPSHOT
-Dclassifier=tests -Dpackaging=test-jar -Dfile=/path/to/file -Durl=[url] -DrepositoryId=[id]

  Path to dependency: 
  	1) org.apache.jclouds.labs:aws-elb:bundle:2.0.0-SNAPSHOT
  	2) org.apache.jclouds.labs:elb:test-jar:tests:2.0.0-SNAPSHOT

----------
2 required artifacts are missing.

for artifact: 
  org.apache.jclouds.labs:aws-elb:bundle:2.0.0-SNAPSHOT

from the specified remote repositories:
  central (http://repo.cloudbees.com/content/repositories/central, releases=true, snapshots=false),
  cloudbees-private-snapshot-repository (https://repository-jclouds.forge.cloudbees.com/snapshot,
releases=false, snapshots=true),
  cloudbees-private-release-repository (https://repository-jclouds.forge.cloudbees.com/release,
releases=true, snapshots=false),
  apache-snapshots (https://repository.apache.org/content/repositories/snapshots, releases=false,
snapshots=true),
  sonatype-nexus-snapshots (https://oss.sonatype.org/content/repositories/snapshots, releases=false,
snapshots=true),
  apache.snapshots (http://repository.apache.org/snapshots, releases=false, snapshots=true)

	at org.apache.maven.artifact.resolver.DefaultResolutionErrorHandler.throwErrors(DefaultResolutionErrorHandler.java:71)
	at org.apache.maven.artifact.resolver.DefaultArtifactResolver.resolveWithExceptions(DefaultArtifactResolver.java:326)
	at org.apache.maven.artifact.resolver.DefaultArtifactResolver.resolveTransitively(DefaultArtifactResolver.java:314)
	at org.apache.maven.artifact.resolver.DefaultArtifactResolver.resolveTransitively(DefaultArtifactResolver.java:293)
	at org.apache.maven.artifact.resolver.DefaultArtifactResolver.resolveTransitively(DefaultArtifactResolver.java:271)
	at org.apache.maven.artifact.resolver.DefaultArtifactResolver.resolveTransitively(DefaultArtifactResolver.java:264)
	at org.apache.maven.plugin.javadoc.AbstractJavadocMojo.getClasspath(AbstractJavadocMojo.java:2423)
	... 36 more
[ERROR] 
[ERROR] Re-run Maven using the -X switch to enable full debug logging.
[ERROR] 
[ERROR] For more information about the errors and possible solutions, please read the following
articles:
[ERROR] [Help 1] http://cwiki.apache.org/confluence/display/MAVEN/MojoExecutionException
[JENKINS] Archiving <https://jclouds.ci.cloudbees.com/job/jclouds-labs-aws/ws/aws-elb/pom.xml>
to org.apache.jclouds.labs/aws-elb/2.0.0-SNAPSHOT/aws-elb-2.0.0-SNAPSHOT.pom
[JENKINS] Archiving <https://jclouds.ci.cloudbees.com/job/jclouds-labs-aws/ws/glacier/pom.xml>
to org.apache.jclouds.labs/glacier/2.0.0-SNAPSHOT/glacier-2.0.0-SNAPSHOT.pom
[JENKINS] Archiving <https://jclouds.ci.cloudbees.com/job/jclouds-labs-aws/ws/aws-iam/pom.xml>
to org.apache.jclouds.labs/aws-iam/2.0.0-SNAPSHOT/aws-iam-2.0.0-SNAPSHOT.pom
[JENKINS] Archiving <https://jclouds.ci.cloudbees.com/job/jclouds-labs-aws/ws/pom.xml>
to org.apache.jclouds.labs/jclouds-labs-aws/2.0.0-SNAPSHOT/jclouds-labs-aws-2.0.0-SNAPSHOT.pom
[JENKINS] Archiving <https://jclouds.ci.cloudbees.com/job/jclouds-labs-aws/ws/target/jclouds-labs-aws-2.0.0-SNAPSHOT-tests.jar>
to org.apache.jclouds.labs/jclouds-labs-aws/2.0.0-SNAPSHOT/jclouds-labs-aws-2.0.0-SNAPSHOT-tests.jar
[JENKINS] Archiving <https://jclouds.ci.cloudbees.com/job/jclouds-labs-aws/ws/rds/pom.xml>
to org.apache.jclouds.labs/rds/2.0.0-SNAPSHOT/rds-2.0.0-SNAPSHOT.pom
[JENKINS] Archiving <https://jclouds.ci.cloudbees.com/job/jclouds-labs-aws/ws/elb/pom.xml>
to org.apache.jclouds.labs/elb/2.0.0-SNAPSHOT/elb-2.0.0-SNAPSHOT.pom
[JENKINS] Archiving <https://jclouds.ci.cloudbees.com/job/jclouds-labs-aws/ws/iam/pom.xml>
to org.apache.jclouds.labs/iam/2.0.0-SNAPSHOT/iam-2.0.0-SNAPSHOT.pom
[JENKINS] Archiving <https://jclouds.ci.cloudbees.com/job/jclouds-labs-aws/ws/aws-rds/pom.xml>
to org.apache.jclouds.labs/aws-rds/2.0.0-SNAPSHOT/aws-rds-2.0.0-SNAPSHOT.pom
Sending e-mails to: notifications@jclouds.apache.org
channel stopped

Mime
View raw message