jclouds-notifications mailing list archives

Site index · List index
Message view « Date » · « Thread »
Top « Date » · « Thread »
From BuildHive <buildhive-git...@cloudbees.com>
Subject Build failed in Jenkins: jclouds » jclouds-labs-openstack #1506
Date Fri, 01 Aug 2014 18:46:30 GMT
See <https://buildhive.cloudbees.com/job/jclouds/job/jclouds-labs-openstack/1506/changes>

Changes:

[jeremy.daggett] Prefer Regions to Zones: Rackspace Autoscale

[jeremy.daggett] Prefer Regions to Zones: Rackspace Cloud Big Data

[jeremy.daggett] Prefer Regions to Zones: OpenStack Marconi

[jeremy.daggett] Additional region support in Auto Scale

[jeremy.daggett] Prefer Regions to Zones: Rackspace Cloud Queues

[jeremy.daggett] More zone reference cleanup

------------------------------------------
[...truncated 2880 lines...]
[INFO] Exclude: **/CONTRIBUTING.md
[INFO] Exclude: **/*json
[INFO] Exclude: **/*readme
[INFO] Exclude: **/test
[INFO] Exclude: **/test.pub
[INFO] Exclude: **/target/**
[INFO] Exclude: **/test-output/**
[INFO] Exclude: **/bin/**
[INFO] Exclude: **/.settings/**
[INFO] Exclude: **/.classpath
[INFO] Exclude: **/.dir-locals.el
[INFO] Exclude: **/.project
[INFO] Exclude: **/.idea/**
[INFO] Exclude: **/*.iml
[INFO] Exclude: **/*.eml
[INFO] Exclude: **/*.ipr
[INFO] Exclude: **/*.iws
[INFO] Exclude: **/*.DS_STORE
[INFO] Exclude: **/TAGS
[INFO] Exclude: **/.metadata/**
[INFO] Exclude: **/atlassian-ide-plugin.xml
[INFO] Exclude: **/.DS_Store
[INFO] Exclude: .mailmap
[INFO] Exclude: .git/**
[INFO] Exclude: **/.gitignore
[INFO] Exclude: **/.gitattributes
[INFO] Exclude: .repository/**
[INFO] Exclude: gc.log
[INFO] 5 resources included (use -debug for more details)
Warning:  org.apache.xerces.jaxp.SAXParserImpl$JAXPSAXParser: Property 'http://www.oracle.com/xml/jaxp/properties/entityExpansionLimit'
is not recognized.
Compiler warnings:
  WARNING:  'org.apache.xerces.jaxp.SAXParserImpl: Property 'http://javax.xml.XMLConstants/property/accessExternalDTD'
is not recognized.'
Warning:  org.apache.xerces.parsers.SAXParser: Feature 'http://javax.xml.XMLConstants/feature/secure-processing'
is not recognized.
Warning:  org.apache.xerces.parsers.SAXParser: Property 'http://javax.xml.XMLConstants/property/accessExternalDTD'
is not recognized.
Warning:  org.apache.xerces.parsers.SAXParser: Property 'http://www.oracle.com/xml/jaxp/properties/entityExpansionLimit'
is not recognized.
[INFO] Rat check: Summary of files. Unapproved: 0 unknown: 0 generated: 0 approved: 5 licence.
[INFO] 
[INFO] --- maven-jar-plugin:2.4:test-jar (default) @ rackspace-cloudqueues-uk ---
[INFO] Building jar: <https://buildhive.cloudbees.com/job/jclouds/job/jclouds-labs-openstack/ws/rackspace-cloudqueues-uk/target/rackspace-cloudqueues-uk-1.8.0-SNAPSHOT-tests.jar>
[INFO] 
[INFO] --- maven-surefire-plugin:2.17:test (integration) @ rackspace-cloudqueues-uk ---
[JENKINS] Recording test results[INFO] 
[INFO] --- maven-duplicate-finder-plugin:1.0.5:check (default) @ rackspace-cloudqueues-uk
---

[INFO] Checking compile classpath
[INFO] Checking runtime classpath
[INFO] Checking test classpath
[INFO]                                                                         
[INFO] ------------------------------------------------------------------------
[INFO] Building jclouds rackspace-cloudbigdata api 1.8.0-SNAPSHOT
[INFO] ------------------------------------------------------------------------
Downloading: https://repository.apache.org/content/repositories/snapshots/org/apache/jclouds/jclouds-compute/1.8.0-SNAPSHOT/maven-metadata.xml
Downloading: http://repository.apache.org/snapshots/org/apache/jclouds/jclouds-compute/1.8.0-SNAPSHOT/maven-metadata.xml
Downloaded: https://repository.apache.org/content/repositories/snapshots/org/apache/jclouds/jclouds-compute/1.8.0-SNAPSHOT/maven-metadata.xml
(2 KB at 1.7 KB/sec)
Downloaded: http://repository.apache.org/snapshots/org/apache/jclouds/jclouds-compute/1.8.0-SNAPSHOT/maven-metadata.xml
(2 KB at 1.0 KB/sec)
Downloading: https://repository.apache.org/content/repositories/snapshots/org/apache/jclouds/jclouds-scriptbuilder/1.8.0-SNAPSHOT/maven-metadata.xml
Downloading: http://repository.apache.org/snapshots/org/apache/jclouds/jclouds-scriptbuilder/1.8.0-SNAPSHOT/maven-metadata.xml
Downloaded: https://repository.apache.org/content/repositories/snapshots/org/apache/jclouds/jclouds-scriptbuilder/1.8.0-SNAPSHOT/maven-metadata.xml
(2 KB at 1.3 KB/sec)
Downloaded: http://repository.apache.org/snapshots/org/apache/jclouds/jclouds-scriptbuilder/1.8.0-SNAPSHOT/maven-metadata.xml
(2 KB at 0.8 KB/sec)
[INFO] 
[INFO] --- maven-clean-plugin:2.5:clean (default-clean) @ rackspace-cloudbigdata ---
[INFO] 
[INFO] --- maven-enforcer-plugin:1.1.1:enforce (enforce-banned-dependencies) @ rackspace-cloudbigdata
---
[INFO] 
[INFO] --- maven-enforcer-plugin:1.1.1:enforce (enforce-java) @ rackspace-cloudbigdata ---
[INFO] 
[INFO] --- maven-remote-resources-plugin:1.5:process (default) @ rackspace-cloudbigdata ---
[INFO] 
[INFO] --- maven-resources-plugin:2.6:resources (default-resources) @ rackspace-cloudbigdata
---
[INFO] Using 'UTF-8' encoding to copy filtered resources.
[INFO] skip non existing resourceDirectory <https://buildhive.cloudbees.com/job/jclouds/job/jclouds-labs-openstack/ws/rackspace-cloudbigdata/src/main/clojure>
[INFO] Copying 1 resource
[INFO] Copying 3 resources
[INFO] 
[INFO] --- maven-compiler-plugin:3.1:compile (default-compile) @ rackspace-cloudbigdata ---
[INFO] Changes detected - recompiling the module!
[INFO] Compiling 14 source files to <https://buildhive.cloudbees.com/job/jclouds/job/jclouds-labs-openstack/ws/rackspace-cloudbigdata/target/classes>
[WARNING] bootstrap class path not set in conjunction with -source 1.6
[INFO] 
[INFO] --- maven-resources-plugin:2.6:testResources (default-testResources) @ rackspace-cloudbigdata
---
[INFO] Using 'UTF-8' encoding to copy filtered resources.
[INFO] skip non existing resourceDirectory <https://buildhive.cloudbees.com/job/jclouds/job/jclouds-labs-openstack/ws/rackspace-cloudbigdata/src/test/clojure>
[INFO] Copying 20 resources
[INFO] Copying 3 resources
[INFO] 
[INFO] --- maven-compiler-plugin:3.1:testCompile (default-testCompile) @ rackspace-cloudbigdata
---
[INFO] Changes detected - recompiling the module!
[INFO] Compiling 6 source files to <https://buildhive.cloudbees.com/job/jclouds/job/jclouds-labs-openstack/ws/rackspace-cloudbigdata/target/test-classes>
[INFO] -------------------------------------------------------------
[WARNING] COMPILATION WARNING : 
[INFO] -------------------------------------------------------------
[WARNING] bootstrap class path not set in conjunction with -source 1.6
[INFO] 1 warning
[INFO] -------------------------------------------------------------
[INFO] -------------------------------------------------------------
[ERROR] COMPILATION ERROR : 
[INFO] -------------------------------------------------------------
[ERROR] <https://buildhive.cloudbees.com/job/jclouds/job/jclouds-labs-openstack/ws/rackspace-cloudbigdata/src/test/java/org/jclouds/rackspace/cloudbigdata/v1/features/ProfileApiLiveTest.java>:[45,28]
cannot find symbol
  symbol:   method filterRegions(java.util.Set<java.lang.String>)
  location: class org.jclouds.rackspace.cloudbigdata.v1.features.ProfileApiLiveTest
[ERROR] <https://buildhive.cloudbees.com/job/jclouds/job/jclouds-labs-openstack/ws/rackspace-cloudbigdata/src/test/java/org/jclouds/rackspace/cloudbigdata/v1/features/ProfileApiLiveTest.java>:[70,28]
cannot find symbol
  symbol:   method filterRegions(java.util.Set<java.lang.String>)
  location: class org.jclouds.rackspace.cloudbigdata.v1.features.ProfileApiLiveTest
[ERROR] <https://buildhive.cloudbees.com/job/jclouds/job/jclouds-labs-openstack/ws/rackspace-cloudbigdata/src/test/java/org/jclouds/rackspace/cloudbigdata/v1/features/ProfileApiLiveTest.java>:[94,31]
cannot find symbol
  symbol:   method filterRegions(java.util.Set<java.lang.String>)
  location: class org.jclouds.rackspace.cloudbigdata.v1.features.ProfileApiLiveTest
[ERROR] <https://buildhive.cloudbees.com/job/jclouds/job/jclouds-labs-openstack/ws/rackspace-cloudbigdata/src/test/java/org/jclouds/rackspace/cloudbigdata/v1/features/ClusterApiLiveTest.java>:[55,28]
cannot find symbol
  symbol:   method filterRegions(java.util.Set<java.lang.String>)
  location: class org.jclouds.rackspace.cloudbigdata.v1.features.ClusterApiLiveTest
[ERROR] <https://buildhive.cloudbees.com/job/jclouds/job/jclouds-labs-openstack/ws/rackspace-cloudbigdata/src/test/java/org/jclouds/rackspace/cloudbigdata/v1/features/ClusterApiLiveTest.java>:[113,28]
cannot find symbol
  symbol:   method filterRegions(java.util.Set<java.lang.String>)
  location: class org.jclouds.rackspace.cloudbigdata.v1.features.ClusterApiLiveTest
[ERROR] <https://buildhive.cloudbees.com/job/jclouds/job/jclouds-labs-openstack/ws/rackspace-cloudbigdata/src/test/java/org/jclouds/rackspace/cloudbigdata/v1/features/ClusterApiLiveTest.java>:[126,28]
cannot find symbol
  symbol:   method filterRegions(java.util.Set<java.lang.String>)
  location: class org.jclouds.rackspace.cloudbigdata.v1.features.ClusterApiLiveTest
[ERROR] <https://buildhive.cloudbees.com/job/jclouds/job/jclouds-labs-openstack/ws/rackspace-cloudbigdata/src/test/java/org/jclouds/rackspace/cloudbigdata/v1/features/ClusterApiLiveTest.java>:[141,28]
cannot find symbol
  symbol:   method filterRegions(java.util.Set<java.lang.String>)
  location: class org.jclouds.rackspace.cloudbigdata.v1.features.ClusterApiLiveTest
[INFO] 7 errors 
[INFO] -------------------------------------------------------------
[INFO] ------------------------------------------------------------------------
[INFO] Reactor Summary:
[INFO] 
[INFO] jclouds openstack-glance api ...................... SUCCESS [1:30.423s]
[INFO] jclouds openstack-neutron api ..................... SUCCESS [2:30.789s]
[INFO] jclouds openstack-swift api ....................... SUCCESS [53.138s]
[INFO] jclouds openstack-marconi api ..................... SUCCESS [41.080s]
[INFO] jclouds Rackspace Auto Scale API .................. SUCCESS [48.933s]
[INFO] jclouds Rackspace Auto Scale UK Provider .......... SUCCESS [11.748s]
[INFO] jclouds Rackspace Auto Scale US Provider .......... SUCCESS [11.780s]
[INFO] jclouds Rackspace Cloud Queues US provider ........ SUCCESS [2.650s]
[INFO] jclouds Rackspace Cloud Queues UK provider ........ SUCCESS [2.721s]
[INFO] jclouds rackspace-cloudbigdata api ................ FAILURE [5.605s]
[INFO] jclouds rackspace-cloudbigdata api provider ....... SKIPPED
[INFO] jclouds rackspace-cloudfiles api .................. SKIPPED
[INFO] jclouds Rackspace Cloud Files UK provider ......... SKIPPED
[INFO] jclouds Rackspace Cloud Files US provider ......... SKIPPED
[INFO] Apache jclouds labs openstack ..................... SKIPPED
[INFO] ------------------------------------------------------------------------
[INFO] BUILD FAILURE
[INFO] ------------------------------------------------------------------------
[INFO] Total time: 7:12.209s
[INFO] Finished at: Fri Aug 01 18:45:42 UTC 2014
[INFO] Final Memory: 43M/108M
[INFO] ------------------------------------------------------------------------
Waiting for Jenkins to finish collecting data
[ERROR] Failed to execute goal org.apache.maven.plugins:maven-compiler-plugin:3.1:testCompile
(default-testCompile) on project rackspace-cloudbigdata: Compilation failure: Compilation
failure:
[ERROR] <https://buildhive.cloudbees.com/job/jclouds/job/jclouds-labs-openstack/ws/rackspace-cloudbigdata/src/test/java/org/jclouds/rackspace/cloudbigdata/v1/features/ProfileApiLiveTest.java>:[45,28]
cannot find symbol
[ERROR] symbol:   method filterRegions(java.util.Set<java.lang.String>)
[ERROR] location: class org.jclouds.rackspace.cloudbigdata.v1.features.ProfileApiLiveTest
[ERROR] <https://buildhive.cloudbees.com/job/jclouds/job/jclouds-labs-openstack/ws/rackspace-cloudbigdata/src/test/java/org/jclouds/rackspace/cloudbigdata/v1/features/ProfileApiLiveTest.java>:[70,28]
cannot find symbol
[ERROR] symbol:   method filterRegions(java.util.Set<java.lang.String>)
[ERROR] location: class org.jclouds.rackspace.cloudbigdata.v1.features.ProfileApiLiveTest
[ERROR] <https://buildhive.cloudbees.com/job/jclouds/job/jclouds-labs-openstack/ws/rackspace-cloudbigdata/src/test/java/org/jclouds/rackspace/cloudbigdata/v1/features/ProfileApiLiveTest.java>:[94,31]
cannot find symbol
[ERROR] symbol:   method filterRegions(java.util.Set<java.lang.String>)
[ERROR] location: class org.jclouds.rackspace.cloudbigdata.v1.features.ProfileApiLiveTest
[ERROR] <https://buildhive.cloudbees.com/job/jclouds/job/jclouds-labs-openstack/ws/rackspace-cloudbigdata/src/test/java/org/jclouds/rackspace/cloudbigdata/v1/features/ClusterApiLiveTest.java>:[55,28]
cannot find symbol
[ERROR] symbol:   method filterRegions(java.util.Set<java.lang.String>)
[ERROR] location: class org.jclouds.rackspace.cloudbigdata.v1.features.ClusterApiLiveTest
[ERROR] <https://buildhive.cloudbees.com/job/jclouds/job/jclouds-labs-openstack/ws/rackspace-cloudbigdata/src/test/java/org/jclouds/rackspace/cloudbigdata/v1/features/ClusterApiLiveTest.java>:[113,28]
cannot find symbol
[ERROR] symbol:   method filterRegions(java.util.Set<java.lang.String>)
[ERROR] location: class org.jclouds.rackspace.cloudbigdata.v1.features.ClusterApiLiveTest
[ERROR] <https://buildhive.cloudbees.com/job/jclouds/job/jclouds-labs-openstack/ws/rackspace-cloudbigdata/src/test/java/org/jclouds/rackspace/cloudbigdata/v1/features/ClusterApiLiveTest.java>:[126,28]
cannot find symbol
[ERROR] symbol:   method filterRegions(java.util.Set<java.lang.String>)
[ERROR] location: class org.jclouds.rackspace.cloudbigdata.v1.features.ClusterApiLiveTest
[ERROR] <https://buildhive.cloudbees.com/job/jclouds/job/jclouds-labs-openstack/ws/rackspace-cloudbigdata/src/test/java/org/jclouds/rackspace/cloudbigdata/v1/features/ClusterApiLiveTest.java>:[141,28]
cannot find symbol
[ERROR] symbol:   method filterRegions(java.util.Set<java.lang.String>)
[ERROR] location: class org.jclouds.rackspace.cloudbigdata.v1.features.ClusterApiLiveTest
[ERROR] -> [Help 1]
org.apache.maven.lifecycle.LifecycleExecutionException: Failed to execute goal org.apache.maven.plugins:maven-compiler-plugin:3.1:testCompile
(default-testCompile) on project rackspace-cloudbigdata: Compilation failure
	at org.apache.maven.lifecycle.internal.MojoExecutor.execute(MojoExecutor.java:213)
	at org.apache.maven.lifecycle.internal.MojoExecutor.execute(MojoExecutor.java:153)
	at org.apache.maven.lifecycle.internal.MojoExecutor.execute(MojoExecutor.java:145)
	at org.apache.maven.lifecycle.internal.LifecycleModuleBuilder.buildProject(LifecycleModuleBuilder.java:84)
	at org.apache.maven.lifecycle.internal.LifecycleModuleBuilder.buildProject(LifecycleModuleBuilder.java:59)
	at org.apache.maven.lifecycle.internal.LifecycleStarter.singleThreadedBuild(LifecycleStarter.java:183)
	at org.apache.maven.lifecycle.internal.LifecycleStarter.execute(LifecycleStarter.java:161)
	at org.apache.maven.DefaultMaven.doExecute(DefaultMaven.java:320)
	at org.apache.maven.DefaultMaven.execute(DefaultMaven.java:156)
	at org.jvnet.hudson.maven3.launcher.Maven3Launcher.main(Maven3Launcher.java:117)
	at sun.reflect.NativeMethodAccessorImpl.invoke0(Native Method)
	at sun.reflect.NativeMethodAccessorImpl.invoke(NativeMethodAccessorImpl.java:57)
	at sun.reflect.DelegatingMethodAccessorImpl.invoke(DelegatingMethodAccessorImpl.java:43)
	at java.lang.reflect.Method.invoke(Method.java:606)
	at org.codehaus.plexus.classworlds.launcher.Launcher.launchStandard(Launcher.java:329)
	at org.codehaus.plexus.classworlds.launcher.Launcher.launch(Launcher.java:239)
	at org.jvnet.hudson.maven3.agent.Maven3Main.launch(Maven3Main.java:178)
	at sun.reflect.NativeMethodAccessorImpl.invoke0(Native Method)
	at sun.reflect.NativeMethodAccessorImpl.invoke(NativeMethodAccessorImpl.java:57)
	at sun.reflect.DelegatingMethodAccessorImpl.invoke(DelegatingMethodAccessorImpl.java:43)
	at java.lang.reflect.Method.invoke(Method.java:606)
	at hudson.maven.Maven3Builder.call(Maven3Builder.java:134)
	at hudson.maven.Maven3Builder.call(Maven3Builder.java:69)
	at hudson.remoting.UserRequest.perform(UserRequest.java:118)
	at hudson.remoting.UserRequest.perform(UserRequest.java:48)
	at hudson.remoting.Request$2.run(Request.java:328)
	at hudson.remoting.InterceptingExecutorService$1.call(InterceptingExecutorService.java:72)
	at java.util.concurrent.FutureTask.run(FutureTask.java:262)
	at java.util.concurrent.ThreadPoolExecutor.runWorker(ThreadPoolExecutor.java:1145)
	at java.util.concurrent.ThreadPoolExecutor$Worker.run(ThreadPoolExecutor.java:615)
	at java.lang.Thread.run(Thread.java:744)
Caused by: org.apache.maven.plugin.compiler.CompilationFailureException: Compilation failure
	at org.apache.maven.plugin.compiler.AbstractCompilerMojo.execute(AbstractCompilerMojo.java:858)
	at org.apache.maven.plugin.compiler.TestCompilerMojo.execute(TestCompilerMojo.java:152)
	at org.apache.maven.plugin.DefaultBuildPluginManager.executeMojo(DefaultBuildPluginManager.java:101)
	at org.apache.maven.lifecycle.internal.MojoExecutor.execute(MojoExecutor.java:209)
	... 30 more
[ERROR] 
[ERROR] Re-run Maven using the -X switch to enable full debug logging.
[ERROR] 
[ERROR] For more information about the errors and possible solutions, please read the following
articles:
[ERROR] [Help 1] http://cwiki.apache.org/confluence/display/MAVEN/MojoFailureException
[ERROR] 
[ERROR] After correcting the problems, you can resume the build with the command
[ERROR]   mvn <goals> -rf :rackspace-cloudbigdata
[JENKINS] Archiving <https://buildhive.cloudbees.com/job/jclouds/job/jclouds-labs-openstack/ws/rackspace-cloudqueues-us/pom.xml>
to org.apache.jclouds.labs/rackspace-cloudqueues-us/1.8.0-SNAPSHOT/rackspace-cloudqueues-us-1.8.0-SNAPSHOT.pom
[JENKINS] Archiving <https://buildhive.cloudbees.com/job/jclouds/job/jclouds-labs-openstack/ws/rackspace-cloudqueues-us/target/rackspace-cloudqueues-us-1.8.0-SNAPSHOT.jar>
to org.apache.jclouds.labs/rackspace-cloudqueues-us/1.8.0-SNAPSHOT/rackspace-cloudqueues-us-1.8.0-SNAPSHOT.jar
[JENKINS] Archiving <https://buildhive.cloudbees.com/job/jclouds/job/jclouds-labs-openstack/ws/rackspace-cloudqueues-us/target/rackspace-cloudqueues-us-1.8.0-SNAPSHOT-tests.jar>
to org.apache.jclouds.labs/rackspace-cloudqueues-us/1.8.0-SNAPSHOT/rackspace-cloudqueues-us-1.8.0-SNAPSHOT-tests.jar
[JENKINS] Archiving <https://buildhive.cloudbees.com/job/jclouds/job/jclouds-labs-openstack/ws/rackspace-autoscale-uk/pom.xml>
to org.apache.jclouds.labs/rackspace-autoscale-uk/1.8.0-SNAPSHOT/rackspace-autoscale-uk-1.8.0-SNAPSHOT.pom
[JENKINS] Archiving <https://buildhive.cloudbees.com/job/jclouds/job/jclouds-labs-openstack/ws/rackspace-autoscale-uk/target/rackspace-autoscale-uk-1.8.0-SNAPSHOT.jar>
to org.apache.jclouds.labs/rackspace-autoscale-uk/1.8.0-SNAPSHOT/rackspace-autoscale-uk-1.8.0-SNAPSHOT.jar
[JENKINS] Archiving <https://buildhive.cloudbees.com/job/jclouds/job/jclouds-labs-openstack/ws/rackspace-autoscale-uk/target/rackspace-autoscale-uk-1.8.0-SNAPSHOT-tests.jar>
to org.apache.jclouds.labs/rackspace-autoscale-uk/1.8.0-SNAPSHOT/rackspace-autoscale-uk-1.8.0-SNAPSHOT-tests.jar
[JENKINS] Archiving <https://buildhive.cloudbees.com/job/jclouds/job/jclouds-labs-openstack/ws/rackspace-cloudbigdata/pom.xml>
to org.apache.jclouds.labs/rackspace-cloudbigdata/1.8.0-SNAPSHOT/rackspace-cloudbigdata-1.8.0-SNAPSHOT.pom
[JENKINS] Archiving <https://buildhive.cloudbees.com/job/jclouds/job/jclouds-labs-openstack/ws/rackspace-cloudbigdata-us/pom.xml>
to org.apache.jclouds.labs/rackspace-cloudbigdata-us/1.8.0-SNAPSHOT/rackspace-cloudbigdata-us-1.8.0-SNAPSHOT.pom
[JENKINS] Archiving <https://buildhive.cloudbees.com/job/jclouds/job/jclouds-labs-openstack/ws/pom.xml>
to org.apache.jclouds.labs/jclouds-labs-openstack/1.8.0-SNAPSHOT/jclouds-labs-openstack-1.8.0-SNAPSHOT.pom
[JENKINS] Archiving <https://buildhive.cloudbees.com/job/jclouds/job/jclouds-labs-openstack/ws/rackspace-autoscale-us/pom.xml>
to org.apache.jclouds.labs/rackspace-autoscale-us/1.8.0-SNAPSHOT/rackspace-autoscale-us-1.8.0-SNAPSHOT.pom
[JENKINS] Archiving <https://buildhive.cloudbees.com/job/jclouds/job/jclouds-labs-openstack/ws/rackspace-autoscale-us/target/rackspace-autoscale-us-1.8.0-SNAPSHOT.jar>
to org.apache.jclouds.labs/rackspace-autoscale-us/1.8.0-SNAPSHOT/rackspace-autoscale-us-1.8.0-SNAPSHOT.jar
[JENKINS] Archiving <https://buildhive.cloudbees.com/job/jclouds/job/jclouds-labs-openstack/ws/rackspace-autoscale-us/target/rackspace-autoscale-us-1.8.0-SNAPSHOT-tests.jar>
to org.apache.jclouds.labs/rackspace-autoscale-us/1.8.0-SNAPSHOT/rackspace-autoscale-us-1.8.0-SNAPSHOT-tests.jar
[JENKINS] Archiving <https://buildhive.cloudbees.com/job/jclouds/job/jclouds-labs-openstack/ws/rackspace-autoscale/pom.xml>
to org.apache.jclouds.labs/rackspace-autoscale/1.8.0-SNAPSHOT/rackspace-autoscale-1.8.0-SNAPSHOT.pom
[JENKINS] Archiving <https://buildhive.cloudbees.com/job/jclouds/job/jclouds-labs-openstack/ws/rackspace-autoscale/target/rackspace-autoscale-1.8.0-SNAPSHOT.jar>
to org.apache.jclouds.labs/rackspace-autoscale/1.8.0-SNAPSHOT/rackspace-autoscale-1.8.0-SNAPSHOT.jar
[JENKINS] Archiving <https://buildhive.cloudbees.com/job/jclouds/job/jclouds-labs-openstack/ws/rackspace-autoscale/target/rackspace-autoscale-1.8.0-SNAPSHOT-tests.jar>
to org.apache.jclouds.labs/rackspace-autoscale/1.8.0-SNAPSHOT/rackspace-autoscale-1.8.0-SNAPSHOT-tests.jar
[JENKINS] Archiving <https://buildhive.cloudbees.com/job/jclouds/job/jclouds-labs-openstack/ws/openstack-swift/pom.xml>
to org.apache.jclouds.labs/openstack-swift/1.8.0-SNAPSHOT/openstack-swift-1.8.0-SNAPSHOT.pom
[JENKINS] Archiving <https://buildhive.cloudbees.com/job/jclouds/job/jclouds-labs-openstack/ws/openstack-swift/target/openstack-swift-1.8.0-SNAPSHOT.jar>
to org.apache.jclouds.labs/openstack-swift/1.8.0-SNAPSHOT/openstack-swift-1.8.0-SNAPSHOT.jar
[JENKINS] Archiving <https://buildhive.cloudbees.com/job/jclouds/job/jclouds-labs-openstack/ws/openstack-swift/target/openstack-swift-1.8.0-SNAPSHOT-tests.jar>
to org.apache.jclouds.labs/openstack-swift/1.8.0-SNAPSHOT/openstack-swift-1.8.0-SNAPSHOT-tests.jar
[JENKINS] Archiving <https://buildhive.cloudbees.com/job/jclouds/job/jclouds-labs-openstack/ws/openstack-neutron/pom.xml>
to org.apache.jclouds.labs/openstack-neutron/1.8.0-SNAPSHOT/openstack-neutron-1.8.0-SNAPSHOT.pom
[JENKINS] Archiving <https://buildhive.cloudbees.com/job/jclouds/job/jclouds-labs-openstack/ws/openstack-neutron/target/openstack-neutron-1.8.0-SNAPSHOT.jar>
to org.apache.jclouds.labs/openstack-neutron/1.8.0-SNAPSHOT/openstack-neutron-1.8.0-SNAPSHOT.jar
[JENKINS] Archiving <https://buildhive.cloudbees.com/job/jclouds/job/jclouds-labs-openstack/ws/openstack-neutron/target/openstack-neutron-1.8.0-SNAPSHOT-tests.jar>
to org.apache.jclouds.labs/openstack-neutron/1.8.0-SNAPSHOT/openstack-neutron-1.8.0-SNAPSHOT-tests.jar
[JENKINS] Archiving <https://buildhive.cloudbees.com/job/jclouds/job/jclouds-labs-openstack/ws/openstack-glance/pom.xml>
to org.apache.jclouds.labs/openstack-glance/1.8.0-SNAPSHOT/openstack-glance-1.8.0-SNAPSHOT.pom
[JENKINS] Archiving <https://buildhive.cloudbees.com/job/jclouds/job/jclouds-labs-openstack/ws/openstack-glance/target/openstack-glance-1.8.0-SNAPSHOT.jar>
to org.apache.jclouds.labs/openstack-glance/1.8.0-SNAPSHOT/openstack-glance-1.8.0-SNAPSHOT.jar
[JENKINS] Archiving <https://buildhive.cloudbees.com/job/jclouds/job/jclouds-labs-openstack/ws/openstack-glance/target/openstack-glance-1.8.0-SNAPSHOT-tests.jar>
to org.apache.jclouds.labs/openstack-glance/1.8.0-SNAPSHOT/openstack-glance-1.8.0-SNAPSHOT-tests.jar
[JENKINS] Archiving <https://buildhive.cloudbees.com/job/jclouds/job/jclouds-labs-openstack/ws/rackspace-cloudfiles-uk/pom.xml>
to org.apache.jclouds.labs/rackspace-cloudfiles-uk/1.8.0-SNAPSHOT/rackspace-cloudfiles-uk-1.8.0-SNAPSHOT.pom
[JENKINS] Archiving <https://buildhive.cloudbees.com/job/jclouds/job/jclouds-labs-openstack/ws/rackspace-cloudfiles/pom.xml>
to org.apache.jclouds.labs/rackspace-cloudfiles/1.8.0-SNAPSHOT/rackspace-cloudfiles-1.8.0-SNAPSHOT.pom
[JENKINS] Archiving <https://buildhive.cloudbees.com/job/jclouds/job/jclouds-labs-openstack/ws/openstack-marconi/pom.xml>
to org.apache.jclouds.labs/openstack-marconi/1.8.0-SNAPSHOT/openstack-marconi-1.8.0-SNAPSHOT.pom
[JENKINS] Archiving <https://buildhive.cloudbees.com/job/jclouds/job/jclouds-labs-openstack/ws/openstack-marconi/target/openstack-marconi-1.8.0-SNAPSHOT.jar>
to org.apache.jclouds.labs/openstack-marconi/1.8.0-SNAPSHOT/openstack-marconi-1.8.0-SNAPSHOT.jar
[JENKINS] Archiving <https://buildhive.cloudbees.com/job/jclouds/job/jclouds-labs-openstack/ws/openstack-marconi/target/openstack-marconi-1.8.0-SNAPSHOT-tests.jar>
to org.apache.jclouds.labs/openstack-marconi/1.8.0-SNAPSHOT/openstack-marconi-1.8.0-SNAPSHOT-tests.jar
[JENKINS] Archiving <https://buildhive.cloudbees.com/job/jclouds/job/jclouds-labs-openstack/ws/rackspace-cloudqueues-uk/pom.xml>
to org.apache.jclouds.labs/rackspace-cloudqueues-uk/1.8.0-SNAPSHOT/rackspace-cloudqueues-uk-1.8.0-SNAPSHOT.pom
[JENKINS] Archiving <https://buildhive.cloudbees.com/job/jclouds/job/jclouds-labs-openstack/ws/rackspace-cloudqueues-uk/target/rackspace-cloudqueues-uk-1.8.0-SNAPSHOT.jar>
to org.apache.jclouds.labs/rackspace-cloudqueues-uk/1.8.0-SNAPSHOT/rackspace-cloudqueues-uk-1.8.0-SNAPSHOT.jar
[JENKINS] Archiving <https://buildhive.cloudbees.com/job/jclouds/job/jclouds-labs-openstack/ws/rackspace-cloudqueues-uk/target/rackspace-cloudqueues-uk-1.8.0-SNAPSHOT-tests.jar>
to org.apache.jclouds.labs/rackspace-cloudqueues-uk/1.8.0-SNAPSHOT/rackspace-cloudqueues-uk-1.8.0-SNAPSHOT-tests.jar
[JENKINS] Archiving <https://buildhive.cloudbees.com/job/jclouds/job/jclouds-labs-openstack/ws/rackspace-cloudfiles-us/pom.xml>
to org.apache.jclouds.labs/rackspace-cloudfiles-us/1.8.0-SNAPSHOT/rackspace-cloudfiles-us-1.8.0-SNAPSHOT.pom
channel stopped

Mime
View raw message