jclouds-notifications mailing list archives

Site index · List index
Message view « Date » · « Thread »
Top « Date » · « Thread »
From jenkins-no-re...@cloudbees.com
Subject Build failed in Jenkins: jclouds-labs-openstack #410
Date Tue, 05 Aug 2014 08:47:43 GMT
See <https://jclouds.ci.cloudbees.com/job/jclouds-labs-openstack/410/changes>

Changes:

[Andrew Phillips] Up to 2.0.0-SNAPSHOT after the 1.8.0 release

------------------------------------------
[...truncated 479 lines...]
Downloaded: http://repo.cloudbees.com/content/repositories/central/javax/inject/javax.inject/1/javax.inject-1.pom
(612 B at 49.8 KB/sec)
Downloading: http://repo.cloudbees.com/content/repositories/central/aopalliance/aopalliance/1.0/aopalliance-1.0.pom
Downloaded: http://repo.cloudbees.com/content/repositories/central/aopalliance/aopalliance/1.0/aopalliance-1.0.pom
(363 B at 27.3 KB/sec)
Downloading: http://repo.cloudbees.com/content/repositories/central/org/99soft/guice/rocoto/6.2/rocoto-6.2.pom
Downloaded: http://repo.cloudbees.com/content/repositories/central/org/99soft/guice/rocoto/6.2/rocoto-6.2.pom
(5 KB at 317.2 KB/sec)
Downloading: http://repo.cloudbees.com/content/repositories/central/org/99soft/oss-parent/9/oss-parent-9.pom
Downloaded: http://repo.cloudbees.com/content/repositories/central/org/99soft/oss-parent/9/oss-parent-9.pom
(21 KB at 1548.2 KB/sec)
Downloading: http://repo.cloudbees.com/content/repositories/central/javax/annotation/jsr250-api/1.0/jsr250-api-1.0.pom
Downloaded: http://repo.cloudbees.com/content/repositories/central/javax/annotation/jsr250-api/1.0/jsr250-api-1.0.pom
(1023 B at 83.3 KB/sec)
Downloading: http://repo.cloudbees.com/content/repositories/central/com/google/code/gson/gson/2.2.4/gson-2.2.4.pom
Downloaded: http://repo.cloudbees.com/content/repositories/central/com/google/code/gson/gson/2.2.4/gson-2.2.4.pom
(8 KB at 603.8 KB/sec)
Downloading: http://repo.cloudbees.com/content/repositories/central/com/google/guava/guava/17.0/guava-17.0.pom
Downloaded: http://repo.cloudbees.com/content/repositories/central/com/google/guava/guava/17.0/guava-17.0.pom
(6 KB at 423.1 KB/sec)
Downloading: http://repo.cloudbees.com/content/repositories/central/com/google/guava/guava-parent/17.0/guava-parent-17.0.pom
Downloaded: http://repo.cloudbees.com/content/repositories/central/com/google/guava/guava-parent/17.0/guava-parent-17.0.pom
(8 KB at 588.5 KB/sec)
Downloading: http://repository.apache.org/snapshots/org/apache/jclouds/jclouds-core/2.0.0-SNAPSHOT/maven-metadata.xml
Downloading: https://repository.apache.org/content/repositories/snapshots/org/apache/jclouds/jclouds-core/2.0.0-SNAPSHOT/maven-metadata.xml
Downloading: https://repository-jclouds.forge.cloudbees.com/snapshot/org/apache/jclouds/jclouds-core/2.0.0-SNAPSHOT/maven-metadata.xml
Downloaded: https://repository.apache.org/content/repositories/snapshots/org/apache/jclouds/jclouds-core/2.0.0-SNAPSHOT/maven-metadata.xml
(2 KB at 7.5 KB/sec)
Downloaded: http://repository.apache.org/snapshots/org/apache/jclouds/jclouds-core/2.0.0-SNAPSHOT/maven-metadata.xml
(2 KB at 4.2 KB/sec)
Downloading: https://repository-jclouds.forge.cloudbees.com/snapshot/org/apache/jclouds/api/openstack-keystone/2.0.0-SNAPSHOT/maven-metadata.xml
Downloading: https://repository.apache.org/content/repositories/snapshots/org/apache/jclouds/api/openstack-keystone/2.0.0-SNAPSHOT/maven-metadata.xml
Downloading: http://repository.apache.org/snapshots/org/apache/jclouds/api/openstack-keystone/2.0.0-SNAPSHOT/maven-metadata.xml
Downloading: https://repository-jclouds.forge.cloudbees.com/snapshot/org/apache/jclouds/api/openstack-keystone/2.0.0-SNAPSHOT/openstack-keystone-2.0.0-SNAPSHOT.pom
Downloading: https://repository.apache.org/content/repositories/snapshots/org/apache/jclouds/api/openstack-keystone/2.0.0-SNAPSHOT/openstack-keystone-2.0.0-SNAPSHOT.pom
Downloading: http://repository.apache.org/snapshots/org/apache/jclouds/api/openstack-keystone/2.0.0-SNAPSHOT/openstack-keystone-2.0.0-SNAPSHOT.pom
[WARNING] The POM for org.apache.jclouds.api:openstack-keystone:jar:tests:2.0.0-SNAPSHOT is
missing, no dependency information available
Downloading: https://repository-jclouds.forge.cloudbees.com/snapshot/org/apache/jclouds/driver/jclouds-slf4j/2.0.0-SNAPSHOT/maven-metadata.xml
Downloading: https://repository.apache.org/content/repositories/snapshots/org/apache/jclouds/driver/jclouds-slf4j/2.0.0-SNAPSHOT/maven-metadata.xml
Downloading: http://repository.apache.org/snapshots/org/apache/jclouds/driver/jclouds-slf4j/2.0.0-SNAPSHOT/maven-metadata.xml
Downloaded: http://repository.apache.org/snapshots/org/apache/jclouds/driver/jclouds-slf4j/2.0.0-SNAPSHOT/maven-metadata.xml
(2 KB at 4.5 KB/sec)
Downloaded: https://repository.apache.org/content/repositories/snapshots/org/apache/jclouds/driver/jclouds-slf4j/2.0.0-SNAPSHOT/maven-metadata.xml
(2 KB at 4.1 KB/sec)
Downloading: https://repository-jclouds.forge.cloudbees.com/snapshot/org/apache/jclouds/driver/jclouds-slf4j/2.0.0-SNAPSHOT/jclouds-slf4j-2.0.0-20140805.083425-1.pom
Downloading: https://repository.apache.org/content/repositories/snapshots/org/apache/jclouds/driver/jclouds-slf4j/2.0.0-SNAPSHOT/jclouds-slf4j-2.0.0-20140805.083425-1.pom
Downloaded: https://repository.apache.org/content/repositories/snapshots/org/apache/jclouds/driver/jclouds-slf4j/2.0.0-SNAPSHOT/jclouds-slf4j-2.0.0-20140805.083425-1.pom
(3 KB at 12.6 KB/sec)
Downloading: http://repo.cloudbees.com/content/repositories/central/org/slf4j/slf4j-api/1.7.2/slf4j-api-1.7.2.pom
Downloaded: http://repo.cloudbees.com/content/repositories/central/org/slf4j/slf4j-api/1.7.2/slf4j-api-1.7.2.pom
(3 KB at 175.1 KB/sec)
Downloading: http://repo.cloudbees.com/content/repositories/central/org/slf4j/slf4j-parent/1.7.2/slf4j-parent-1.7.2.pom
Downloaded: http://repo.cloudbees.com/content/repositories/central/org/slf4j/slf4j-parent/1.7.2/slf4j-parent-1.7.2.pom
(12 KB at 720.5 KB/sec)
Downloading: http://repo.cloudbees.com/content/repositories/central/ch/qos/logback/logback-classic/1.1.2/logback-classic-1.1.2.pom
Downloaded: http://repo.cloudbees.com/content/repositories/central/ch/qos/logback/logback-classic/1.1.2/logback-classic-1.1.2.pom
(12 KB at 827.8 KB/sec)
Downloading: http://repo.cloudbees.com/content/repositories/central/ch/qos/logback/logback-parent/1.1.2/logback-parent-1.1.2.pom
Downloaded: http://repo.cloudbees.com/content/repositories/central/ch/qos/logback/logback-parent/1.1.2/logback-parent-1.1.2.pom
(15 KB at 330.7 KB/sec)
Downloading: http://repo.cloudbees.com/content/repositories/central/ch/qos/logback/logback-core/1.1.2/logback-core-1.1.2.pom
Downloaded: http://repo.cloudbees.com/content/repositories/central/ch/qos/logback/logback-core/1.1.2/logback-core-1.1.2.pom
(5 KB at 326.4 KB/sec)
Downloading: http://repo.cloudbees.com/content/repositories/central/org/slf4j/slf4j-api/1.7.6/slf4j-api-1.7.6.pom
Downloaded: http://repo.cloudbees.com/content/repositories/central/org/slf4j/slf4j-api/1.7.6/slf4j-api-1.7.6.pom
(3 KB at 202.0 KB/sec)
Downloading: http://repo.cloudbees.com/content/repositories/central/org/slf4j/slf4j-parent/1.7.6/slf4j-parent-1.7.6.pom
Downloaded: http://repo.cloudbees.com/content/repositories/central/org/slf4j/slf4j-parent/1.7.6/slf4j-parent-1.7.6.pom
(12 KB at 830.6 KB/sec)
Downloading: http://repo.cloudbees.com/content/repositories/central/org/testng/testng/6.8.8/testng-6.8.8.pom
Downloaded: http://repo.cloudbees.com/content/repositories/central/org/testng/testng/6.8.8/testng-6.8.8.pom
(8 KB at 10.8 KB/sec)
Downloading: http://repo.cloudbees.com/content/repositories/central/org/sonatype/oss/oss-parent/3/oss-parent-3.pom
Downloaded: http://repo.cloudbees.com/content/repositories/central/org/sonatype/oss/oss-parent/3/oss-parent-3.pom
(4 KB at 130.9 KB/sec)
Downloading: http://repo.cloudbees.com/content/repositories/central/org/beanshell/bsh/2.0b4/bsh-2.0b4.pom
Downloaded: http://repo.cloudbees.com/content/repositories/central/org/beanshell/bsh/2.0b4/bsh-2.0b4.pom
(2 KB at 33.3 KB/sec)
Downloading: http://repo.cloudbees.com/content/repositories/central/org/beanshell/beanshell/2.0b4/beanshell-2.0b4.pom
Downloaded: http://repo.cloudbees.com/content/repositories/central/org/beanshell/beanshell/2.0b4/beanshell-2.0b4.pom
(2 KB at 68.9 KB/sec)
Downloading: http://repo.cloudbees.com/content/repositories/central/com/beust/jcommander/1.27/jcommander-1.27.pom
Downloaded: http://repo.cloudbees.com/content/repositories/central/com/beust/jcommander/1.27/jcommander-1.27.pom
(8 KB at 226.5 KB/sec)
Downloading: http://repo.cloudbees.com/content/repositories/central/org/easymock/easymockclassextension/3.1/easymockclassextension-3.1.pom
Downloaded: http://repo.cloudbees.com/content/repositories/central/org/easymock/easymockclassextension/3.1/easymockclassextension-3.1.pom
(5 KB at 268.4 KB/sec)
Downloading: http://repo.cloudbees.com/content/repositories/central/org/easymock/easymock-parent/3.1/easymock-parent-3.1.pom
Downloaded: http://repo.cloudbees.com/content/repositories/central/org/easymock/easymock-parent/3.1/easymock-parent-3.1.pom
(13 KB at 988.1 KB/sec)
Downloading: http://repo.cloudbees.com/content/repositories/central/org/easymock/easymock/3.1/easymock-3.1.pom
Downloaded: http://repo.cloudbees.com/content/repositories/central/org/easymock/easymock/3.1/easymock-3.1.pom
(6 KB at 346.7 KB/sec)
Downloading: http://repo.cloudbees.com/content/repositories/central/cglib/cglib-nodep/2.2.2/cglib-nodep-2.2.2.pom
Downloaded: http://repo.cloudbees.com/content/repositories/central/cglib/cglib-nodep/2.2.2/cglib-nodep-2.2.2.pom
(2 KB at 78.8 KB/sec)
Downloading: http://repo.cloudbees.com/content/repositories/central/org/objenesis/objenesis/1.2/objenesis-1.2.pom
Downloaded: http://repo.cloudbees.com/content/repositories/central/org/objenesis/objenesis/1.2/objenesis-1.2.pom
(3 KB at 183.6 KB/sec)
Downloading: http://repo.cloudbees.com/content/repositories/central/org/objenesis/objenesis-parent/1.2/objenesis-parent-1.2.pom
Downloaded: http://repo.cloudbees.com/content/repositories/central/org/objenesis/objenesis-parent/1.2/objenesis-parent-1.2.pom
(11 KB at 388.8 KB/sec)
Downloading: http://repo.cloudbees.com/content/repositories/central/xmlunit/xmlunit/1.3/xmlunit-1.3.pom
Downloaded: http://repo.cloudbees.com/content/repositories/central/xmlunit/xmlunit/1.3/xmlunit-1.3.pom
(3 KB at 162.8 KB/sec)
Downloading: http://repo.cloudbees.com/content/repositories/central/org/clojure/clojure/1.3.0/clojure-1.3.0.pom
Downloaded: http://repo.cloudbees.com/content/repositories/central/org/clojure/clojure/1.3.0/clojure-1.3.0.pom
(6 KB at 294.2 KB/sec)
Downloading: http://repo.cloudbees.com/content/repositories/central/org/sonatype/oss/oss-parent/5/oss-parent-5.pom
Downloaded: http://repo.cloudbees.com/content/repositories/central/org/sonatype/oss/oss-parent/5/oss-parent-5.pom
(4 KB at 181.2 KB/sec)
Downloading: http://repo.cloudbees.com/content/repositories/central/org/clojure/tools.logging/0.2.3/tools.logging-0.2.3.pom
Downloaded: http://repo.cloudbees.com/content/repositories/central/org/clojure/tools.logging/0.2.3/tools.logging-0.2.3.pom
(2 KB at 115.8 KB/sec)
Downloading: http://repo.cloudbees.com/content/repositories/central/org/clojure/pom.contrib/0.0.23/pom.contrib-0.0.23.pom
Downloaded: http://repo.cloudbees.com/content/repositories/central/org/clojure/pom.contrib/0.0.23/pom.contrib-0.0.23.pom
(6 KB at 321.3 KB/sec)
Downloading: http://repo.cloudbees.com/content/repositories/central/org/clojure/core.incubator/0.1.0/core.incubator-0.1.0.pom
Downloaded: http://repo.cloudbees.com/content/repositories/central/org/clojure/core.incubator/0.1.0/core.incubator-0.1.0.pom
(732 B at 37.6 KB/sec)
Downloading: http://repo.cloudbees.com/content/repositories/central/org/clojure/pom.contrib/0.0.20/pom.contrib-0.0.20.pom
Downloaded: http://repo.cloudbees.com/content/repositories/central/org/clojure/pom.contrib/0.0.20/pom.contrib-0.0.20.pom
(6 KB at 455.2 KB/sec)
Downloading: https://repository-jclouds.forge.cloudbees.com/snapshot/org/apache/jclouds/api/openstack-keystone/2.0.0-SNAPSHOT/openstack-keystone-2.0.0-SNAPSHOT.jar
Downloading: https://repository-jclouds.forge.cloudbees.com/snapshot/org/apache/jclouds/api/openstack-keystone/2.0.0-SNAPSHOT/openstack-keystone-2.0.0-SNAPSHOT-tests.jar
Downloading: https://repository.apache.org/content/repositories/snapshots/org/apache/jclouds/api/openstack-keystone/2.0.0-SNAPSHOT/openstack-keystone-2.0.0-SNAPSHOT.jar
Downloading: https://repository.apache.org/content/repositories/snapshots/org/apache/jclouds/jclouds-core/2.0.0-SNAPSHOT/jclouds-core-2.0.0-20140805.082518-1.jar
Downloading: https://repository.apache.org/content/repositories/snapshots/org/apache/jclouds/jclouds-core/2.0.0-SNAPSHOT/jclouds-core-2.0.0-20140805.082518-1-tests.jar
Downloading: https://repository.apache.org/content/repositories/snapshots/org/apache/jclouds/driver/jclouds-slf4j/2.0.0-SNAPSHOT/jclouds-slf4j-2.0.0-20140805.083425-1.jar
Downloading: https://repository.apache.org/content/repositories/snapshots/org/apache/jclouds/api/openstack-keystone/2.0.0-SNAPSHOT/openstack-keystone-2.0.0-SNAPSHOT-tests.jar
Downloaded: https://repository.apache.org/content/repositories/snapshots/org/apache/jclouds/driver/jclouds-slf4j/2.0.0-SNAPSHOT/jclouds-slf4j-2.0.0-20140805.083425-1.jar
(12 KB at 16.4 KB/sec)
Downloaded: https://repository.apache.org/content/repositories/snapshots/org/apache/jclouds/jclouds-core/2.0.0-SNAPSHOT/jclouds-core-2.0.0-20140805.082518-1-tests.jar
(579 KB at 376.4 KB/sec)
Downloaded: https://repository.apache.org/content/repositories/snapshots/org/apache/jclouds/jclouds-core/2.0.0-SNAPSHOT/jclouds-core-2.0.0-20140805.082518-1.jar
(755 KB at 442.9 KB/sec)
Downloading: http://repository.apache.org/snapshots/org/apache/jclouds/api/openstack-keystone/2.0.0-SNAPSHOT/openstack-keystone-2.0.0-SNAPSHOT.jar
Downloading: http://repository.apache.org/snapshots/org/apache/jclouds/api/openstack-keystone/2.0.0-SNAPSHOT/openstack-keystone-2.0.0-SNAPSHOT-tests.jar
Downloading: http://repo.cloudbees.com/content/repositories/central/javax/ws/rs/jsr311-api/1.1.1/jsr311-api-1.1.1.jar
Downloading: http://repo.cloudbees.com/content/repositories/central/com/google/inject/extensions/guice-assistedinject/3.0/guice-assistedinject-3.0.jar
Downloading: http://repo.cloudbees.com/content/repositories/central/com/google/inject/guice/3.0/guice-3.0.jar
Downloading: http://repo.cloudbees.com/content/repositories/central/aopalliance/aopalliance/1.0/aopalliance-1.0.jar
Downloading: http://repo.cloudbees.com/content/repositories/central/org/99soft/guice/rocoto/6.2/rocoto-6.2.jar
Downloaded: http://repo.cloudbees.com/content/repositories/central/javax/ws/rs/jsr311-api/1.1.1/jsr311-api-1.1.1.jar
(46 KB at 1811.2 KB/sec)
Downloading: http://repo.cloudbees.com/content/repositories/central/javax/inject/javax.inject/1/javax.inject-1.jar
Downloaded: http://repo.cloudbees.com/content/repositories/central/aopalliance/aopalliance/1.0/aopalliance-1.0.jar
(5 KB at 155.8 KB/sec)
Downloading: http://repo.cloudbees.com/content/repositories/central/javax/annotation/jsr250-api/1.0/jsr250-api-1.0.jar
Downloaded: http://repo.cloudbees.com/content/repositories/central/org/99soft/guice/rocoto/6.2/rocoto-6.2.jar
(48 KB at 1680.3 KB/sec)
Downloading: http://repo.cloudbees.com/content/repositories/central/com/google/code/gson/gson/2.2.4/gson-2.2.4.jar
Downloaded: http://repo.cloudbees.com/content/repositories/central/com/google/inject/extensions/guice-assistedinject/3.0/guice-assistedinject-3.0.jar
(37 KB at 1032.3 KB/sec)
Downloading: http://repo.cloudbees.com/content/repositories/central/com/google/guava/guava/17.0/guava-17.0.jar
Downloaded: http://repo.cloudbees.com/content/repositories/central/javax/inject/javax.inject/1/javax.inject-1.jar
(3 KB at 128.3 KB/sec)
Downloading: http://repo.cloudbees.com/content/repositories/central/org/slf4j/slf4j-api/1.7.2/slf4j-api-1.7.2.jar
Downloaded: http://repo.cloudbees.com/content/repositories/central/javax/annotation/jsr250-api/1.0/jsr250-api-1.0.jar
(6 KB at 300.6 KB/sec)
Downloading: http://repo.cloudbees.com/content/repositories/central/ch/qos/logback/logback-classic/1.1.2/logback-classic-1.1.2.jar
Downloaded: http://repo.cloudbees.com/content/repositories/central/com/google/code/gson/gson/2.2.4/gson-2.2.4.jar
(186 KB at 6199.0 KB/sec)
Downloading: http://repo.cloudbees.com/content/repositories/central/ch/qos/logback/logback-core/1.1.2/logback-core-1.1.2.jar
Downloaded: http://repo.cloudbees.com/content/repositories/central/org/slf4j/slf4j-api/1.7.2/slf4j-api-1.7.2.jar
(26 KB at 1415.1 KB/sec)
Downloading: http://repo.cloudbees.com/content/repositories/central/org/testng/testng/6.8.8/testng-6.8.8.jar
Downloaded: http://repo.cloudbees.com/content/repositories/central/com/google/inject/guice/3.0/guice-3.0.jar
(694 KB at 10674.5 KB/sec)
Downloading: http://repo.cloudbees.com/content/repositories/central/org/beanshell/bsh/2.0b4/bsh-2.0b4.jar
Downloaded: http://repo.cloudbees.com/content/repositories/central/ch/qos/logback/logback-classic/1.1.2/logback-classic-1.1.2.jar
(265 KB at 6958.0 KB/sec)
Downloading: http://repo.cloudbees.com/content/repositories/central/com/beust/jcommander/1.27/jcommander-1.27.jar
Downloaded: http://repo.cloudbees.com/content/repositories/central/ch/qos/logback/logback-core/1.1.2/logback-core-1.1.2.jar
(418 KB at 10710.4 KB/sec)
Downloading: http://repo.cloudbees.com/content/repositories/central/org/easymock/easymockclassextension/3.1/easymockclassextension-3.1.jar
Downloaded: http://repo.cloudbees.com/content/repositories/central/org/beanshell/bsh/2.0b4/bsh-2.0b4.jar
(276 KB at 7859.8 KB/sec)
Downloading: http://repo.cloudbees.com/content/repositories/central/org/easymock/easymock/3.1/easymock-3.1.jar
Downloaded: http://repo.cloudbees.com/content/repositories/central/com/beust/jcommander/1.27/jcommander-1.27.jar
(55 KB at 3015.7 KB/sec)
Downloading: http://repo.cloudbees.com/content/repositories/central/cglib/cglib-nodep/2.2.2/cglib-nodep-2.2.2.jar
Downloaded: http://repo.cloudbees.com/content/repositories/central/org/easymock/easymockclassextension/3.1/easymockclassextension-3.1.jar
(11 KB at 637.4 KB/sec)
Downloading: http://repo.cloudbees.com/content/repositories/central/org/objenesis/objenesis/1.2/objenesis-1.2.jar
Downloaded: http://repo.cloudbees.com/content/repositories/central/org/easymock/easymock/3.1/easymock-3.1.jar
(110 KB at 5755.0 KB/sec)
Downloading: http://repo.cloudbees.com/content/repositories/central/xmlunit/xmlunit/1.3/xmlunit-1.3.jar
Downloaded: http://repo.cloudbees.com/content/repositories/central/org/testng/testng/6.8.8/testng-6.8.8.jar
(817 KB at 13175.4 KB/sec)
Downloading: http://repo.cloudbees.com/content/repositories/central/org/clojure/clojure/1.3.0/clojure-1.3.0.jar
Downloaded: http://repo.cloudbees.com/content/repositories/central/org/objenesis/objenesis/1.2/objenesis-1.2.jar
(36 KB at 2200.1 KB/sec)
Downloading: http://repo.cloudbees.com/content/repositories/central/org/clojure/tools.logging/0.2.3/tools.logging-0.2.3.jar
Downloaded: http://repo.cloudbees.com/content/repositories/central/cglib/cglib-nodep/2.2.2/cglib-nodep-2.2.2.jar
(320 KB at 11008.8 KB/sec)
Downloading: http://repo.cloudbees.com/content/repositories/central/org/clojure/core.incubator/0.1.0/core.incubator-0.1.0.jar
Downloaded: http://repo.cloudbees.com/content/repositories/central/com/google/guava/guava/17.0/guava-17.0.jar
(2191 KB at 21475.1 KB/sec)
Downloaded: http://repo.cloudbees.com/content/repositories/central/xmlunit/xmlunit/1.3/xmlunit-1.3.jar
(95 KB at 3047.9 KB/sec)
Downloaded: http://repo.cloudbees.com/content/repositories/central/org/clojure/tools.logging/0.2.3/tools.logging-0.2.3.jar
(7 KB at 346.1 KB/sec)
Downloaded: http://repo.cloudbees.com/content/repositories/central/org/clojure/core.incubator/0.1.0/core.incubator-0.1.0.jar
(4 KB at 169.8 KB/sec)
Downloaded: http://repo.cloudbees.com/content/repositories/central/org/clojure/clojure/1.3.0/clojure-1.3.0.jar
(3311 KB at 20066.4 KB/sec)
[INFO] ------------------------------------------------------------------------
[INFO] Reactor Summary:
[INFO] 
[INFO] jclouds openstack-glance api ...................... FAILURE [13.178s]
[INFO] jclouds openstack-neutron api ..................... SKIPPED
[INFO] jclouds openstack-swift api ....................... SKIPPED
[INFO] jclouds openstack-marconi api ..................... SKIPPED
[INFO] jclouds Rackspace Auto Scale API .................. SKIPPED
[INFO] jclouds Rackspace Auto Scale UK Provider .......... SKIPPED
[INFO] jclouds Rackspace Auto Scale US Provider .......... SKIPPED
[INFO] jclouds Rackspace Cloud Queues US provider ........ SKIPPED
[INFO] jclouds Rackspace Cloud Queues UK provider ........ SKIPPED
[INFO] jclouds rackspace-cloudbigdata api ................ SKIPPED
[INFO] jclouds rackspace-cloudbigdata api provider ....... SKIPPED
[INFO] jclouds rackspace-cloudfiles api .................. SKIPPED
[INFO] jclouds Rackspace Cloud Files UK provider ......... SKIPPED
[INFO] jclouds Rackspace Cloud Files US provider ......... SKIPPED
[INFO] Apache jclouds labs openstack ..................... SKIPPED
[INFO] ------------------------------------------------------------------------
[INFO] BUILD FAILURE
[INFO] ------------------------------------------------------------------------
[INFO] Total time: 30.317s
[INFO] Finished at: Tue Aug 05 04:47:33 EDT 2014
[INFO] Final Memory: 15M/97M
[INFO] ------------------------------------------------------------------------
Waiting for Jenkins to finish collecting data
[ERROR] Failed to execute goal on project openstack-glance: Could not resolve dependencies
for project org.apache.jclouds.labs:openstack-glance:bundle:1.8.0-SNAPSHOT: The following
artifacts could not be resolved: org.apache.jclouds.api:openstack-keystone:jar:2.0.0-SNAPSHOT,
org.apache.jclouds.api:openstack-keystone:jar:tests:2.0.0-SNAPSHOT: Could not find artifact
org.apache.jclouds.api:openstack-keystone:jar:2.0.0-SNAPSHOT in cloudbees-private-snapshot-repository
(https://repository-jclouds.forge.cloudbees.com/snapshot) -> [Help 1]
org.apache.maven.lifecycle.LifecycleExecutionException: Failed to execute goal on project
openstack-glance: Could not resolve dependencies for project org.apache.jclouds.labs:openstack-glance:bundle:1.8.0-SNAPSHOT:
The following artifacts could not be resolved: org.apache.jclouds.api:openstack-keystone:jar:2.0.0-SNAPSHOT,
org.apache.jclouds.api:openstack-keystone:jar:tests:2.0.0-SNAPSHOT: Could not find artifact
org.apache.jclouds.api:openstack-keystone:jar:2.0.0-SNAPSHOT in cloudbees-private-snapshot-repository
(https://repository-jclouds.forge.cloudbees.com/snapshot)
	at org.apache.maven.lifecycle.internal.LifecycleDependencyResolver.getDependencies(LifecycleDependencyResolver.java:196)
	at org.apache.maven.lifecycle.internal.LifecycleDependencyResolver.resolveProjectDependencies(LifecycleDependencyResolver.java:108)
	at org.apache.maven.lifecycle.internal.MojoExecutor.ensureDependenciesAreResolved(MojoExecutor.java:258)
	at org.apache.maven.lifecycle.internal.MojoExecutor.execute(MojoExecutor.java:201)
	at org.apache.maven.lifecycle.internal.MojoExecutor.execute(MojoExecutor.java:153)
	at org.apache.maven.lifecycle.internal.MojoExecutor.execute(MojoExecutor.java:145)
	at org.apache.maven.lifecycle.internal.LifecycleModuleBuilder.buildProject(LifecycleModuleBuilder.java:84)
	at org.apache.maven.lifecycle.internal.LifecycleModuleBuilder.buildProject(LifecycleModuleBuilder.java:59)
	at org.apache.maven.lifecycle.internal.LifecycleStarter.singleThreadedBuild(LifecycleStarter.java:183)
	at org.apache.maven.lifecycle.internal.LifecycleStarter.execute(LifecycleStarter.java:161)
	at org.apache.maven.DefaultMaven.doExecute(DefaultMaven.java:319)
	at org.apache.maven.DefaultMaven.execute(DefaultMaven.java:156)
	at org.jvnet.hudson.maven3.launcher.Maven3Launcher.main(Maven3Launcher.java:117)
	at sun.reflect.NativeMethodAccessorImpl.invoke0(Native Method)
	at sun.reflect.NativeMethodAccessorImpl.invoke(NativeMethodAccessorImpl.java:39)
	at sun.reflect.DelegatingMethodAccessorImpl.invoke(DelegatingMethodAccessorImpl.java:25)
	at java.lang.reflect.Method.invoke(Method.java:597)
	at org.codehaus.plexus.classworlds.launcher.Launcher.launchStandard(Launcher.java:329)
	at org.codehaus.plexus.classworlds.launcher.Launcher.launch(Launcher.java:239)
	at org.jvnet.hudson.maven3.agent.Maven3Main.launch(Maven3Main.java:178)
	at sun.reflect.NativeMethodAccessorImpl.invoke0(Native Method)
	at sun.reflect.NativeMethodAccessorImpl.invoke(NativeMethodAccessorImpl.java:39)
	at sun.reflect.DelegatingMethodAccessorImpl.invoke(DelegatingMethodAccessorImpl.java:25)
	at java.lang.reflect.Method.invoke(Method.java:597)
	at hudson.maven.Maven3Builder.call(Maven3Builder.java:134)
	at hudson.maven.Maven3Builder.call(Maven3Builder.java:69)
	at hudson.remoting.UserRequest.perform(UserRequest.java:118)
	at hudson.remoting.UserRequest.perform(UserRequest.java:48)
	at hudson.remoting.Request$2.run(Request.java:328)
	at hudson.remoting.InterceptingExecutorService$1.call(InterceptingExecutorService.java:72)
	at java.util.concurrent.FutureTask$Sync.innerRun(FutureTask.java:303)
	at java.util.concurrent.FutureTask.run(FutureTask.java:138)
	at java.util.concurrent.ThreadPoolExecutor$Worker.runTask(ThreadPoolExecutor.java:895)
	at java.util.concurrent.ThreadPoolExecutor$Worker.run(ThreadPoolExecutor.java:918)
	at java.lang.Thread.run(Thread.java:662)
Caused by: org.apache.maven.project.DependencyResolutionException: Could not resolve dependencies
for project org.apache.jclouds.labs:openstack-glance:bundle:1.8.0-SNAPSHOT: The following
artifacts could not be resolved: org.apache.jclouds.api:openstack-keystone:jar:2.0.0-SNAPSHOT,
org.apache.jclouds.api:openstack-keystone:jar:tests:2.0.0-SNAPSHOT: Could not find artifact
org.apache.jclouds.api:openstack-keystone:jar:2.0.0-SNAPSHOT in cloudbees-private-snapshot-repository
(https://repository-jclouds.forge.cloudbees.com/snapshot)
	at org.apache.maven.project.DefaultProjectDependenciesResolver.resolve(DefaultProjectDependenciesResolver.java:170)
	at org.apache.maven.lifecycle.internal.LifecycleDependencyResolver.getDependencies(LifecycleDependencyResolver.java:171)
	... 34 more
Caused by: org.sonatype.aether.resolution.DependencyResolutionException: The following artifacts
could not be resolved: org.apache.jclouds.api:openstack-keystone:jar:2.0.0-SNAPSHOT, org.apache.jclouds.api:openstack-keystone:jar:tests:2.0.0-SNAPSHOT:
Could not find artifact org.apache.jclouds.api:openstack-keystone:jar:2.0.0-SNAPSHOT in cloudbees-private-snapshot-repository
(https://repository-jclouds.forge.cloudbees.com/snapshot)
	at org.sonatype.aether.impl.internal.DefaultRepositorySystem.resolveDependencies(DefaultRepositorySystem.java:412)
	at org.apache.maven.project.DefaultProjectDependenciesResolver.resolve(DefaultProjectDependenciesResolver.java:164)
	... 35 more
Caused by: org.sonatype.aether.resolution.ArtifactResolutionException: The following artifacts
could not be resolved: org.apache.jclouds.api:openstack-keystone:jar:2.0.0-SNAPSHOT, org.apache.jclouds.api:openstack-keystone:jar:tests:2.0.0-SNAPSHOT:
Could not find artifact org.apache.jclouds.api:openstack-keystone:jar:2.0.0-SNAPSHOT in cloudbees-private-snapshot-repository
(https://repository-jclouds.forge.cloudbees.com/snapshot)
	at org.sonatype.aether.impl.internal.DefaultArtifactResolver.resolve(DefaultArtifactResolver.java:541)
	at org.sonatype.aether.impl.internal.DefaultArtifactResolver.resolveArtifacts(DefaultArtifactResolver.java:220)
	at org.sonatype.aether.impl.internal.DefaultRepositorySystem.resolveDependencies(DefaultRepositorySystem.java:395)
	... 36 more
Caused by: org.sonatype.aether.transfer.ArtifactNotFoundException: Could not find artifact
org.apache.jclouds.api:openstack-keystone:jar:2.0.0-SNAPSHOT in cloudbees-private-snapshot-repository
(https://repository-jclouds.forge.cloudbees.com/snapshot)
	at org.sonatype.aether.connector.wagon.WagonRepositoryConnector$4.wrap(WagonRepositoryConnector.java:945)
	at org.sonatype.aether.connector.wagon.WagonRepositoryConnector$4.wrap(WagonRepositoryConnector.java:940)
	at org.sonatype.aether.connector.wagon.WagonRepositoryConnector$GetTask.flush(WagonRepositoryConnector.java:695)
	at org.sonatype.aether.connector.wagon.WagonRepositoryConnector$GetTask.flush(WagonRepositoryConnector.java:689)
	at org.sonatype.aether.connector.wagon.WagonRepositoryConnector.get(WagonRepositoryConnector.java:445)
	at org.sonatype.aether.impl.internal.DefaultArtifactResolver.resolve(DefaultArtifactResolver.java:460)
	... 38 more
[ERROR] 
[ERROR] Re-run Maven using the -X switch to enable full debug logging.
[ERROR] 
[ERROR] For more information about the errors and possible solutions, please read the following
articles:
[ERROR] [Help 1] http://cwiki.apache.org/confluence/display/MAVEN/DependencyResolutionException
[JENKINS] Archiving <https://jclouds.ci.cloudbees.com/job/jclouds-labs-openstack/ws/rackspace-cloudqueues-us/pom.xml>
to org.apache.jclouds.labs/rackspace-cloudqueues-us/1.8.0-SNAPSHOT/rackspace-cloudqueues-us-1.8.0-SNAPSHOT.pom
[JENKINS] Archiving <https://jclouds.ci.cloudbees.com/job/jclouds-labs-openstack/ws/rackspace-autoscale-uk/pom.xml>
to org.apache.jclouds.labs/rackspace-autoscale-uk/1.8.0-SNAPSHOT/rackspace-autoscale-uk-1.8.0-SNAPSHOT.pom
[JENKINS] Archiving <https://jclouds.ci.cloudbees.com/job/jclouds-labs-openstack/ws/rackspace-cloudbigdata/pom.xml>
to org.apache.jclouds.labs/rackspace-cloudbigdata/1.8.0-SNAPSHOT/rackspace-cloudbigdata-1.8.0-SNAPSHOT.pom
[JENKINS] Archiving <https://jclouds.ci.cloudbees.com/job/jclouds-labs-openstack/ws/rackspace-cloudbigdata-us/pom.xml>
to org.apache.jclouds.labs/rackspace-cloudbigdata-us/1.8.0-SNAPSHOT/rackspace-cloudbigdata-us-1.8.0-SNAPSHOT.pom
[JENKINS] Archiving <https://jclouds.ci.cloudbees.com/job/jclouds-labs-openstack/ws/pom.xml>
to org.apache.jclouds.labs/jclouds-labs-openstack/1.8.0-SNAPSHOT/jclouds-labs-openstack-1.8.0-SNAPSHOT.pom
[JENKINS] Archiving <https://jclouds.ci.cloudbees.com/job/jclouds-labs-openstack/ws/rackspace-autoscale-us/pom.xml>
to org.apache.jclouds.labs/rackspace-autoscale-us/1.8.0-SNAPSHOT/rackspace-autoscale-us-1.8.0-SNAPSHOT.pom
[JENKINS] Archiving <https://jclouds.ci.cloudbees.com/job/jclouds-labs-openstack/ws/rackspace-autoscale/pom.xml>
to org.apache.jclouds.labs/rackspace-autoscale/1.8.0-SNAPSHOT/rackspace-autoscale-1.8.0-SNAPSHOT.pom
[JENKINS] Archiving <https://jclouds.ci.cloudbees.com/job/jclouds-labs-openstack/ws/openstack-swift/pom.xml>
to org.apache.jclouds.labs/openstack-swift/1.8.0-SNAPSHOT/openstack-swift-1.8.0-SNAPSHOT.pom
[JENKINS] Archiving <https://jclouds.ci.cloudbees.com/job/jclouds-labs-openstack/ws/openstack-neutron/pom.xml>
to org.apache.jclouds.labs/openstack-neutron/1.8.0-SNAPSHOT/openstack-neutron-1.8.0-SNAPSHOT.pom
[JENKINS] Archiving <https://jclouds.ci.cloudbees.com/job/jclouds-labs-openstack/ws/openstack-glance/pom.xml>
to org.apache.jclouds.labs/openstack-glance/1.8.0-SNAPSHOT/openstack-glance-1.8.0-SNAPSHOT.pom
[JENKINS] Archiving <https://jclouds.ci.cloudbees.com/job/jclouds-labs-openstack/ws/rackspace-cloudfiles-uk/pom.xml>
to org.apache.jclouds.labs/rackspace-cloudfiles-uk/1.8.0-SNAPSHOT/rackspace-cloudfiles-uk-1.8.0-SNAPSHOT.pom
[JENKINS] Archiving <https://jclouds.ci.cloudbees.com/job/jclouds-labs-openstack/ws/rackspace-cloudfiles/pom.xml>
to org.apache.jclouds.labs/rackspace-cloudfiles/1.8.0-SNAPSHOT/rackspace-cloudfiles-1.8.0-SNAPSHOT.pom
[JENKINS] Archiving <https://jclouds.ci.cloudbees.com/job/jclouds-labs-openstack/ws/openstack-marconi/pom.xml>
to org.apache.jclouds.labs/openstack-marconi/1.8.0-SNAPSHOT/openstack-marconi-1.8.0-SNAPSHOT.pom
[JENKINS] Archiving <https://jclouds.ci.cloudbees.com/job/jclouds-labs-openstack/ws/rackspace-cloudqueues-uk/pom.xml>
to org.apache.jclouds.labs/rackspace-cloudqueues-uk/1.8.0-SNAPSHOT/rackspace-cloudqueues-uk-1.8.0-SNAPSHOT.pom
[JENKINS] Archiving <https://jclouds.ci.cloudbees.com/job/jclouds-labs-openstack/ws/rackspace-cloudfiles-us/pom.xml>
to org.apache.jclouds.labs/rackspace-cloudfiles-us/1.8.0-SNAPSHOT/rackspace-cloudfiles-us-1.8.0-SNAPSHOT.pom
Sending e-mails to: notifications@jclouds.apache.org
channel stopped

Mime
View raw message