jclouds-notifications mailing list archives

Site index · List index
Message view « Date » · « Thread »
Top « Date » · « Thread »
From BuildHive <buildhive-git...@cloudbees.com>
Subject Build failed in Jenkins: jclouds » jclouds-karaf #1167
Date Sat, 02 Aug 2014 03:23:12 GMT
See <https://buildhive.cloudbees.com/job/jclouds/job/jclouds-karaf/1167/>

------------------------------------------
[...truncated 2603 lines...]
[WARNING] Could not transfer metadata org.apache.jclouds:jclouds-loadbalancer:1.8.0-SNAPSHOT/maven-metadata.xml
from/to maven2-repository.dev.java.net (http://download.java.net/maven/2/): Connection reset
Downloading: https://repository.apache.org/content/repositories/snapshots/org/apache/jclouds/jclouds-loadbalancer/1.8.0-SNAPSHOT/jclouds-loadbalancer-1.8.0-20140729.185138-259.jar
Downloaded: https://repository.apache.org/content/repositories/snapshots/org/apache/jclouds/jclouds-loadbalancer/1.8.0-SNAPSHOT/jclouds-loadbalancer-1.8.0-20140729.185138-259.jar
(24 KB at 57.0 KB/sec)
[INFO] Copying bundle: org.apache.jclouds.api:cloudstack:jar:1.8.0-SNAPSHOT
Downloading: https://repository.apache.org/content/repositories/snapshots/org/apache/jclouds/api/cloudstack/1.8.0-SNAPSHOT/maven-metadata.xml
Downloading: http://download.java.net/maven/2/org/apache/jclouds/api/cloudstack/1.8.0-SNAPSHOT/maven-metadata.xml
Downloading: https://oss.sonatype.org/content/repositories/releases/org/apache/jclouds/api/cloudstack/1.8.0-SNAPSHOT/maven-metadata.xml
Downloading: http://repository.apache.org/snapshots/org/apache/jclouds/api/cloudstack/1.8.0-SNAPSHOT/maven-metadata.xml
[INFO] I/O exception (java.net.SocketException) caught when processing request: Connection
reset
[INFO] Retrying request
[INFO] I/O exception (java.net.SocketException) caught when processing request: Connection
reset
[INFO] Retrying request
[INFO] I/O exception (java.net.SocketException) caught when processing request: Connection
reset
[INFO] Retrying request
Downloaded: https://repository.apache.org/content/repositories/snapshots/org/apache/jclouds/api/cloudstack/1.8.0-SNAPSHOT/maven-metadata.xml
(2 KB at 2.9 KB/sec)
Downloaded: http://repository.apache.org/snapshots/org/apache/jclouds/api/cloudstack/1.8.0-SNAPSHOT/maven-metadata.xml
(2 KB at 2.6 KB/sec)
[WARNING] Could not transfer metadata org.apache.jclouds.api:cloudstack:1.8.0-SNAPSHOT/maven-metadata.xml
from/to maven2-repository.dev.java.net (http://download.java.net/maven/2/): Connection reset
Downloading: https://repository.apache.org/content/repositories/snapshots/org/apache/jclouds/api/cloudstack/1.8.0-SNAPSHOT/cloudstack-1.8.0-20140729.190150-254.jar
Downloaded: https://repository.apache.org/content/repositories/snapshots/org/apache/jclouds/api/cloudstack/1.8.0-SNAPSHOT/cloudstack-1.8.0-20140729.190150-254.jar
(740 KB at 546.0 KB/sec)
[INFO] Copying bundle: org.apache.jclouds.provider:rackspace-cloudblockstorage-uk:jar:1.8.0-SNAPSHOT
Downloading: https://repository.apache.org/content/repositories/snapshots/org/apache/jclouds/provider/rackspace-cloudblockstorage-uk/1.8.0-SNAPSHOT/maven-metadata.xml
Downloading: http://download.java.net/maven/2/org/apache/jclouds/provider/rackspace-cloudblockstorage-uk/1.8.0-SNAPSHOT/maven-metadata.xml
Downloading: https://oss.sonatype.org/content/repositories/releases/org/apache/jclouds/provider/rackspace-cloudblockstorage-uk/1.8.0-SNAPSHOT/maven-metadata.xml
Downloading: http://repository.apache.org/snapshots/org/apache/jclouds/provider/rackspace-cloudblockstorage-uk/1.8.0-SNAPSHOT/maven-metadata.xml
[INFO] I/O exception (java.net.SocketException) caught when processing request: Connection
reset
[INFO] Retrying request
[INFO] I/O exception (java.net.SocketException) caught when processing request: Connection
reset
[INFO] Retrying request
[INFO] I/O exception (java.net.SocketException) caught when processing request: Connection
reset
[INFO] Retrying request
Downloaded: http://repository.apache.org/snapshots/org/apache/jclouds/provider/rackspace-cloudblockstorage-uk/1.8.0-SNAPSHOT/maven-metadata.xml
(2 KB at 1.6 KB/sec)
Downloaded: https://repository.apache.org/content/repositories/snapshots/org/apache/jclouds/provider/rackspace-cloudblockstorage-uk/1.8.0-SNAPSHOT/maven-metadata.xml
(2 KB at 0.8 KB/sec)
[WARNING] Could not transfer metadata org.apache.jclouds.provider:rackspace-cloudblockstorage-uk:1.8.0-SNAPSHOT/maven-metadata.xml
from/to maven2-repository.dev.java.net (http://download.java.net/maven/2/): Connection reset
Downloading: https://repository.apache.org/content/repositories/snapshots/org/apache/jclouds/provider/rackspace-cloudblockstorage-uk/1.8.0-SNAPSHOT/rackspace-cloudblockstorage-uk-1.8.0-20140729.201310-220.jar
Downloaded: https://repository.apache.org/content/repositories/snapshots/org/apache/jclouds/provider/rackspace-cloudblockstorage-uk/1.8.0-SNAPSHOT/rackspace-cloudblockstorage-uk-1.8.0-20140729.201310-220.jar
(13 KB at 32.2 KB/sec)
[INFO] Copying bundle: org.apache.servicemix.bundles:org.apache.servicemix.bundles.jersey-core:jar:1.11_1
[INFO] 
[INFO] --- maven-bundle-plugin:2.1.0:manifest (bundle-manifest) @ jclouds-karaf ---
[WARNING] Ignoring project type pom - supportedProjectTypes = [jar, war, bundle]
[INFO] 
[INFO] --- maven-site-plugin:3.3:attach-descriptor (attach-descriptor) @ jclouds-karaf ---
[INFO] 
[INFO] --- apache-rat-plugin:0.10:check (default) @ jclouds-karaf ---
[INFO] 51 implicit excludes (use -debug for more details).
[INFO] Exclude: **/LICENSE.txt
[INFO] Exclude: **/header.txt
[INFO] Exclude: **/NOTICE.txt
[INFO] Exclude: **/DISCLAIMER
[INFO] Exclude: **/BUILD.txt
[INFO] Exclude: **/CHANGES.txt
[INFO] Exclude: **/README.md
[INFO] Exclude: **/README.txt
[INFO] Exclude: **/DEPENDENCIES
[INFO] Exclude: **/CONTRIBUTING.md
[INFO] Exclude: .git/**
[INFO] Exclude: **/.gitignore
[INFO] Exclude: **/*.json
[INFO] Exclude: **/*.log*
[INFO] Exclude: **/TODO
[INFO] Exclude: .mailmap
[INFO] Exclude: .idea/**
[INFO] Exclude: **/*.iml
[INFO] Exclude: **/.project
[INFO] Exclude: **/.classpath
[INFO] Exclude: **/.settings/**
[INFO] Exclude: **/.checkstyle
[INFO] Exclude: **/target/**
[INFO] Exclude: .repository/**
[INFO] Exclude: **/src/main/resources/**/*.txt
[INFO] 4 resources included (use -debug for more details)
Warning:  org.apache.xerces.jaxp.SAXParserImpl$JAXPSAXParser: Property 'http://www.oracle.com/xml/jaxp/properties/entityExpansionLimit'
is not recognized.
Compiler warnings:
  WARNING:  'org.apache.xerces.jaxp.SAXParserImpl: Property 'http://javax.xml.XMLConstants/property/accessExternalDTD'
is not recognized.'
Warning:  org.apache.xerces.parsers.SAXParser: Feature 'http://javax.xml.XMLConstants/feature/secure-processing'
is not recognized.
Warning:  org.apache.xerces.parsers.SAXParser: Property 'http://javax.xml.XMLConstants/property/accessExternalDTD'
is not recognized.
Warning:  org.apache.xerces.parsers.SAXParser: Property 'http://www.oracle.com/xml/jaxp/properties/entityExpansionLimit'
is not recognized.
[INFO] Rat check: Summary of files. Unapproved: 0 unknown: 0 generated: 0 approved: 4 licence.
[INFO] 
[INFO] --- maven-install-plugin:2.5.1:install (default-install) @ jclouds-karaf ---
[INFO] Installing <https://buildhive.cloudbees.com/job/jclouds/job/jclouds-karaf/ws/feature/pom.xml>
to /home/jenkins/.m2/repository/org/apache/jclouds/karaf/jclouds-karaf/1.8.0-SNAPSHOT/jclouds-karaf-1.8.0-SNAPSHOT.pom
[INFO] Installing <https://buildhive.cloudbees.com/job/jclouds/job/jclouds-karaf/ws/feature/target/feature.xml>
to /home/jenkins/.m2/repository/org/apache/jclouds/karaf/jclouds-karaf/1.8.0-SNAPSHOT/jclouds-karaf-1.8.0-SNAPSHOT-features.xml
[INFO] Installing <https://buildhive.cloudbees.com/job/jclouds/job/jclouds-karaf/ws/feature/target/credentials.cfg>
to /home/jenkins/.m2/repository/org/apache/jclouds/karaf/jclouds-karaf/1.8.0-SNAPSHOT/jclouds-karaf-1.8.0-SNAPSHOT-credentials.cfg
[INFO] Installing <https://buildhive.cloudbees.com/job/jclouds/job/jclouds-karaf/ws/feature/target/shell.cfg>
to /home/jenkins/.m2/repository/org/apache/jclouds/karaf/jclouds-karaf/1.8.0-SNAPSHOT/jclouds-karaf-1.8.0-SNAPSHOT-shell.cfg
[INFO]                                                                         
[INFO] ------------------------------------------------------------------------
[INFO] Building jclouds :: Karaf :: Integration Tests 1.8.0-SNAPSHOT
[INFO] ------------------------------------------------------------------------
[INFO] 
[INFO] --- maven-clean-plugin:2.5:clean (default-clean) @ itests ---
[INFO] 
[INFO] --- maven-remote-resources-plugin:1.5:process (default) @ itests ---
Downloading: http://repo.cloudbees.com/content/repositories/central/org/eclipse/osgi/3.8.0.v20120529-1548/osgi-3.8.0.v20120529-1548.pom
Downloading: https://oss.sonatype.org/content/repositories/releases/org/eclipse/osgi/3.8.0.v20120529-1548/osgi-3.8.0.v20120529-1548.pom
Downloading: http://download.java.net/maven/2/org/eclipse/osgi/3.8.0.v20120529-1548/osgi-3.8.0.v20120529-1548.pom
[INFO] I/O exception (java.net.SocketException) caught when processing request: Connection
reset
[INFO] Retrying request
[INFO] I/O exception (java.net.SocketException) caught when processing request: Connection
reset
[INFO] Retrying request
[INFO] I/O exception (java.net.SocketException) caught when processing request: Connection
reset
[INFO] Retrying request
[INFO] ------------------------------------------------------------------------
[INFO] Reactor Summary:
[INFO] 
[INFO] Apache jclouds :: Karaf ........................... SUCCESS [24.958s]
[INFO] jclouds :: Karaf :: Core .......................... SUCCESS [21.621s]
[INFO] jclouds :: Karaf :: Utils ......................... SUCCESS [9.995s]
[INFO] jclouds :: Karaf :: Recipe ........................ SUCCESS [6.704s]
[INFO] jclouds :: Karaf :: Cache ......................... SUCCESS [7.085s]
[INFO] jclouds :: Karaf :: Services ...................... SUCCESS [39.816s]
[INFO] jclouds :: Karaf :: Commands ...................... SUCCESS [31.580s]
[INFO] jclouds :: Karaf :: URL Handler ................... SUCCESS [4.528s]
[INFO] jclouds :: Karaf :: Chef .......................... SUCCESS [0.632s]
[INFO] jclouds :: Karaf :: Chef :: Core .................. SUCCESS [13.201s]
[INFO] jclouds :: Karaf :: Chef :: Services .............. SUCCESS [5.959s]
[INFO] jclouds :: Karaf :: Chef :: Commands .............. SUCCESS [9.376s]
[INFO] jclouds :: Karaf :: Chef :: Cache ................. SUCCESS [5.417s]
[INFO] jclouds :: Karaf :: Feature ....................... SUCCESS [2:39.054s]
[INFO] jclouds :: Karaf :: Integration Tests ............. FAILURE [16.085s]
[INFO] ------------------------------------------------------------------------
[INFO] BUILD FAILURE
[INFO] ------------------------------------------------------------------------
[INFO] Total time: 6:04.485s
[INFO] Finished at: Sat Aug 02 03:23:00 UTC 2014
[INFO] Final Memory: 93M/222M
[INFO] ------------------------------------------------------------------------
Waiting for Jenkins to finish collecting data[ERROR] Failed to execute goal org.apache.maven.plugins:maven-remote-resources-plugin:1.5:process
(default) on project itests: Error resolving project artifact: Could not transfer artifact
org.eclipse:osgi:pom:3.8.0.v20120529-1548 from/to maven2-repository.dev.java.net (http://download.java.net/maven/2/):
Connection reset for project org.eclipse:osgi:jar:3.8.0.v20120529-1548 -> [Help 1]
org.apache.maven.lifecycle.LifecycleExecutionException: Failed to execute goal org.apache.maven.plugins:maven-remote-resources-plugin:1.5:process
(default) on project itests: Error resolving project artifact: Could not transfer artifact
org.eclipse:osgi:pom:3.8.0.v20120529-1548 from/to maven2-repository.dev.java.net (http://download.java.net/maven/2/):
Connection reset for project org.eclipse:osgi:jar:3.8.0.v20120529-1548
	at org.apache.maven.lifecycle.internal.MojoExecutor.execute(MojoExecutor.java:217)
	at org.apache.maven.lifecycle.internal.MojoExecutor.execute(MojoExecutor.java:153)
	at org.apache.maven.lifecycle.internal.MojoExecutor.execute(MojoExecutor.java:145)
	at org.apache.maven.lifecycle.internal.LifecycleModuleBuilder.buildProject(LifecycleModuleBuilder.java:84)
	at org.apache.maven.lifecycle.internal.LifecycleModuleBuilder.buildProject(LifecycleModuleBuilder.java:59)
	at org.apache.maven.lifecycle.internal.LifecycleStarter.singleThreadedBuild(LifecycleStarter.java:183)
	at org.apache.maven.lifecycle.internal.LifecycleStarter.execute(LifecycleStarter.java:161)
	at org.apache.maven.DefaultMaven.doExecute(DefaultMaven.java:320)
	at org.apache.maven.DefaultMaven.execute(DefaultMaven.java:156)
	at org.jvnet.hudson.maven3.launcher.Maven3Launcher.main(Maven3Launcher.java:117)
	at sun.reflect.NativeMethodAccessorImpl.invoke0(Native Method)
	at sun.reflect.NativeMethodAccessorImpl.invoke(NativeMethodAccessorImpl.java:57)
	at sun.reflect.DelegatingMethodAccessorImpl.invoke(DelegatingMethodAccessorImpl.java:43)
	at java.lang.reflect.Method.invoke(Method.java:606)
	at org.codehaus.plexus.classworlds.launcher.Launcher.launchStandard(Launcher.java:329)
	at org.codehaus.plexus.classworlds.launcher.Launcher.launch(Launcher.java:239)
	at org.jvnet.hudson.maven3.agent.Maven3Main.launch(Maven3Main.java:178)
	at sun.reflect.NativeMethodAccessorImpl.invoke0(Native Method)
	at sun.reflect.NativeMethodAccessorImpl.invoke(NativeMethodAccessorImpl.java:57)
	at sun.reflect.DelegatingMethodAccessorImpl.invoke(DelegatingMethodAccessorImpl.java:43)
	at java.lang.reflect.Method.invoke(Method.java:606)
	at hudson.maven.Maven3Builder.call(Maven3Builder.java:134)
	at hudson.maven.Maven3Builder.call(Maven3Builder.java:69)
	at hudson.remoting.UserRequest.perform(UserRequest.java:118)
	at hudson.remoting.UserRequest.perform(UserRequest.java:48)
	at hudson.remoting.Request$2.run(Request.java:328)
	at hudson.remoting.InterceptingExecutorService$1.call(InterceptingExecutorService.java:72)
	at java.util.concurrent.FutureTask.run(FutureTask.java:262)
	at java.util.concurrent.ThreadPoolExecutor.runWorker(ThreadPoolExecutor.java:1145)
	at java.util.concurrent.ThreadPoolExecutor$Worker.run(ThreadPoolExecutor.java:615)
	at java.lang.Thread.run(Thread.java:744)
Caused by: org.apache.maven.plugin.MojoExecutionException: Error resolving project artifact:
Could not transfer artifact org.eclipse:osgi:pom:3.8.0.v20120529-1548 from/to maven2-repository.dev.java.net
(http://download.java.net/maven/2/): Connection reset for project org.eclipse:osgi:jar:3.8.0.v20120529-1548
	at org.apache.maven.plugin.resources.remote.ProcessRemoteResourcesMojo.getProjects(ProcessRemoteResourcesMojo.java:701)
	at org.apache.maven.plugin.resources.remote.ProcessRemoteResourcesMojo.configureVelocityContext(ProcessRemoteResourcesMojo.java:1009)
	at org.apache.maven.plugin.resources.remote.ProcessRemoteResourcesMojo.execute(ProcessRemoteResourcesMojo.java:513)
	at org.apache.maven.plugin.DefaultBuildPluginManager.executeMojo(DefaultBuildPluginManager.java:101)
	at org.apache.maven.lifecycle.internal.MojoExecutor.execute(MojoExecutor.java:209)
	... 30 more
Caused by: org.apache.maven.project.ProjectBuildingException: Error resolving project artifact:
Could not transfer artifact org.eclipse:osgi:pom:3.8.0.v20120529-1548 from/to maven2-repository.dev.java.net
(http://download.java.net/maven/2/): Connection reset for project org.eclipse:osgi:jar:3.8.0.v20120529-1548
	at org.apache.maven.project.DefaultProjectBuilder.build(DefaultProjectBuilder.java:296)
	at org.apache.maven.project.DefaultMavenProjectBuilder.buildFromRepository(DefaultMavenProjectBuilder.java:236)
	at org.apache.maven.project.DefaultMavenProjectBuilder.buildFromRepository(DefaultMavenProjectBuilder.java:251)
	at org.apache.maven.project.DefaultMavenProjectBuilder.buildFromRepository(DefaultMavenProjectBuilder.java:258)
	at org.apache.maven.plugin.resources.remote.ProcessRemoteResourcesMojo.getProjects(ProcessRemoteResourcesMojo.java:671)
	... 34 more
Caused by: org.sonatype.aether.resolution.ArtifactResolutionException: Could not transfer
artifact org.eclipse:osgi:pom:3.8.0.v20120529-1548 from/to maven2-repository.dev.java.net
(http://download.java.net/maven/2/): Connection reset
	at org.sonatype.aether.impl.internal.DefaultArtifactResolver.resolve(DefaultArtifactResolver.java:538)
	at org.sonatype.aether.impl.internal.DefaultArtifactResolver.resolveArtifacts(DefaultArtifactResolver.java:216)
	at org.sonatype.aether.impl.internal.DefaultArtifactResolver.resolveArtifact(DefaultArtifactResolver.java:193)
	at org.sonatype.aether.impl.internal.DefaultRepositorySystem.resolveArtifact(DefaultRepositorySystem.java:286)
	at org.apache.maven.project.DefaultProjectBuilder.build(DefaultProjectBuilder.java:285)
	... 38 more
Caused by: org.sonatype.aether.transfer.ArtifactTransferException: Could not transfer artifact
org.eclipse:osgi:pom:3.8.0.v20120529-1548 from/to maven2-repository.dev.java.net (http://download.java.net/maven/2/):
Connection reset
	at org.sonatype.aether.connector.wagon.WagonRepositoryConnector$4.wrap(WagonRepositoryConnector.java:951)
	at org.sonatype.aether.connector.wagon.WagonRepositoryConnector$4.wrap(WagonRepositoryConnector.java:941)
	at org.sonatype.aether.connector.wagon.WagonRepositoryConnector$GetTask.run(WagonRepositoryConnector.java:669)
	at org.sonatype.aether.util.concurrency.RunnableErrorForwarder$1.run(RunnableErrorForwarder.java:60)
	... 3 more
Caused by: org.apache.maven.wagon.TransferFailedException: Connection reset
	at org.apache.maven.wagon.shared.http4.AbstractHttpClientWagon.resourceExists(AbstractHttpClientWagon.java:669)
	at org.sonatype.aether.connector.wagon.WagonRepositoryConnector$GetTask.run(WagonRepositoryConnector.java:577)
	... 4 more
Caused by: java.net.SocketException: Connection reset
	at java.net.SocketInputStream.read(SocketInputStream.java:196)
	at java.net.SocketInputStream.read(SocketInputStream.java:122)
	at org.apache.maven.wagon.providers.http.httpclient.impl.io.AbstractSessionInputBuffer.fillBuffer(AbstractSessionInputBuffer.java:166)
	at org.apache.maven.wagon.providers.http.httpclient.impl.io.SocketInputBuffer.fillBuffer(SocketInputBuffer.java:90)
	at org.apache.maven.wagon.providers.http.httpclient.impl.io.AbstractSessionInputBuffer.readLine(AbstractSessionInputBuffer.java:281)
	at org.apache.maven.wagon.providers.http.httpclient.impl.conn.DefaultHttpResponseParser.parseHead(DefaultHttpResponseParser.java:92)
	at org.apache.maven.wagon.providers.http.httpclient.impl.conn.DefaultHttpResponseParser.parseHead(DefaultHttpResponseParser.java:62)
	at org.apache.maven.wagon.providers.http.httpclient.impl.io.AbstractMessageParser.parse(AbstractMessageParser.java:254)
	at org.apache.maven.wagon.providers.http.httpclient.impl.AbstractHttpClientConnection.receiveResponseHeader(AbstractHttpClientConnection.java:289)
	at org.apache.maven.wagon.providers.http.httpclient.impl.conn.DefaultClientConnection.receiveResponseHeader(DefaultClientConnection.java:252)
	at org.apache.maven.wagon.providers.http.httpclient.impl.conn.ManagedClientConnectionImpl.receiveResponseHeader(ManagedClientConnectionImpl.java:191)
	at org.apache.maven.wagon.providers.http.httpclient.protocol.HttpRequestExecutor.doReceiveResponse(HttpRequestExecutor.java:300)
	at org.apache.maven.wagon.providers.http.httpclient.protocol.HttpRequestExecutor.execute(HttpRequestExecutor.java:127)
	at org.apache.maven.wagon.providers.http.httpclient.impl.client.DefaultRequestDirector.tryExecute(DefaultRequestDirector.java:717)
	at org.apache.maven.wagon.providers.http.httpclient.impl.client.DefaultRequestDirector.execute(DefaultRequestDirector.java:522)
	at org.apache.maven.wagon.providers.http.httpclient.impl.client.AbstractHttpClient.execute(AbstractHttpClient.java:906)
	at org.apache.maven.wagon.providers.http.httpclient.impl.client.AbstractHttpClient.execute(AbstractHttpClient.java:805)
	at org.apache.maven.wagon.shared.http4.AbstractHttpClientWagon.execute(AbstractHttpClientWagon.java:746)
	at org.apache.maven.wagon.shared.http4.AbstractHttpClientWagon.resourceExists(AbstractHttpClientWagon.java:665)
	... 5 more
[ERROR] 
[ERROR] Re-run Maven using the -X switch to enable full debug logging.
[ERROR] 
[ERROR] For more information about the errors and possible solutions, please read the following
articles:
[ERROR] [Help 1] http://cwiki.apache.org/confluence/display/MAVEN/MojoExecutionException
[ERROR] 
[ERROR] After correcting the problems, you can resume the build with the command
[ERROR]   mvn <goals> -rf :itests

[JENKINS] Archiving <https://buildhive.cloudbees.com/job/jclouds/job/jclouds-karaf/ws/chef/cache/pom.xml>
to org.apache.jclouds.karaf.chef/cache/1.8.0-SNAPSHOT/cache-1.8.0-SNAPSHOT.pom
[JENKINS] Archiving <https://buildhive.cloudbees.com/job/jclouds/job/jclouds-karaf/ws/chef/cache/target/cache-1.8.0-SNAPSHOT.jar>
to org.apache.jclouds.karaf.chef/cache/1.8.0-SNAPSHOT/cache-1.8.0-SNAPSHOT.jar
[JENKINS] Archiving <https://buildhive.cloudbees.com/job/jclouds/job/jclouds-karaf/ws/core/pom.xml>
to org.apache.jclouds.karaf/core/1.8.0-SNAPSHOT/core-1.8.0-SNAPSHOT.pom
[JENKINS] Archiving <https://buildhive.cloudbees.com/job/jclouds/job/jclouds-karaf/ws/core/target/core-1.8.0-SNAPSHOT.jar>
to org.apache.jclouds.karaf/core/1.8.0-SNAPSHOT/core-1.8.0-SNAPSHOT.jar
[JENKINS] Archiving <https://buildhive.cloudbees.com/job/jclouds/job/jclouds-karaf/ws/urlhandler/pom.xml>
to org.apache.jclouds.karaf/urlhandler/1.8.0-SNAPSHOT/urlhandler-1.8.0-SNAPSHOT.pom
[JENKINS] Archiving <https://buildhive.cloudbees.com/job/jclouds/job/jclouds-karaf/ws/urlhandler/target/urlhandler-1.8.0-SNAPSHOT.jar>
to org.apache.jclouds.karaf/urlhandler/1.8.0-SNAPSHOT/urlhandler-1.8.0-SNAPSHOT.jar
[JENKINS] Archiving <https://buildhive.cloudbees.com/job/jclouds/job/jclouds-karaf/ws/chef/core/pom.xml>
to org.apache.jclouds.karaf.chef/core/1.8.0-SNAPSHOT/core-1.8.0-SNAPSHOT.pom
[JENKINS] Archiving <https://buildhive.cloudbees.com/job/jclouds/job/jclouds-karaf/ws/chef/core/target/core-1.8.0-SNAPSHOT.jar>
to org.apache.jclouds.karaf.chef/core/1.8.0-SNAPSHOT/core-1.8.0-SNAPSHOT.jar
[JENKINS] Archiving <https://buildhive.cloudbees.com/job/jclouds/job/jclouds-karaf/ws/pom.xml>
to org.apache.jclouds/jclouds-karaf/1.8.0-SNAPSHOT/jclouds-karaf-1.8.0-SNAPSHOT.pom
[JENKINS] Archiving <https://buildhive.cloudbees.com/job/jclouds/job/jclouds-karaf/ws/chef/commands/pom.xml>
to org.apache.jclouds.karaf.chef/commands/1.8.0-SNAPSHOT/commands-1.8.0-SNAPSHOT.pom
[JENKINS] Archiving <https://buildhive.cloudbees.com/job/jclouds/job/jclouds-karaf/ws/chef/commands/target/commands-1.8.0-SNAPSHOT.jar>
to org.apache.jclouds.karaf.chef/commands/1.8.0-SNAPSHOT/commands-1.8.0-SNAPSHOT.jar
[JENKINS] Archiving <https://buildhive.cloudbees.com/job/jclouds/job/jclouds-karaf/ws/utils/pom.xml>
to org.apache.jclouds.karaf/utils/1.8.0-SNAPSHOT/utils-1.8.0-SNAPSHOT.pom
[JENKINS] Archiving <https://buildhive.cloudbees.com/job/jclouds/job/jclouds-karaf/ws/utils/target/utils-1.8.0-SNAPSHOT.jar>
to org.apache.jclouds.karaf/utils/1.8.0-SNAPSHOT/utils-1.8.0-SNAPSHOT.jar
[JENKINS] Archiving <https://buildhive.cloudbees.com/job/jclouds/job/jclouds-karaf/ws/commands/pom.xml>
to org.apache.jclouds.karaf/commands/1.8.0-SNAPSHOT/commands-1.8.0-SNAPSHOT.pom
[JENKINS] Archiving <https://buildhive.cloudbees.com/job/jclouds/job/jclouds-karaf/ws/commands/target/commands-1.8.0-SNAPSHOT.jar>
to org.apache.jclouds.karaf/commands/1.8.0-SNAPSHOT/commands-1.8.0-SNAPSHOT.jar
[JENKINS] Archiving <https://buildhive.cloudbees.com/job/jclouds/job/jclouds-karaf/ws/feature/pom.xml>
to org.apache.jclouds.karaf/jclouds-karaf/1.8.0-SNAPSHOT/jclouds-karaf-1.8.0-SNAPSHOT.pom
[JENKINS] Archiving <https://buildhive.cloudbees.com/job/jclouds/job/jclouds-karaf/ws/feature/target/feature.xml>
to org.apache.jclouds.karaf/jclouds-karaf/1.8.0-SNAPSHOT/jclouds-karaf-1.8.0-SNAPSHOT-features.xml
[JENKINS] Archiving <https://buildhive.cloudbees.com/job/jclouds/job/jclouds-karaf/ws/feature/target/credentials.cfg>
to org.apache.jclouds.karaf/jclouds-karaf/1.8.0-SNAPSHOT/jclouds-karaf-1.8.0-SNAPSHOT-credentials.cfg
[JENKINS] Archiving <https://buildhive.cloudbees.com/job/jclouds/job/jclouds-karaf/ws/feature/target/shell.cfg>
to org.apache.jclouds.karaf/jclouds-karaf/1.8.0-SNAPSHOT/jclouds-karaf-1.8.0-SNAPSHOT-shell.cfg
[JENKINS] Archiving <https://buildhive.cloudbees.com/job/jclouds/job/jclouds-karaf/ws/itests/pom.xml>
to org.apache.jclouds.karaf/itests/1.8.0-SNAPSHOT/itests-1.8.0-SNAPSHOT.pom
[JENKINS] Archiving <https://buildhive.cloudbees.com/job/jclouds/job/jclouds-karaf/ws/services/pom.xml>
to org.apache.jclouds.karaf/services/1.8.0-SNAPSHOT/services-1.8.0-SNAPSHOT.pom
[JENKINS] Archiving <https://buildhive.cloudbees.com/job/jclouds/job/jclouds-karaf/ws/services/target/services-1.8.0-SNAPSHOT.jar>
to org.apache.jclouds.karaf/services/1.8.0-SNAPSHOT/services-1.8.0-SNAPSHOT.jar
[JENKINS] Archiving <https://buildhive.cloudbees.com/job/jclouds/job/jclouds-karaf/ws/recipe/pom.xml>
to org.apache.jclouds.karaf/recipe/1.8.0-SNAPSHOT/recipe-1.8.0-SNAPSHOT.pom
[JENKINS] Archiving <https://buildhive.cloudbees.com/job/jclouds/job/jclouds-karaf/ws/recipe/target/recipe-1.8.0-SNAPSHOT.jar>
to org.apache.jclouds.karaf/recipe/1.8.0-SNAPSHOT/recipe-1.8.0-SNAPSHOT.jar
[JENKINS] Archiving <https://buildhive.cloudbees.com/job/jclouds/job/jclouds-karaf/ws/cache/pom.xml>
to org.apache.jclouds.karaf/cache/1.8.0-SNAPSHOT/cache-1.8.0-SNAPSHOT.pom
[JENKINS] Archiving <https://buildhive.cloudbees.com/job/jclouds/job/jclouds-karaf/ws/cache/target/cache-1.8.0-SNAPSHOT.jar>
to org.apache.jclouds.karaf/cache/1.8.0-SNAPSHOT/cache-1.8.0-SNAPSHOT.jar
[JENKINS] Archiving <https://buildhive.cloudbees.com/job/jclouds/job/jclouds-karaf/ws/chef/pom.xml>
to org.apache.jclouds.karaf/chef/1.8.0-SNAPSHOT/chef-1.8.0-SNAPSHOT.pom
[JENKINS] Archiving <https://buildhive.cloudbees.com/job/jclouds/job/jclouds-karaf/ws/chef/services/pom.xml>
to org.apache.jclouds.karaf.chef/services/1.8.0-SNAPSHOT/services-1.8.0-SNAPSHOT.pom
[JENKINS] Archiving <https://buildhive.cloudbees.com/job/jclouds/job/jclouds-karaf/ws/chef/services/target/services-1.8.0-SNAPSHOT.jar>
to org.apache.jclouds.karaf.chef/services/1.8.0-SNAPSHOT/services-1.8.0-SNAPSHOT.jar
channel stopped

Mime
View raw message