jclouds-notifications mailing list archives

Site index · List index
Message view « Date » · « Thread »
Top « Date » · « Thread »
From jenkins-no-re...@cloudbees.com
Subject Build failed in Jenkins: jclouds-labs #530
Date Tue, 05 Aug 2014 09:34:10 GMT
See <https://jclouds.ci.cloudbees.com/job/jclouds-labs/530/changes>

Changes:

[Andrew Phillips] Updating subproject versions to 2.0.0-SNAPSHOT

------------------------------------------
[...truncated 865 lines...]
  Alternatively, if you host your own repository you can deploy the file there: 
      mvn deploy:deploy-file -DgroupId=org.apache.jclouds.labs -DartifactId=cloudsigma2 -Dversion=2.0.0-SNAPSHOT
-Dpackaging=jar -Dfile=/path/to/file -Durl=[url] -DrepositoryId=[id]

  Path to dependency: 
  	1) org.apache.jclouds.labs:cloudsigma2-lvs:bundle:2.0.0-SNAPSHOT
  	2) org.apache.jclouds.labs:cloudsigma2:jar:2.0.0-SNAPSHOT

2) org.apache.jclouds.labs:cloudsigma2:test-jar:tests:2.0.0-SNAPSHOT

  Try downloading the file manually from the project website.

  Then, install it using the command: 
      mvn install:install-file -DgroupId=org.apache.jclouds.labs -DartifactId=cloudsigma2
-Dversion=2.0.0-SNAPSHOT -Dclassifier=tests -Dpackaging=test-jar -Dfile=/path/to/file

  Alternatively, if you host your own repository you can deploy the file there: 
      mvn deploy:deploy-file -DgroupId=org.apache.jclouds.labs -DartifactId=cloudsigma2 -Dversion=2.0.0-SNAPSHOT
-Dclassifier=tests -Dpackaging=test-jar -Dfile=/path/to/file -Durl=[url] -DrepositoryId=[id]

  Path to dependency: 
  	1) org.apache.jclouds.labs:cloudsigma2-lvs:bundle:2.0.0-SNAPSHOT
  	2) org.apache.jclouds.labs:cloudsigma2:test-jar:tests:2.0.0-SNAPSHOT

----------
2 required artifacts are missing.

for artifact: 
  org.apache.jclouds.labs:cloudsigma2-lvs:bundle:2.0.0-SNAPSHOT

from the specified remote repositories:
  central (http://repo.cloudbees.com/content/repositories/central, releases=true, snapshots=false),
  cloudbees-private-snapshot-repository (https://repository-jclouds.forge.cloudbees.com/snapshot,
releases=false, snapshots=true),
  cloudbees-private-release-repository (https://repository-jclouds.forge.cloudbees.com/release,
releases=true, snapshots=false),
  apache-snapshots (https://repository.apache.org/content/repositories/snapshots, releases=false,
snapshots=true),
  sonatype-nexus-snapshots (https://oss.sonatype.org/content/repositories/snapshots, releases=false,
snapshots=true),
  apache.snapshots (http://repository.apache.org/snapshots, releases=false, snapshots=true)

	at org.apache.maven.lifecycle.internal.MojoExecutor.execute(MojoExecutor.java:217)
	at org.apache.maven.lifecycle.internal.MojoExecutor.execute(MojoExecutor.java:153)
	at org.apache.maven.lifecycle.internal.MojoExecutor.execute(MojoExecutor.java:145)
	at org.apache.maven.lifecycle.internal.LifecycleModuleBuilder.buildProject(LifecycleModuleBuilder.java:84)
	at org.apache.maven.lifecycle.internal.LifecycleModuleBuilder.buildProject(LifecycleModuleBuilder.java:59)
	at org.apache.maven.lifecycle.internal.LifecycleStarter.singleThreadedBuild(LifecycleStarter.java:183)
	at org.apache.maven.lifecycle.internal.LifecycleStarter.execute(LifecycleStarter.java:161)
	at org.apache.maven.DefaultMaven.doExecute(DefaultMaven.java:319)
	at org.apache.maven.DefaultMaven.execute(DefaultMaven.java:156)
	at org.jvnet.hudson.maven3.launcher.Maven3Launcher.main(Maven3Launcher.java:117)
	at sun.reflect.NativeMethodAccessorImpl.invoke0(Native Method)
	at sun.reflect.NativeMethodAccessorImpl.invoke(NativeMethodAccessorImpl.java:39)
	at sun.reflect.DelegatingMethodAccessorImpl.invoke(DelegatingMethodAccessorImpl.java:25)
	at java.lang.reflect.Method.invoke(Method.java:597)
	at org.codehaus.plexus.classworlds.launcher.Launcher.launchStandard(Launcher.java:329)
	at org.codehaus.plexus.classworlds.launcher.Launcher.launch(Launcher.java:239)
	at org.jvnet.hudson.maven3.agent.Maven3Main.launch(Maven3Main.java:178)
	at sun.reflect.NativeMethodAccessorImpl.invoke0(Native Method)
	at sun.reflect.NativeMethodAccessorImpl.invoke(NativeMethodAccessorImpl.java:39)
	at sun.reflect.DelegatingMethodAccessorImpl.invoke(DelegatingMethodAccessorImpl.java:25)
	at java.lang.reflect.Method.invoke(Method.java:597)
	at hudson.maven.Maven3Builder.call(Maven3Builder.java:134)
	at hudson.maven.Maven3Builder.call(Maven3Builder.java:69)
	at hudson.remoting.UserRequest.perform(UserRequest.java:118)
	at hudson.remoting.UserRequest.perform(UserRequest.java:48)
	at hudson.remoting.Request$2.run(Request.java:328)
	at hudson.remoting.InterceptingExecutorService$1.call(InterceptingExecutorService.java:72)
	at java.util.concurrent.FutureTask$Sync.innerRun(FutureTask.java:303)
	at java.util.concurrent.FutureTask.run(FutureTask.java:138)
	at java.util.concurrent.ThreadPoolExecutor$Worker.runTask(ThreadPoolExecutor.java:895)
	at java.util.concurrent.ThreadPoolExecutor$Worker.run(ThreadPoolExecutor.java:918)
	at java.lang.Thread.run(Thread.java:662)
Caused by: org.apache.maven.plugin.MojoExecutionException: MavenReportException: Error while
creating archive: Missing:
----------
1) org.apache.jclouds.labs:cloudsigma2:jar:2.0.0-SNAPSHOT

  Try downloading the file manually from the project website.

  Then, install it using the command: 
      mvn install:install-file -DgroupId=org.apache.jclouds.labs -DartifactId=cloudsigma2
-Dversion=2.0.0-SNAPSHOT -Dpackaging=jar -Dfile=/path/to/file

  Alternatively, if you host your own repository you can deploy the file there: 
      mvn deploy:deploy-file -DgroupId=org.apache.jclouds.labs -DartifactId=cloudsigma2 -Dversion=2.0.0-SNAPSHOT
-Dpackaging=jar -Dfile=/path/to/file -Durl=[url] -DrepositoryId=[id]

  Path to dependency: 
  	1) org.apache.jclouds.labs:cloudsigma2-lvs:bundle:2.0.0-SNAPSHOT
  	2) org.apache.jclouds.labs:cloudsigma2:jar:2.0.0-SNAPSHOT

2) org.apache.jclouds.labs:cloudsigma2:test-jar:tests:2.0.0-SNAPSHOT

  Try downloading the file manually from the project website.

  Then, install it using the command: 
      mvn install:install-file -DgroupId=org.apache.jclouds.labs -DartifactId=cloudsigma2
-Dversion=2.0.0-SNAPSHOT -Dclassifier=tests -Dpackaging=test-jar -Dfile=/path/to/file

  Alternatively, if you host your own repository you can deploy the file there: 
      mvn deploy:deploy-file -DgroupId=org.apache.jclouds.labs -DartifactId=cloudsigma2 -Dversion=2.0.0-SNAPSHOT
-Dclassifier=tests -Dpackaging=test-jar -Dfile=/path/to/file -Durl=[url] -DrepositoryId=[id]

  Path to dependency: 
  	1) org.apache.jclouds.labs:cloudsigma2-lvs:bundle:2.0.0-SNAPSHOT
  	2) org.apache.jclouds.labs:cloudsigma2:test-jar:tests:2.0.0-SNAPSHOT

----------
2 required artifacts are missing.

for artifact: 
  org.apache.jclouds.labs:cloudsigma2-lvs:bundle:2.0.0-SNAPSHOT

from the specified remote repositories:
  central (http://repo.cloudbees.com/content/repositories/central, releases=true, snapshots=false),
  cloudbees-private-snapshot-repository (https://repository-jclouds.forge.cloudbees.com/snapshot,
releases=false, snapshots=true),
  cloudbees-private-release-repository (https://repository-jclouds.forge.cloudbees.com/release,
releases=true, snapshots=false),
  apache-snapshots (https://repository.apache.org/content/repositories/snapshots, releases=false,
snapshots=true),
  sonatype-nexus-snapshots (https://oss.sonatype.org/content/repositories/snapshots, releases=false,
snapshots=true),
  apache.snapshots (http://repository.apache.org/snapshots, releases=false, snapshots=true)

	at org.apache.maven.plugin.javadoc.AbstractJavadocMojo.failOnError(AbstractJavadocMojo.java:5826)
	at org.apache.maven.plugin.javadoc.JavadocJar.execute(JavadocJar.java:209)
	at org.apache.maven.plugin.DefaultBuildPluginManager.executeMojo(DefaultBuildPluginManager.java:101)
	at org.apache.maven.lifecycle.internal.MojoExecutor.execute(MojoExecutor.java:209)
	... 31 more
Caused by: org.apache.maven.reporting.MavenReportException: Missing:
----------
1) org.apache.jclouds.labs:cloudsigma2:jar:2.0.0-SNAPSHOT

  Try downloading the file manually from the project website.

  Then, install it using the command: 
      mvn install:install-file -DgroupId=org.apache.jclouds.labs -DartifactId=cloudsigma2
-Dversion=2.0.0-SNAPSHOT -Dpackaging=jar -Dfile=/path/to/file

  Alternatively, if you host your own repository you can deploy the file there: 
      mvn deploy:deploy-file -DgroupId=org.apache.jclouds.labs -DartifactId=cloudsigma2 -Dversion=2.0.0-SNAPSHOT
-Dpackaging=jar -Dfile=/path/to/file -Durl=[url] -DrepositoryId=[id]

  Path to dependency: 
  	1) org.apache.jclouds.labs:cloudsigma2-lvs:bundle:2.0.0-SNAPSHOT
  	2) org.apache.jclouds.labs:cloudsigma2:jar:2.0.0-SNAPSHOT

2) org.apache.jclouds.labs:cloudsigma2:test-jar:tests:2.0.0-SNAPSHOT

  Try downloading the file manually from the project website.

  Then, install it using the command: 
      mvn install:install-file -DgroupId=org.apache.jclouds.labs -DartifactId=cloudsigma2
-Dversion=2.0.0-SNAPSHOT -Dclassifier=tests -Dpackaging=test-jar -Dfile=/path/to/file

  Alternatively, if you host your own repository you can deploy the file there: 
      mvn deploy:deploy-file -DgroupId=org.apache.jclouds.labs -DartifactId=cloudsigma2 -Dversion=2.0.0-SNAPSHOT
-Dclassifier=tests -Dpackaging=test-jar -Dfile=/path/to/file -Durl=[url] -DrepositoryId=[id]

  Path to dependency: 
  	1) org.apache.jclouds.labs:cloudsigma2-lvs:bundle:2.0.0-SNAPSHOT
  	2) org.apache.jclouds.labs:cloudsigma2:test-jar:tests:2.0.0-SNAPSHOT

----------
2 required artifacts are missing.

for artifact: 
  org.apache.jclouds.labs:cloudsigma2-lvs:bundle:2.0.0-SNAPSHOT

from the specified remote repositories:
  central (http://repo.cloudbees.com/content/repositories/central, releases=true, snapshots=false),
  cloudbees-private-snapshot-repository (https://repository-jclouds.forge.cloudbees.com/snapshot,
releases=false, snapshots=true),
  cloudbees-private-release-repository (https://repository-jclouds.forge.cloudbees.com/release,
releases=true, snapshots=false),
  apache-snapshots (https://repository.apache.org/content/repositories/snapshots, releases=false,
snapshots=true),
  sonatype-nexus-snapshots (https://oss.sonatype.org/content/repositories/snapshots, releases=false,
snapshots=true),
  apache.snapshots (http://repository.apache.org/snapshots, releases=false, snapshots=true)

	at org.apache.maven.plugin.javadoc.AbstractJavadocMojo.getClasspath(AbstractJavadocMojo.java:2438)
	at org.apache.maven.plugin.javadoc.AbstractJavadocMojo.addJavadocOptions(AbstractJavadocMojo.java:4536)
	at org.apache.maven.plugin.javadoc.AbstractJavadocMojo.executeReport(AbstractJavadocMojo.java:1937)
	at org.apache.maven.plugin.javadoc.JavadocJar.execute(JavadocJar.java:181)
	... 33 more
Caused by: org.apache.maven.artifact.resolver.MultipleArtifactsNotFoundException: Missing:
----------
1) org.apache.jclouds.labs:cloudsigma2:jar:2.0.0-SNAPSHOT

  Try downloading the file manually from the project website.

  Then, install it using the command: 
      mvn install:install-file -DgroupId=org.apache.jclouds.labs -DartifactId=cloudsigma2
-Dversion=2.0.0-SNAPSHOT -Dpackaging=jar -Dfile=/path/to/file

  Alternatively, if you host your own repository you can deploy the file there: 
      mvn deploy:deploy-file -DgroupId=org.apache.jclouds.labs -DartifactId=cloudsigma2 -Dversion=2.0.0-SNAPSHOT
-Dpackaging=jar -Dfile=/path/to/file -Durl=[url] -DrepositoryId=[id]

  Path to dependency: 
  	1) org.apache.jclouds.labs:cloudsigma2-lvs:bundle:2.0.0-SNAPSHOT
  	2) org.apache.jclouds.labs:cloudsigma2:jar:2.0.0-SNAPSHOT

2) org.apache.jclouds.labs:cloudsigma2:test-jar:tests:2.0.0-SNAPSHOT

  Try downloading the file manually from the project website.

  Then, install it using the command: 
      mvn install:install-file -DgroupId=org.apache.jclouds.labs -DartifactId=cloudsigma2
-Dversion=2.0.0-SNAPSHOT -Dclassifier=tests -Dpackaging=test-jar -Dfile=/path/to/file

  Alternatively, if you host your own repository you can deploy the file there: 
      mvn deploy:deploy-file -DgroupId=org.apache.jclouds.labs -DartifactId=cloudsigma2 -Dversion=2.0.0-SNAPSHOT
-Dclassifier=tests -Dpackaging=test-jar -Dfile=/path/to/file -Durl=[url] -DrepositoryId=[id]

  Path to dependency: 
  	1) org.apache.jclouds.labs:cloudsigma2-lvs:bundle:2.0.0-SNAPSHOT
  	2) org.apache.jclouds.labs:cloudsigma2:test-jar:tests:2.0.0-SNAPSHOT

----------
2 required artifacts are missing.

for artifact: 
  org.apache.jclouds.labs:cloudsigma2-lvs:bundle:2.0.0-SNAPSHOT

from the specified remote repositories:
  central (http://repo.cloudbees.com/content/repositories/central, releases=true, snapshots=false),
  cloudbees-private-snapshot-repository (https://repository-jclouds.forge.cloudbees.com/snapshot,
releases=false, snapshots=true),
  cloudbees-private-release-repository (https://repository-jclouds.forge.cloudbees.com/release,
releases=true, snapshots=false),
  apache-snapshots (https://repository.apache.org/content/repositories/snapshots, releases=false,
snapshots=true),
  sonatype-nexus-snapshots (https://oss.sonatype.org/content/repositories/snapshots, releases=false,
snapshots=true),
  apache.snapshots (http://repository.apache.org/snapshots, releases=false, snapshots=true)

	at org.apache.maven.artifact.resolver.DefaultResolutionErrorHandler.throwErrors(DefaultResolutionErrorHandler.java:71)
	at org.apache.maven.artifact.resolver.DefaultArtifactResolver.resolveWithExceptions(DefaultArtifactResolver.java:326)
	at org.apache.maven.artifact.resolver.DefaultArtifactResolver.resolveTransitively(DefaultArtifactResolver.java:314)
	at org.apache.maven.artifact.resolver.DefaultArtifactResolver.resolveTransitively(DefaultArtifactResolver.java:293)
	at org.apache.maven.artifact.resolver.DefaultArtifactResolver.resolveTransitively(DefaultArtifactResolver.java:271)
	at org.apache.maven.artifact.resolver.DefaultArtifactResolver.resolveTransitively(DefaultArtifactResolver.java:264)
	at org.apache.maven.plugin.javadoc.AbstractJavadocMojo.getClasspath(AbstractJavadocMojo.java:2423)
	... 36 more
[ERROR] 
[ERROR] Re-run Maven using the -X switch to enable full debug logging.
[ERROR] 
[ERROR] For more information about the errors and possible solutions, please read the following
articles:
[ERROR] [Help 1] http://cwiki.apache.org/confluence/display/MAVEN/MojoExecutionException
[JENKINS] Archiving <https://jclouds.ci.cloudbees.com/job/jclouds-labs/ws/cloudsigma2/pom.xml>
to org.apache.jclouds.labs/cloudsigma2/2.0.0-SNAPSHOT/cloudsigma2-2.0.0-SNAPSHOT.pom
[JENKINS] Archiving <https://jclouds.ci.cloudbees.com/job/jclouds-labs/ws/fgcp-au/pom.xml>
to org.apache.jclouds.labs/fgcp-au/2.0.0-SNAPSHOT/fgcp-au-2.0.0-SNAPSHOT.pom
[JENKINS] Archiving <https://jclouds.ci.cloudbees.com/job/jclouds-labs/ws/cloudsigma2-zrh/pom.xml>
to org.apache.jclouds.labs/cloudsigma2-zrh/2.0.0-SNAPSHOT/cloudsigma2-zrh-2.0.0-SNAPSHOT.pom
[JENKINS] Archiving <https://jclouds.ci.cloudbees.com/job/jclouds-labs/ws/joyent-cloudapi/pom.xml>
to org.apache.jclouds.labs/joyent-cloudapi/2.0.0-SNAPSHOT/joyent-cloudapi-2.0.0-SNAPSHOT.pom
[JENKINS] Archiving <https://jclouds.ci.cloudbees.com/job/jclouds-labs/ws/pom.xml> to
org.apache.jclouds.labs/jclouds-labs/2.0.0-SNAPSHOT/jclouds-labs-2.0.0-SNAPSHOT.pom
[JENKINS] Archiving <https://jclouds.ci.cloudbees.com/job/jclouds-labs/ws/target/jclouds-labs-2.0.0-SNAPSHOT-tests.jar>
to org.apache.jclouds.labs/jclouds-labs/2.0.0-SNAPSHOT/jclouds-labs-2.0.0-SNAPSHOT-tests.jar
[JENKINS] Archiving <https://jclouds.ci.cloudbees.com/job/jclouds-labs/ws/docker/pom.xml>
to org.apache.jclouds.labs/docker/2.0.0-SNAPSHOT/docker-2.0.0-SNAPSHOT.pom
[JENKINS] Archiving <https://jclouds.ci.cloudbees.com/job/jclouds-labs/ws/cloudsigma2-wdc/pom.xml>
to org.apache.jclouds.labs/cloudsigma2-wdc/2.0.0-SNAPSHOT/cloudsigma2-wdc-2.0.0-SNAPSHOT.pom
[JENKINS] Archiving <https://jclouds.ci.cloudbees.com/job/jclouds-labs/ws/vcloud-director/pom.xml>
to org.apache.jclouds.labs/vcloud-director/2.0.0-SNAPSHOT/vcloud-director-2.0.0-SNAPSHOT.pom
[JENKINS] Archiving <https://jclouds.ci.cloudbees.com/job/jclouds-labs/ws/jclouds-representations/pom.xml>
to org.apache.jclouds.labs/jclouds-representations/2.0.0-SNAPSHOT/jclouds-representations-2.0.0-SNAPSHOT.pom
[JENKINS] Archiving <https://jclouds.ci.cloudbees.com/job/jclouds-labs/ws/jclouds-management/pom.xml>
to org.apache.jclouds.labs/jclouds-management/2.0.0-SNAPSHOT/jclouds-management-2.0.0-SNAPSHOT.pom
[JENKINS] Archiving <https://jclouds.ci.cloudbees.com/job/jclouds-labs/ws/virtualbox/pom.xml>
to org.apache.jclouds.labs/virtualbox/2.0.0-SNAPSHOT/virtualbox-2.0.0-SNAPSHOT.pom
[JENKINS] Archiving <https://jclouds.ci.cloudbees.com/job/jclouds-labs/ws/fgcp-de/pom.xml>
to org.apache.jclouds.labs/fgcp-de/2.0.0-SNAPSHOT/fgcp-de-2.0.0-SNAPSHOT.pom
[JENKINS] Archiving <https://jclouds.ci.cloudbees.com/job/jclouds-labs/ws/jclouds-representations/representations-codec/pom.xml>
to org.apache.jclouds.labs.representations/representations-codec/2.0.0-SNAPSHOT/representations-codec-2.0.0-SNAPSHOT.pom
[JENKINS] Archiving <https://jclouds.ci.cloudbees.com/job/jclouds-labs/ws/jclouds-management/management-compute/pom.xml>
to org.apache.jclouds.labs.management/management-compute/2.0.0-SNAPSHOT/management-compute-2.0.0-SNAPSHOT.pom
[JENKINS] Archiving <https://jclouds.ci.cloudbees.com/job/jclouds-labs/ws/dmtf/pom.xml>
to org.apache.jclouds.labs/dmtf/2.0.0-SNAPSHOT/dmtf-2.0.0-SNAPSHOT.pom
[JENKINS] Archiving <https://jclouds.ci.cloudbees.com/job/jclouds-labs/ws/digitalocean/pom.xml>
to org.apache.jclouds.labs/digitalocean/2.0.0-SNAPSHOT/digitalocean-2.0.0-SNAPSHOT.pom
[JENKINS] Archiving <https://jclouds.ci.cloudbees.com/job/jclouds-labs/ws/fgcp/pom.xml>
to org.apache.jclouds.labs/fgcp/2.0.0-SNAPSHOT/fgcp-2.0.0-SNAPSHOT.pom
[JENKINS] Archiving <https://jclouds.ci.cloudbees.com/job/jclouds-labs/ws/joyentcloud/pom.xml>
to org.apache.jclouds.labs/joyentcloud/2.0.0-SNAPSHOT/joyentcloud-2.0.0-SNAPSHOT.pom
[JENKINS] Archiving <https://jclouds.ci.cloudbees.com/job/jclouds-labs/ws/cloudsigma2-lvs/pom.xml>
to org.apache.jclouds.labs/cloudsigma2-lvs/2.0.0-SNAPSHOT/cloudsigma2-lvs-2.0.0-SNAPSHOT.pom
[JENKINS] Archiving <https://jclouds.ci.cloudbees.com/job/jclouds-labs/ws/jclouds-management/management-blobstore/pom.xml>
to org.apache.jclouds.labs.management/management-blobstore/2.0.0-SNAPSHOT/management-blobstore-2.0.0-SNAPSHOT.pom
[JENKINS] Archiving <https://jclouds.ci.cloudbees.com/job/jclouds-labs/ws/jclouds-management/management-core/pom.xml>
to org.apache.jclouds.labs.management/management-core/2.0.0-SNAPSHOT/management-core-2.0.0-SNAPSHOT.pom
[JENKINS] Archiving <https://jclouds.ci.cloudbees.com/job/jclouds-labs/ws/abiquo/pom.xml>
to org.apache.jclouds.labs/abiquo/2.0.0-SNAPSHOT/abiquo-2.0.0-SNAPSHOT.pom
[JENKINS] Archiving <https://jclouds.ci.cloudbees.com/job/jclouds-labs/ws/jclouds-representations/representations-core/pom.xml>
to org.apache.jclouds.labs.representations/representations-core/2.0.0-SNAPSHOT/representations-core-2.0.0-SNAPSHOT.pom
[JENKINS] Archiving <https://jclouds.ci.cloudbees.com/job/jclouds-labs/ws/cdmi/pom.xml>
to org.apache.jclouds.labs/cdmi/2.0.0-SNAPSHOT/cdmi-2.0.0-SNAPSHOT.pom
Sending e-mails to: notifications@jclouds.apache.org
channel stopped

Mime
View raw message