jclouds-notifications mailing list archives

Site index · List index
Message view « Date » · « Thread »
Top « Date » · « Thread »
From BuildHive <buildhive-git...@cloudbees.com>
Subject Build failed in Jenkins: jclouds » jclouds-karaf #1224
Date Mon, 01 Sep 2014 09:03:37 GMT
See <https://buildhive.cloudbees.com/job/jclouds/job/jclouds-karaf/1224/>

------------------------------------------
[...truncated 1860 lines...]
Downloading: http://repository.apache.org/snapshots/org/apache/jclouds/provider/azureblob/2.0.0-SNAPSHOT/maven-metadata.xml
Downloaded: https://repository.apache.org/content/repositories/snapshots/org/apache/jclouds/provider/azureblob/2.0.0-SNAPSHOT/maven-metadata.xml
(2 KB at 2.1 KB/sec)
Downloaded: http://repository.apache.org/snapshots/org/apache/jclouds/provider/azureblob/2.0.0-SNAPSHOT/maven-metadata.xml
(2 KB at 1.3 KB/sec)
[INFO] Copying bundle: org.apache.jclouds.provider:hpcloud-objectstorage:jar:2.0.0-SNAPSHOT
Downloading: https://repository.apache.org/content/repositories/snapshots/org/apache/jclouds/provider/hpcloud-objectstorage/2.0.0-SNAPSHOT/maven-metadata.xml
Downloading: http://download.java.net/maven/2/org/apache/jclouds/provider/hpcloud-objectstorage/2.0.0-SNAPSHOT/maven-metadata.xml
Downloading: https://oss.sonatype.org/content/repositories/releases/org/apache/jclouds/provider/hpcloud-objectstorage/2.0.0-SNAPSHOT/maven-metadata.xml
Downloading: http://repository.apache.org/snapshots/org/apache/jclouds/provider/hpcloud-objectstorage/2.0.0-SNAPSHOT/maven-metadata.xml
Downloaded: https://repository.apache.org/content/repositories/snapshots/org/apache/jclouds/provider/hpcloud-objectstorage/2.0.0-SNAPSHOT/maven-metadata.xml
(2 KB at 1.3 KB/sec)
Downloaded: http://repository.apache.org/snapshots/org/apache/jclouds/provider/hpcloud-objectstorage/2.0.0-SNAPSHOT/maven-metadata.xml
(2 KB at 1.1 KB/sec)
Downloading: https://repository.apache.org/content/repositories/snapshots/org/apache/jclouds/provider/hpcloud-objectstorage/2.0.0-SNAPSHOT/hpcloud-objectstorage-2.0.0-20140901.044544-19.jar
Downloaded: https://repository.apache.org/content/repositories/snapshots/org/apache/jclouds/provider/hpcloud-objectstorage/2.0.0-SNAPSHOT/hpcloud-objectstorage-2.0.0-20140901.044544-19.jar
(52 KB at 63.3 KB/sec)
[INFO] Copying bundle: org.apache.jclouds.provider:rackspace-cloudloadbalancers-uk:jar:2.0.0-SNAPSHOT
Downloading: https://repository.apache.org/content/repositories/snapshots/org/apache/jclouds/provider/rackspace-cloudloadbalancers-uk/2.0.0-SNAPSHOT/maven-metadata.xml
Downloading: http://download.java.net/maven/2/org/apache/jclouds/provider/rackspace-cloudloadbalancers-uk/2.0.0-SNAPSHOT/maven-metadata.xml
Downloading: https://oss.sonatype.org/content/repositories/releases/org/apache/jclouds/provider/rackspace-cloudloadbalancers-uk/2.0.0-SNAPSHOT/maven-metadata.xml
Downloading: http://repository.apache.org/snapshots/org/apache/jclouds/provider/rackspace-cloudloadbalancers-uk/2.0.0-SNAPSHOT/maven-metadata.xml
Downloaded: https://repository.apache.org/content/repositories/snapshots/org/apache/jclouds/provider/rackspace-cloudloadbalancers-uk/2.0.0-SNAPSHOT/maven-metadata.xml
(2 KB at 1.2 KB/sec)
Downloaded: http://repository.apache.org/snapshots/org/apache/jclouds/provider/rackspace-cloudloadbalancers-uk/2.0.0-SNAPSHOT/maven-metadata.xml
(2 KB at 0.6 KB/sec)
Downloading: https://repository.apache.org/content/repositories/snapshots/org/apache/jclouds/provider/rackspace-cloudloadbalancers-uk/2.0.0-SNAPSHOT/rackspace-cloudloadbalancers-uk-2.0.0-20140901.045107-19.jar
Downloaded: https://repository.apache.org/content/repositories/snapshots/org/apache/jclouds/provider/rackspace-cloudloadbalancers-uk/2.0.0-SNAPSHOT/rackspace-cloudloadbalancers-uk-2.0.0-20140901.045107-19.jar
(13 KB at 19.1 KB/sec)
[INFO] Copying bundle: org.apache.jclouds.provider:glesys:jar:2.0.0-SNAPSHOT
Downloading: https://repository.apache.org/content/repositories/snapshots/org/apache/jclouds/provider/glesys/2.0.0-SNAPSHOT/maven-metadata.xml
Downloading: http://download.java.net/maven/2/org/apache/jclouds/provider/glesys/2.0.0-SNAPSHOT/maven-metadata.xml
Downloading: https://oss.sonatype.org/content/repositories/releases/org/apache/jclouds/provider/glesys/2.0.0-SNAPSHOT/maven-metadata.xml
Downloading: http://repository.apache.org/snapshots/org/apache/jclouds/provider/glesys/2.0.0-SNAPSHOT/maven-metadata.xml
Downloaded: https://repository.apache.org/content/repositories/snapshots/org/apache/jclouds/provider/glesys/2.0.0-SNAPSHOT/maven-metadata.xml
(2 KB at 1.9 KB/sec)
Downloaded: http://repository.apache.org/snapshots/org/apache/jclouds/provider/glesys/2.0.0-SNAPSHOT/maven-metadata.xml
(2 KB at 1.5 KB/sec)
Downloading: https://repository.apache.org/content/repositories/snapshots/org/apache/jclouds/provider/glesys/2.0.0-SNAPSHOT/glesys-2.0.0-20140901.045531-19.jar
Downloaded: https://repository.apache.org/content/repositories/snapshots/org/apache/jclouds/provider/glesys/2.0.0-SNAPSHOT/glesys-2.0.0-20140901.045531-19.jar
(183 KB at 98.6 KB/sec)
[INFO] Copying bundle: org.apache.jclouds:jclouds-compute:jar:2.0.0-SNAPSHOT
[INFO] Copying bundle: org.apache.jclouds.driver:jclouds-enterprise:jar:2.0.0-SNAPSHOT
Downloading: https://repository.apache.org/content/repositories/snapshots/org/apache/jclouds/driver/jclouds-enterprise/2.0.0-SNAPSHOT/maven-metadata.xml
Downloading: http://download.java.net/maven/2/org/apache/jclouds/driver/jclouds-enterprise/2.0.0-SNAPSHOT/maven-metadata.xml
Downloading: https://oss.sonatype.org/content/repositories/releases/org/apache/jclouds/driver/jclouds-enterprise/2.0.0-SNAPSHOT/maven-metadata.xml
Downloading: http://repository.apache.org/snapshots/org/apache/jclouds/driver/jclouds-enterprise/2.0.0-SNAPSHOT/maven-metadata.xml
Downloaded: https://repository.apache.org/content/repositories/snapshots/org/apache/jclouds/driver/jclouds-enterprise/2.0.0-SNAPSHOT/maven-metadata.xml
(2 KB at 1.2 KB/sec)
Downloaded: http://repository.apache.org/snapshots/org/apache/jclouds/driver/jclouds-enterprise/2.0.0-SNAPSHOT/maven-metadata.xml
(2 KB at 1.2 KB/sec)
[INFO] Copying bundle: org.apache.jclouds.api:openstack-keystone:jar:2.0.0-SNAPSHOT
Downloading: https://repository.apache.org/content/repositories/snapshots/org/apache/jclouds/api/openstack-keystone/2.0.0-SNAPSHOT/maven-metadata.xml
Downloading: http://download.java.net/maven/2/org/apache/jclouds/api/openstack-keystone/2.0.0-SNAPSHOT/maven-metadata.xml
Downloading: https://oss.sonatype.org/content/repositories/releases/org/apache/jclouds/api/openstack-keystone/2.0.0-SNAPSHOT/maven-metadata.xml
Downloading: http://repository.apache.org/snapshots/org/apache/jclouds/api/openstack-keystone/2.0.0-SNAPSHOT/maven-metadata.xml
Downloaded: https://repository.apache.org/content/repositories/snapshots/org/apache/jclouds/api/openstack-keystone/2.0.0-SNAPSHOT/maven-metadata.xml
(2 KB at 2.7 KB/sec)
Downloaded: http://repository.apache.org/snapshots/org/apache/jclouds/api/openstack-keystone/2.0.0-SNAPSHOT/maven-metadata.xml
(2 KB at 2.2 KB/sec)
[INFO] Copying bundle: org.apache.servicemix.bundles:org.apache.servicemix.bundles.jersey-core:jar:1.11_1
[INFO] 
[INFO] --- maven-bundle-plugin:2.1.0:manifest (bundle-manifest) @ jclouds-karaf ---
[WARNING] Ignoring project type pom - supportedProjectTypes = [jar, war, bundle]
[INFO] 
[INFO] --- maven-site-plugin:3.3:attach-descriptor (attach-descriptor) @ jclouds-karaf ---
[INFO] 
[INFO] --- apache-rat-plugin:0.10:check (default) @ jclouds-karaf ---
[INFO] 51 implicit excludes (use -debug for more details).
[INFO] Exclude: **/LICENSE.txt
[INFO] Exclude: **/header.txt
[INFO] Exclude: **/NOTICE.txt
[INFO] Exclude: **/DISCLAIMER
[INFO] Exclude: **/BUILD.txt
[INFO] Exclude: **/CHANGES.txt
[INFO] Exclude: **/README.md
[INFO] Exclude: **/README.txt
[INFO] Exclude: **/DEPENDENCIES
[INFO] Exclude: **/CONTRIBUTING.md
[INFO] Exclude: .git/**
[INFO] Exclude: **/.gitignore
[INFO] Exclude: **/*.json
[INFO] Exclude: **/*.log*
[INFO] Exclude: **/TODO
[INFO] Exclude: .mailmap
[INFO] Exclude: .idea/**
[INFO] Exclude: **/*.iml
[INFO] Exclude: **/.project
[INFO] Exclude: **/.classpath
[INFO] Exclude: **/.settings/**
[INFO] Exclude: **/.checkstyle
[INFO] Exclude: **/target/**
[INFO] Exclude: .repository/**
[INFO] Exclude: **/src/main/resources/**/*.txt
[INFO] 4 resources included (use -debug for more details)
Warning:  org.apache.xerces.jaxp.SAXParserImpl$JAXPSAXParser: Property 'http://www.oracle.com/xml/jaxp/properties/entityExpansionLimit'
is not recognized.
Compiler warnings:
  WARNING:  'org.apache.xerces.jaxp.SAXParserImpl: Property 'http://javax.xml.XMLConstants/property/accessExternalDTD'
is not recognized.'
Warning:  org.apache.xerces.parsers.SAXParser: Feature 'http://javax.xml.XMLConstants/feature/secure-processing'
is not recognized.
Warning:  org.apache.xerces.parsers.SAXParser: Property 'http://javax.xml.XMLConstants/property/accessExternalDTD'
is not recognized.
Warning:  org.apache.xerces.parsers.SAXParser: Property 'http://www.oracle.com/xml/jaxp/properties/entityExpansionLimit'
is not recognized.
[INFO] Rat check: Summary of files. Unapproved: 0 unknown: 0 generated: 0 approved: 4 licence.
[INFO] 
[INFO] --- maven-install-plugin:2.5.1:install (default-install) @ jclouds-karaf ---
[INFO] Installing <https://buildhive.cloudbees.com/job/jclouds/job/jclouds-karaf/ws/feature/pom.xml>
to /home/jenkins/.m2/repository/org/apache/jclouds/karaf/jclouds-karaf/2.0.0-SNAPSHOT/jclouds-karaf-2.0.0-SNAPSHOT.pom
[INFO] Installing <https://buildhive.cloudbees.com/job/jclouds/job/jclouds-karaf/ws/feature/target/feature.xml>
to /home/jenkins/.m2/repository/org/apache/jclouds/karaf/jclouds-karaf/2.0.0-SNAPSHOT/jclouds-karaf-2.0.0-SNAPSHOT-features.xml
[INFO] Installing <https://buildhive.cloudbees.com/job/jclouds/job/jclouds-karaf/ws/feature/target/credentials.cfg>
to /home/jenkins/.m2/repository/org/apache/jclouds/karaf/jclouds-karaf/2.0.0-SNAPSHOT/jclouds-karaf-2.0.0-SNAPSHOT-credentials.cfg
[INFO] Installing <https://buildhive.cloudbees.com/job/jclouds/job/jclouds-karaf/ws/feature/target/shell.cfg>
to /home/jenkins/.m2/repository/org/apache/jclouds/karaf/jclouds-karaf/2.0.0-SNAPSHOT/jclouds-karaf-2.0.0-SNAPSHOT-shell.cfg
[INFO]                                                                         
[INFO] ------------------------------------------------------------------------
[INFO] Building jclouds :: Karaf :: Integration Tests 2.0.0-SNAPSHOT
[INFO] ------------------------------------------------------------------------
[INFO] 
[INFO] --- maven-clean-plugin:2.5:clean (default-clean) @ itests ---
[INFO] 
[INFO] --- maven-remote-resources-plugin:1.5:process (default) @ itests ---
Downloading: http://repo.cloudbees.com/content/repositories/central/org/eclipse/osgi/3.8.0.v20120529-1548/osgi-3.8.0.v20120529-1548.pom
Downloading: https://oss.sonatype.org/content/repositories/releases/org/eclipse/osgi/3.8.0.v20120529-1548/osgi-3.8.0.v20120529-1548.pom
Downloading: http://download.java.net/maven/2/org/eclipse/osgi/3.8.0.v20120529-1548/osgi-3.8.0.v20120529-1548.pom
Downloading: http://repo.cloudbees.com/content/repositories/central/org/apache/xerces/xercesImpl/2.11.0/xercesImpl-2.11.0.pom
Downloading: https://oss.sonatype.org/content/repositories/releases/org/apache/xerces/xercesImpl/2.11.0/xercesImpl-2.11.0.pom
Downloading: http://download.java.net/maven/2/org/apache/xerces/xercesImpl/2.11.0/xercesImpl-2.11.0.pom
[INFO] ------------------------------------------------------------------------
[INFO] Reactor Summary:
[INFO] 
[INFO] Apache jclouds :: Karaf ........................... SUCCESS [27.264s]
[INFO] jclouds :: Karaf :: Core .......................... SUCCESS [20.642s]
[INFO] jclouds :: Karaf :: Utils ......................... SUCCESS [7.891s]
[INFO] jclouds :: Karaf :: Recipe ........................ SUCCESS [7.356s]
[INFO] jclouds :: Karaf :: Cache ......................... SUCCESS [6.180s]
[INFO] jclouds :: Karaf :: Services ...................... SUCCESS [44.298s]
[INFO] jclouds :: Karaf :: Commands ...................... SUCCESS [35.226s]
[INFO] jclouds :: Karaf :: URL Handler ................... SUCCESS [5.271s]
[INFO] jclouds :: Karaf :: Chef .......................... SUCCESS [0.547s]
[INFO] jclouds :: Karaf :: Chef :: Core .................. SUCCESS [12.234s]
[INFO] jclouds :: Karaf :: Chef :: Services .............. SUCCESS [8.010s]
[INFO] jclouds :: Karaf :: Chef :: Commands .............. SUCCESS [10.022s]
[INFO] jclouds :: Karaf :: Chef :: Cache ................. SUCCESS [5.213s]
[INFO] jclouds :: Karaf :: Feature ....................... SUCCESS [2:15.074s]
[INFO] jclouds :: Karaf :: Integration Tests ............. FAILURE [14.307s]
[INFO] ------------------------------------------------------------------------
[INFO] BUILD FAILURE
[INFO] ------------------------------------------------------------------------
[INFO] Total time: 5:48.475s
[INFO] Finished at: Mon Sep 01 09:03:29 UTC 2014
[INFO] Final Memory: 92M/221M
[INFO] ------------------------------------------------------------------------
Waiting for Jenkins to finish collecting data
[ERROR] Failed to execute goal org.apache.maven.plugins:maven-remote-resources-plugin:1.5:process
(default) on project itests: Error resolving project artifact: Could not transfer artifact
org.apache.xerces:xercesImpl:pom:2.11.0 from/to sonatype (https://oss.sonatype.org/content/repositories/releases/):
peer not authenticated for project org.apache.xerces:xercesImpl:jar:2.11.0 -> [Help 1]
org.apache.maven.lifecycle.LifecycleExecutionException: Failed to execute goal org.apache.maven.plugins:maven-remote-resources-plugin:1.5:process
(default) on project itests: Error resolving project artifact: Could not transfer artifact
org.apache.xerces:xercesImpl:pom:2.11.0 from/to sonatype (https://oss.sonatype.org/content/repositories/releases/):
peer not authenticated for project org.apache.xerces:xercesImpl:jar:2.11.0
	at org.apache.maven.lifecycle.internal.MojoExecutor.execute(MojoExecutor.java:217)
	at org.apache.maven.lifecycle.internal.MojoExecutor.execute(MojoExecutor.java:153)
	at org.apache.maven.lifecycle.internal.MojoExecutor.execute(MojoExecutor.java:145)
	at org.apache.maven.lifecycle.internal.LifecycleModuleBuilder.buildProject(LifecycleModuleBuilder.java:84)
	at org.apache.maven.lifecycle.internal.LifecycleModuleBuilder.buildProject(LifecycleModuleBuilder.java:59)
	at org.apache.maven.lifecycle.internal.LifecycleStarter.singleThreadedBuild(LifecycleStarter.java:183)
	at org.apache.maven.lifecycle.internal.LifecycleStarter.execute(LifecycleStarter.java:161)
	at org.apache.maven.DefaultMaven.doExecute(DefaultMaven.java:320)
	at org.apache.maven.DefaultMaven.execute(DefaultMaven.java:156)
	at org.jvnet.hudson.maven3.launcher.Maven3Launcher.main(Maven3Launcher.java:117)
	at sun.reflect.NativeMethodAccessorImpl.invoke0(Native Method)
	at sun.reflect.NativeMethodAccessorImpl.invoke(NativeMethodAccessorImpl.java:57)
	at sun.reflect.DelegatingMethodAccessorImpl.invoke(DelegatingMethodAccessorImpl.java:43)
	at java.lang.reflect.Method.invoke(Method.java:606)
	at org.codehaus.plexus.classworlds.launcher.Launcher.launchStandard(Launcher.java:329)
	at org.codehaus.plexus.classworlds.launcher.Launcher.launch(Launcher.java:239)
	at org.jvnet.hudson.maven3.agent.Maven3Main.launch(Maven3Main.java:178)
	at sun.reflect.NativeMethodAccessorImpl.invoke0(Native Method)
	at sun.reflect.NativeMethodAccessorImpl.invoke(NativeMethodAccessorImpl.java:57)
	at sun.reflect.DelegatingMethodAccessorImpl.invoke(DelegatingMethodAccessorImpl.java:43)
	at java.lang.reflect.Method.invoke(Method.java:606)
	at hudson.maven.Maven3Builder.call(Maven3Builder.java:134)
	at hudson.maven.Maven3Builder.call(Maven3Builder.java:69)
	at hudson.remoting.UserRequest.perform(UserRequest.java:118)
	at hudson.remoting.UserRequest.perform(UserRequest.java:48)
	at hudson.remoting.Request$2.run(Request.java:328)
	at hudson.remoting.InterceptingExecutorService$1.call(InterceptingExecutorService.java:72)
	at java.util.concurrent.FutureTask.run(FutureTask.java:262)
	at java.util.concurrent.ThreadPoolExecutor.runWorker(ThreadPoolExecutor.java:1145)
	at java.util.concurrent.ThreadPoolExecutor$Worker.run(ThreadPoolExecutor.java:615)
	at java.lang.Thread.run(Thread.java:744)
Caused by: org.apache.maven.plugin.MojoExecutionException: Error resolving project artifact:
Could not transfer artifact org.apache.xerces:xercesImpl:pom:2.11.0 from/to sonatype (https://oss.sonatype.org/content/repositories/releases/):
peer not authenticated for project org.apache.xerces:xercesImpl:jar:2.11.0
	at org.apache.maven.plugin.resources.remote.ProcessRemoteResourcesMojo.getProjects(ProcessRemoteResourcesMojo.java:701)
	at org.apache.maven.plugin.resources.remote.ProcessRemoteResourcesMojo.configureVelocityContext(ProcessRemoteResourcesMojo.java:1009)
	at org.apache.maven.plugin.resources.remote.ProcessRemoteResourcesMojo.execute(ProcessRemoteResourcesMojo.java:513)
	at org.apache.maven.plugin.DefaultBuildPluginManager.executeMojo(DefaultBuildPluginManager.java:101)
	at org.apache.maven.lifecycle.internal.MojoExecutor.execute(MojoExecutor.java:209)
	... 30 more
Caused by: org.apache.maven.project.ProjectBuildingException: Error resolving project artifact:
Could not transfer artifact org.apache.xerces:xercesImpl:pom:2.11.0 from/to sonatype (https://oss.sonatype.org/content/repositories/releases/):
peer not authenticated for project org.apache.xerces:xercesImpl:jar:2.11.0
	at org.apache.maven.project.DefaultProjectBuilder.build(DefaultProjectBuilder.java:296)
	at org.apache.maven.project.DefaultMavenProjectBuilder.buildFromRepository(DefaultMavenProjectBuilder.java:236)
	at org.apache.maven.project.DefaultMavenProjectBuilder.buildFromRepository(DefaultMavenProjectBuilder.java:251)
	at org.apache.maven.project.DefaultMavenProjectBuilder.buildFromRepository(DefaultMavenProjectBuilder.java:258)
	at org.apache.maven.plugin.resources.remote.ProcessRemoteResourcesMojo.getProjects(ProcessRemoteResourcesMojo.java:671)
	... 34 more
Caused by: org.sonatype.aether.resolution.ArtifactResolutionException: Could not transfer
artifact org.apache.xerces:xercesImpl:pom:2.11.0 from/to sonatype (https://oss.sonatype.org/content/repositories/releases/):
peer not authenticated
	at org.sonatype.aether.impl.internal.DefaultArtifactResolver.resolve(DefaultArtifactResolver.java:538)
	at org.sonatype.aether.impl.internal.DefaultArtifactResolver.resolveArtifacts(DefaultArtifactResolver.java:216)
	at org.sonatype.aether.impl.internal.DefaultArtifactResolver.resolveArtifact(DefaultArtifactResolver.java:193)
	at org.sonatype.aether.impl.internal.DefaultRepositorySystem.resolveArtifact(DefaultRepositorySystem.java:286)
	at org.apache.maven.project.DefaultProjectBuilder.build(DefaultProjectBuilder.java:285)
	... 38 more
Caused by: org.sonatype.aether.transfer.ArtifactTransferException: Could not transfer artifact
org.apache.xerces:xercesImpl:pom:2.11.0 from/to sonatype (https://oss.sonatype.org/content/repositories/releases/):
peer not authenticated
	at org.sonatype.aether.connector.wagon.WagonRepositoryConnector$4.wrap(WagonRepositoryConnector.java:951)
	at org.sonatype.aether.connector.wagon.WagonRepositoryConnector$4.wrap(WagonRepositoryConnector.java:941)
	at org.sonatype.aether.connector.wagon.WagonRepositoryConnector$GetTask.run(WagonRepositoryConnector.java:669)
	at org.sonatype.aether.util.concurrency.RunnableErrorForwarder$1.run(RunnableErrorForwarder.java:60)
	... 3 more
Caused by: org.apache.maven.wagon.TransferFailedException: peer not authenticated
	at org.apache.maven.wagon.shared.http4.AbstractHttpClientWagon.resourceExists(AbstractHttpClientWagon.java:669)
	at org.sonatype.aether.connector.wagon.WagonRepositoryConnector$GetTask.run(WagonRepositoryConnector.java:577)
	... 4 more
Caused by: javax.net.ssl.SSLPeerUnverifiedException: peer not authenticated
	at sun.security.ssl.SSLSessionImpl.getPeerCertificates(SSLSessionImpl.java:397)
	at org.apache.maven.wagon.providers.http.httpclient.conn.ssl.AbstractVerifier.verify(AbstractVerifier.java:126)
	at org.apache.maven.wagon.providers.http.httpclient.conn.ssl.SSLSocketFactory.connectSocket(SSLSocketFactory.java:572)
	at org.apache.maven.wagon.shared.http4.ConfigurableSSLSocketFactoryDecorator.connectSocket(ConfigurableSSLSocketFactoryDecorator.java:64)
	at org.apache.maven.wagon.providers.http.httpclient.impl.conn.DefaultClientConnectionOperator.openConnection(DefaultClientConnectionOperator.java:180)
	at org.apache.maven.wagon.providers.http.httpclient.impl.conn.ManagedClientConnectionImpl.open(ManagedClientConnectionImpl.java:294)
	at org.apache.maven.wagon.providers.http.httpclient.impl.client.DefaultRequestDirector.tryConnect(DefaultRequestDirector.java:645)
	at org.apache.maven.wagon.providers.http.httpclient.impl.client.DefaultRequestDirector.execute(DefaultRequestDirector.java:480)
	at org.apache.maven.wagon.providers.http.httpclient.impl.client.AbstractHttpClient.execute(AbstractHttpClient.java:906)
	at org.apache.maven.wagon.providers.http.httpclient.impl.client.AbstractHttpClient.execute(AbstractHttpClient.java:805)
	at org.apache.maven.wagon.shared.http4.AbstractHttpClientWagon.execute(AbstractHttpClientWagon.java:746)
	at org.apache.maven.wagon.shared.http4.AbstractHttpClientWagon.resourceExists(AbstractHttpClientWagon.java:665)
	... 5 more
[ERROR] 
[ERROR] Re-run Maven using the -X switch to enable full debug logging.
[ERROR] 
[ERROR] For more information about the errors and possible solutions, please read the following
articles:
[ERROR] [Help 1] http://cwiki.apache.org/confluence/display/MAVEN/MojoExecutionException
[ERROR] 
[ERROR] After correcting the problems, you can resume the build with the command
[JENKINS] Archiving <https://buildhive.cloudbees.com/job/jclouds/job/jclouds-karaf/ws/chef/cache/pom.xml>
to org.apache.jclouds.karaf.chef/cache/2.0.0-SNAPSHOT/cache-2.0.0-SNAPSHOT.pom
[JENKINS] Archiving <https://buildhive.cloudbees.com/job/jclouds/job/jclouds-karaf/ws/chef/cache/target/cache-2.0.0-SNAPSHOT.jar>
to org.apache.jclouds.karaf.chef/cache/2.0.0-SNAPSHOT/cache-2.0.0-SNAPSHOT.jar
[ERROR]   mvn <goals> -rf :itests
[JENKINS] Archiving <https://buildhive.cloudbees.com/job/jclouds/job/jclouds-karaf/ws/core/pom.xml>
to org.apache.jclouds.karaf/core/2.0.0-SNAPSHOT/core-2.0.0-SNAPSHOT.pom
[JENKINS] Archiving <https://buildhive.cloudbees.com/job/jclouds/job/jclouds-karaf/ws/core/target/core-2.0.0-SNAPSHOT.jar>
to org.apache.jclouds.karaf/core/2.0.0-SNAPSHOT/core-2.0.0-SNAPSHOT.jar
[JENKINS] Archiving <https://buildhive.cloudbees.com/job/jclouds/job/jclouds-karaf/ws/urlhandler/pom.xml>
to org.apache.jclouds.karaf/urlhandler/2.0.0-SNAPSHOT/urlhandler-2.0.0-SNAPSHOT.pom
[JENKINS] Archiving <https://buildhive.cloudbees.com/job/jclouds/job/jclouds-karaf/ws/urlhandler/target/urlhandler-2.0.0-SNAPSHOT.jar>
to org.apache.jclouds.karaf/urlhandler/2.0.0-SNAPSHOT/urlhandler-2.0.0-SNAPSHOT.jar
[JENKINS] Archiving <https://buildhive.cloudbees.com/job/jclouds/job/jclouds-karaf/ws/chef/core/pom.xml>
to org.apache.jclouds.karaf.chef/core/2.0.0-SNAPSHOT/core-2.0.0-SNAPSHOT.pom
[JENKINS] Archiving <https://buildhive.cloudbees.com/job/jclouds/job/jclouds-karaf/ws/chef/core/target/core-2.0.0-SNAPSHOT.jar>
to org.apache.jclouds.karaf.chef/core/2.0.0-SNAPSHOT/core-2.0.0-SNAPSHOT.jar
[JENKINS] Archiving <https://buildhive.cloudbees.com/job/jclouds/job/jclouds-karaf/ws/pom.xml>
to org.apache.jclouds/jclouds-karaf/2.0.0-SNAPSHOT/jclouds-karaf-2.0.0-SNAPSHOT.pom
[JENKINS] Archiving <https://buildhive.cloudbees.com/job/jclouds/job/jclouds-karaf/ws/chef/commands/pom.xml>
to org.apache.jclouds.karaf.chef/commands/2.0.0-SNAPSHOT/commands-2.0.0-SNAPSHOT.pom
[JENKINS] Archiving <https://buildhive.cloudbees.com/job/jclouds/job/jclouds-karaf/ws/chef/commands/target/commands-2.0.0-SNAPSHOT.jar>
to org.apache.jclouds.karaf.chef/commands/2.0.0-SNAPSHOT/commands-2.0.0-SNAPSHOT.jar
[JENKINS] Archiving <https://buildhive.cloudbees.com/job/jclouds/job/jclouds-karaf/ws/utils/pom.xml>
to org.apache.jclouds.karaf/utils/2.0.0-SNAPSHOT/utils-2.0.0-SNAPSHOT.pom
[JENKINS] Archiving <https://buildhive.cloudbees.com/job/jclouds/job/jclouds-karaf/ws/utils/target/utils-2.0.0-SNAPSHOT.jar>
to org.apache.jclouds.karaf/utils/2.0.0-SNAPSHOT/utils-2.0.0-SNAPSHOT.jar
[JENKINS] Archiving <https://buildhive.cloudbees.com/job/jclouds/job/jclouds-karaf/ws/commands/pom.xml>
to org.apache.jclouds.karaf/commands/2.0.0-SNAPSHOT/commands-2.0.0-SNAPSHOT.pom
[JENKINS] Archiving <https://buildhive.cloudbees.com/job/jclouds/job/jclouds-karaf/ws/commands/target/commands-2.0.0-SNAPSHOT.jar>
to org.apache.jclouds.karaf/commands/2.0.0-SNAPSHOT/commands-2.0.0-SNAPSHOT.jar
[JENKINS] Archiving <https://buildhive.cloudbees.com/job/jclouds/job/jclouds-karaf/ws/feature/pom.xml>
to org.apache.jclouds.karaf/jclouds-karaf/2.0.0-SNAPSHOT/jclouds-karaf-2.0.0-SNAPSHOT.pom
[JENKINS] Archiving <https://buildhive.cloudbees.com/job/jclouds/job/jclouds-karaf/ws/feature/target/feature.xml>
to org.apache.jclouds.karaf/jclouds-karaf/2.0.0-SNAPSHOT/jclouds-karaf-2.0.0-SNAPSHOT-features.xml
[JENKINS] Archiving <https://buildhive.cloudbees.com/job/jclouds/job/jclouds-karaf/ws/feature/target/credentials.cfg>
to org.apache.jclouds.karaf/jclouds-karaf/2.0.0-SNAPSHOT/jclouds-karaf-2.0.0-SNAPSHOT-credentials.cfg
[JENKINS] Archiving <https://buildhive.cloudbees.com/job/jclouds/job/jclouds-karaf/ws/feature/target/shell.cfg>
to org.apache.jclouds.karaf/jclouds-karaf/2.0.0-SNAPSHOT/jclouds-karaf-2.0.0-SNAPSHOT-shell.cfg
[JENKINS] Archiving <https://buildhive.cloudbees.com/job/jclouds/job/jclouds-karaf/ws/itests/pom.xml>
to org.apache.jclouds.karaf/itests/2.0.0-SNAPSHOT/itests-2.0.0-SNAPSHOT.pom
[JENKINS] Archiving <https://buildhive.cloudbees.com/job/jclouds/job/jclouds-karaf/ws/services/pom.xml>
to org.apache.jclouds.karaf/services/2.0.0-SNAPSHOT/services-2.0.0-SNAPSHOT.pom
[JENKINS] Archiving <https://buildhive.cloudbees.com/job/jclouds/job/jclouds-karaf/ws/services/target/services-2.0.0-SNAPSHOT.jar>
to org.apache.jclouds.karaf/services/2.0.0-SNAPSHOT/services-2.0.0-SNAPSHOT.jar
[JENKINS] Archiving <https://buildhive.cloudbees.com/job/jclouds/job/jclouds-karaf/ws/recipe/pom.xml>
to org.apache.jclouds.karaf/recipe/2.0.0-SNAPSHOT/recipe-2.0.0-SNAPSHOT.pom
[JENKINS] Archiving <https://buildhive.cloudbees.com/job/jclouds/job/jclouds-karaf/ws/recipe/target/recipe-2.0.0-SNAPSHOT.jar>
to org.apache.jclouds.karaf/recipe/2.0.0-SNAPSHOT/recipe-2.0.0-SNAPSHOT.jar
[JENKINS] Archiving <https://buildhive.cloudbees.com/job/jclouds/job/jclouds-karaf/ws/cache/pom.xml>
to org.apache.jclouds.karaf/cache/2.0.0-SNAPSHOT/cache-2.0.0-SNAPSHOT.pom
[JENKINS] Archiving <https://buildhive.cloudbees.com/job/jclouds/job/jclouds-karaf/ws/cache/target/cache-2.0.0-SNAPSHOT.jar>
to org.apache.jclouds.karaf/cache/2.0.0-SNAPSHOT/cache-2.0.0-SNAPSHOT.jar
[JENKINS] Archiving <https://buildhive.cloudbees.com/job/jclouds/job/jclouds-karaf/ws/chef/pom.xml>
to org.apache.jclouds.karaf/chef/2.0.0-SNAPSHOT/chef-2.0.0-SNAPSHOT.pom
[JENKINS] Archiving <https://buildhive.cloudbees.com/job/jclouds/job/jclouds-karaf/ws/chef/services/pom.xml>
to org.apache.jclouds.karaf.chef/services/2.0.0-SNAPSHOT/services-2.0.0-SNAPSHOT.pom
[JENKINS] Archiving <https://buildhive.cloudbees.com/job/jclouds/job/jclouds-karaf/ws/chef/services/target/services-2.0.0-SNAPSHOT.jar>
to org.apache.jclouds.karaf.chef/services/2.0.0-SNAPSHOT/services-2.0.0-SNAPSHOT.jar
channel stopped

Mime
View raw message