jclouds-notifications mailing list archives

Site index · List index
Message view « Date » · « Thread »
Top « Date » · « Thread »
From BuildHive <buildhive-git...@cloudbees.com>
Subject Build failed in Jenkins: jclouds » jclouds-labs #1571
Date Wed, 01 Oct 2014 08:42:21 GMT
See <https://buildhive.cloudbees.com/job/jclouds/job/jclouds-labs/1571/changes>

Changes:

[igreenfi] Add vSphere support

[igreenfi] Remove copyright from pom.xml

[igreenfi] Organized  imports

[igreenfi] Fix checkstyle

[igreenfi] change the LICENSE header, add notice file

[igreenfield] remove all code

[igreenfield] delete file

[igreenfield] Comment out test

[igreenfield] Comment out test

[igreenfi] add gitignore

[igreenfi] Add new parameter + change chunk size

[igreenfi] Move NOTICE file

[igreenfi] delete NOTICE file

[igreenfi] move NOTICE file to the root folder

[igreenfield] Fix some issue in pom

[igreenfield] change name

[igreenfield] remove unused dependency

[igreenfield] Fix some issues from code review

[igreenfield] Fix checkstyle-result

[igreenfield] Move to Predicates2.retry

[igreenfi] Add unit tests

[igreenfi] Add API classes

[igreenfi] rename file

[igreenfi] add copyrights

[igreenfi] Change intrafaces names

[igreenfi] Add checkNotNull to constructor args

[igreenfi] minor fixes in pom

[igreenfi] remove unnecessary class

[igreenfi] Fix compilation errors

[igreenfi] Fix BUG in number of cores

[igreenfield] Add unit test

[igreenfi] Change version to correct one

[igreenfi] Add classifier to dependency.

[igreenfi] Fix powermock dependency

[igreenfi] Fix dependecies

[igreenfi] * Add some logging.

[igreenfi] * New Test

[igreenfi] * Add test.

[igreenfi] * Fix test by adding mocks

[igreenfi] * Add support for distributedVirtualSwitch.

[igreenfi] * Fix linux name

[igreenfield] new version

[igreenfi] fix disk size

[igreenfi] move to 2.0.0-SNAPSHOT

[igreenfi] move to guava 18.0-rc1

[igreenfi] change return type

[igreenfi] comment out test

[igreenfi] Add support to SCSI controller

[igreenfi] * remove copyright

[igreenfi] Some bug fixes

[igreenfi] Add recovery from wrong vm configuration

[igreenfi] * Fix BUG in NIC recovery

[igreenfi] * finished NIC recovery method

[igreenfi] * Comment out the NIC recovery alg. ( as for @if6was9 comment)

[igreenfi] * Add script on startup.

[igreenfi] * Some fixes to objects conversions

[igreenfi] * Fix issues from code review

[igreenfi] * Add ignore

[igreenfi] * Fix checkstyle

[igreenfi] * Fix issues from code review2

[igreenfi] * Add dependency to guava-retrying

[igreenfi] * comment out test

------------------------------------------
[...truncated 6674 lines...]
Downloaded: http://repo.cloudbees.com/content/repositories/central/com/google/guava/guava-parent/13.0-rc2/guava-parent-13.0-rc2.pom
(3 KB at 44.6 KB/sec)
Downloading: http://repo.cloudbees.com/content/repositories/central/com/google/guava/guava/13.0.1/guava-13.0.1.pom
Downloaded: http://repo.cloudbees.com/content/repositories/central/com/google/guava/guava/13.0.1/guava-13.0.1.pom
(6 KB at 237.3 KB/sec)
Downloading: http://repo.cloudbees.com/content/repositories/central/com/google/guava/guava-parent/13.0.1/guava-parent-13.0.1.pom
Downloaded: http://repo.cloudbees.com/content/repositories/central/com/google/guava/guava-parent/13.0.1/guava-parent-13.0.1.pom
(3 KB at 30.8 KB/sec)
Downloading: http://repo.cloudbees.com/content/repositories/central/com/google/guava/guava/14.0-rc1/guava-14.0-rc1.pom
Downloaded: http://repo.cloudbees.com/content/repositories/central/com/google/guava/guava/14.0-rc1/guava-14.0-rc1.pom
(6 KB at 107.0 KB/sec)
Downloading: http://repo.cloudbees.com/content/repositories/central/com/google/guava/guava-parent/14.0-rc1/guava-parent-14.0-rc1.pom
Downloaded: http://repo.cloudbees.com/content/repositories/central/com/google/guava/guava-parent/14.0-rc1/guava-parent-14.0-rc1.pom
(3 KB at 37.8 KB/sec)
Downloading: http://repo.cloudbees.com/content/repositories/central/com/google/guava/guava/14.0-rc2/guava-14.0-rc2.pom
Downloaded: http://repo.cloudbees.com/content/repositories/central/com/google/guava/guava/14.0-rc2/guava-14.0-rc2.pom
(6 KB at 78.4 KB/sec)
Downloading: http://repo.cloudbees.com/content/repositories/central/com/google/guava/guava-parent/14.0-rc2/guava-parent-14.0-rc2.pom
Downloaded: http://repo.cloudbees.com/content/repositories/central/com/google/guava/guava-parent/14.0-rc2/guava-parent-14.0-rc2.pom
(3 KB at 62.4 KB/sec)
Downloading: http://repo.cloudbees.com/content/repositories/central/com/google/guava/guava/14.0-rc3/guava-14.0-rc3.pom
Downloaded: http://repo.cloudbees.com/content/repositories/central/com/google/guava/guava/14.0-rc3/guava-14.0-rc3.pom
(6 KB at 75.0 KB/sec)
Downloading: http://repo.cloudbees.com/content/repositories/central/com/google/guava/guava-parent/14.0-rc3/guava-parent-14.0-rc3.pom
Downloaded: http://repo.cloudbees.com/content/repositories/central/com/google/guava/guava-parent/14.0-rc3/guava-parent-14.0-rc3.pom
(3 KB at 58.1 KB/sec)
Downloading: http://repo.cloudbees.com/content/repositories/central/com/google/guava/guava/14.0/guava-14.0.pom
Downloaded: http://repo.cloudbees.com/content/repositories/central/com/google/guava/guava/14.0/guava-14.0.pom
(6 KB at 128.0 KB/sec)
Downloading: http://repo.cloudbees.com/content/repositories/central/com/google/guava/guava-parent/14.0/guava-parent-14.0.pom
Downloaded: http://repo.cloudbees.com/content/repositories/central/com/google/guava/guava-parent/14.0/guava-parent-14.0.pom
(3 KB at 65.6 KB/sec)
Downloading: http://repo.cloudbees.com/content/repositories/central/com/google/guava/guava/14.0.1/guava-14.0.1.pom
Downloaded: http://repo.cloudbees.com/content/repositories/central/com/google/guava/guava/14.0.1/guava-14.0.1.pom
(6 KB at 250.0 KB/sec)
Downloading: http://repo.cloudbees.com/content/repositories/central/com/google/guava/guava-parent/14.0.1/guava-parent-14.0.1.pom
Downloaded: http://repo.cloudbees.com/content/repositories/central/com/google/guava/guava-parent/14.0.1/guava-parent-14.0.1.pom
(3 KB at 96.0 KB/sec)
Downloading: http://repo.cloudbees.com/content/repositories/central/com/google/guava/guava/15.0-rc1/guava-15.0-rc1.pom
Downloaded: http://repo.cloudbees.com/content/repositories/central/com/google/guava/guava/15.0-rc1/guava-15.0-rc1.pom
(7 KB at 130.0 KB/sec)
Downloading: http://repo.cloudbees.com/content/repositories/central/com/google/guava/guava-parent/15.0-rc1/guava-parent-15.0-rc1.pom
Downloaded: http://repo.cloudbees.com/content/repositories/central/com/google/guava/guava-parent/15.0-rc1/guava-parent-15.0-rc1.pom
(8 KB at 88.5 KB/sec)
Downloading: http://repo.cloudbees.com/content/repositories/central/com/google/code/findbugs/jsr305/2.0.2/jsr305-2.0.2.pom
Downloaded: http://repo.cloudbees.com/content/repositories/central/com/google/code/findbugs/jsr305/2.0.2/jsr305-2.0.2.pom
(964 B at 17.8 KB/sec)
[WARNING] The artifact org.apache.commons:commons-io:jar:1.3.2 has been relocated to commons-io:commons-io:jar:1.3.2
Downloading: http://repo.cloudbees.com/content/repositories/central/com/google/code/findbugs/jsr305/2.0.2/jsr305-2.0.2.jar
Downloading: http://repo.cloudbees.com/content/repositories/central/com/github/rholder/guava-retrying/1.0.6/guava-retrying-1.0.6.jar
Downloaded: http://repo.cloudbees.com/content/repositories/central/com/google/code/findbugs/jsr305/2.0.2/jsr305-2.0.2.jar
(32 KB at 227.1 KB/sec)
Downloaded: http://repo.cloudbees.com/content/repositories/central/com/github/rholder/guava-retrying/1.0.6/guava-retrying-1.0.6.jar
(26 KB at 187.5 KB/sec)
[INFO] 
[INFO] --- maven-clean-plugin:2.5:clean (default-clean) @ vsphere ---
[INFO] 
[INFO] --- maven-enforcer-plugin:1.1.1:enforce (enforce-banned-dependencies) @ vsphere ---
[INFO] 
[INFO] --- maven-enforcer-plugin:1.1.1:enforce (enforce-java) @ vsphere ---
[INFO] 
[INFO] --- maven-checkstyle-plugin:2.12.1:check (checkstyle) @ vsphere ---
[INFO] 
[INFO] 
[INFO] --- maven-checkstyle-plugin:2.12.1:check (default) @ vsphere ---
[INFO] 
[INFO] 
[INFO] --- maven-remote-resources-plugin:1.5:process (default) @ vsphere ---
[INFO] artifact com.google.guava:guava: checking for updates from central
[INFO] artifact com.google.guava:guava: checking for updates from central
[INFO] artifact net.schmizz:sshj: checking for updates from central
[INFO] artifact net.schmizz:sshj: checking for updates from jclouds-sona-snapshots-nexus
[WARNING] While downloading org.apache.commons:commons-io:1.3.2
  This artifact has been relocated to commons-io:commons-io:1.3.2.
  https://issues.sonatype.org/browse/MVNCENTRAL-244


[INFO] artifact com.google.guava:guava: checking for updates from central
[INFO] 
[INFO] --- maven-resources-plugin:2.6:resources (default-resources) @ vsphere ---
[INFO] Using 'UTF-8' encoding to copy filtered resources.
[INFO] skip non existing resourceDirectory <https://buildhive.cloudbees.com/job/jclouds/job/jclouds-labs/ws/vsphere/src/main/clojure>
[INFO] Copying 2 resources
[INFO] Copying 3 resources
[INFO] 
[INFO] --- maven-compiler-plugin:3.1:compile (default-compile) @ vsphere ---
[INFO] Changes detected - recompiling the module!
[INFO] Compiling 59 source files to <https://buildhive.cloudbees.com/job/jclouds/job/jclouds-labs/ws/vsphere/target/classes>
[INFO] -------------------------------------------------------------
[WARNING] COMPILATION WARNING : 
[INFO] -------------------------------------------------------------
[WARNING] <https://buildhive.cloudbees.com/job/jclouds/job/jclouds-labs/ws/vsphere/src/main/java/org/jclouds/vsphere/compute/config/VSphereComputeServiceContextModule.java>:
<https://buildhive.cloudbees.com/job/jclouds/job/jclouds-labs/ws/vsphere/src/main/java/org/jclouds/vsphere/compute/config/VSphereComputeServiceContextModule.java>
uses unchecked or unsafe operations.
[WARNING] <https://buildhive.cloudbees.com/job/jclouds/job/jclouds-labs/ws/vsphere/src/main/java/org/jclouds/vsphere/compute/config/VSphereComputeServiceContextModule.java>:
Recompile with -Xlint:unchecked for details.
[INFO] 2 warnings 
[INFO] -------------------------------------------------------------
[INFO] -------------------------------------------------------------
[ERROR] COMPILATION ERROR : 
[INFO] -------------------------------------------------------------
[ERROR] <https://buildhive.cloudbees.com/job/jclouds/job/jclouds-labs/ws/vsphere/src/main/java/org/jclouds/vsphere/compute/options/VSphereTemplateOptions.java>:[19,30]
cannot find symbol
  symbol:   class MoreObjects
  location: package com.google.common.base
[ERROR] <https://buildhive.cloudbees.com/job/jclouds/job/jclouds-labs/ws/vsphere/src/main/java/org/jclouds/vsphere/compute/options/VSphereTemplateOptions.java>:[138,22]
package MoreObjects does not exist
[ERROR] <https://buildhive.cloudbees.com/job/jclouds/job/jclouds-labs/ws/vsphere/src/main/java/org/jclouds/vsphere/compute/options/VSphereTemplateOptions.java>:[139,26]
cannot access com.google.common.base.MoreObjects.ToStringHelper
  class file for com.google.common.base.MoreObjects$ToStringHelper not found
[INFO] 3 errors 
[INFO] -------------------------------------------------------------
[INFO] ------------------------------------------------------------------------
[INFO] Reactor Summary:
[INFO] 
[INFO] Apache jclouds labs ............................... SUCCESS [52.090s]
[INFO] jclouds docker API ................................ SUCCESS [1:20.410s]
[INFO] jclouds virtualbox api ............................ SUCCESS [1:22.063s]
[INFO] jclouds dmtf domain objects ....................... SUCCESS [8.740s]
[INFO] jclouds vcloud-director api ....................... SUCCESS [2:15.211s]
[INFO] jclouds cdmi api .................................. SUCCESS [20.911s]
[INFO] jclouds CloudSigma v2 API ......................... SUCCESS [1:20.108s]
[INFO] jclouds CloudSigma v2 Las Vegas Provider .......... SUCCESS [6.309s]
[INFO] jclouds CloudSigma v2 Washington DC Provider ...... SUCCESS [4.684s]
[INFO] jclouds CloudSigma v2 Zurich Provider ............. SUCCESS [4.760s]
[INFO] jclouds DigitalOcean Provider ..................... SUCCESS [1:33.209s]
[INFO] jclouds joyent-cloudapi api ....................... SUCCESS [42.158s]
[INFO] jclouds joyentcloud provider ...................... SUCCESS [7.714s]
[INFO] jclouds Fujitsu Global Cloud Platform ............. SUCCESS [2:02.803s]
[INFO] jclouds Fujitsu Global Cloud Platform AU provider . SUCCESS [8.321s]
[INFO] jclouds Fujitsu Global Cloud Platform DE provider . SUCCESS [10.098s]
[INFO] jclouds Abiquo api ................................ SUCCESS [2:55.832s]
[INFO] jclouds :: representations ........................ SUCCESS [2.283s]
[INFO] jclouds :: representations :: core ................ SUCCESS [7.936s]
[INFO] jclouds :: representations :: codec ............... SUCCESS [22.728s]
[INFO] jclouds :: management ............................. SUCCESS [1.918s]
[INFO] jclouds :: management :: core ..................... SUCCESS [13.058s]
[INFO] jclouds :: management :: compute .................. SUCCESS [3.784s]
[INFO] jclouds :: management :: blobstore ................ SUCCESS [3.367s]
[INFO] jclouds vSphere api ............................... FAILURE [10.838s]
[INFO] ------------------------------------------------------------------------
[INFO] BUILD FAILURE
[INFO] ------------------------------------------------------------------------
[INFO] Total time: 17:00.183s
[INFO] Finished at: Wed Oct 01 08:42:10 UTC 2014
[INFO] Final Memory: 60M/184M
[INFO] ------------------------------------------------------------------------
Waiting for Jenkins to finish collecting data
[JENKINS] Archiving <https://buildhive.cloudbees.com/job/jclouds/job/jclouds-labs/ws/cloudsigma2/pom.xml>
to org.apache.jclouds.labs/cloudsigma2/2.0.0-SNAPSHOT/cloudsigma2-2.0.0-SNAPSHOT.pom
[JENKINS] Archiving <https://buildhive.cloudbees.com/job/jclouds/job/jclouds-labs/ws/cloudsigma2/target/cloudsigma2-2.0.0-SNAPSHOT.jar>
to org.apache.jclouds.labs/cloudsigma2/2.0.0-SNAPSHOT/cloudsigma2-2.0.0-SNAPSHOT.jar
[JENKINS] Archiving <https://buildhive.cloudbees.com/job/jclouds/job/jclouds-labs/ws/cloudsigma2/target/cloudsigma2-2.0.0-SNAPSHOT-tests.jar>
to org.apache.jclouds.labs/cloudsigma2/2.0.0-SNAPSHOT/cloudsigma2-2.0.0-SNAPSHOT-tests.jar
[ERROR] Failed to execute goal org.apache.maven.plugins:maven-compiler-plugin:3.1:compile
(default-compile) on project vsphere: Compilation failure: Compilation failure:
[ERROR] <https://buildhive.cloudbees.com/job/jclouds/job/jclouds-labs/ws/vsphere/src/main/java/org/jclouds/vsphere/compute/options/VSphereTemplateOptions.java>:[19,30]
cannot find symbol
[ERROR] symbol:   class MoreObjects
[ERROR] location: package com.google.common.base
[ERROR] <https://buildhive.cloudbees.com/job/jclouds/job/jclouds-labs/ws/vsphere/src/main/java/org/jclouds/vsphere/compute/options/VSphereTemplateOptions.java>:[138,22]
package MoreObjects does not exist
[ERROR] <https://buildhive.cloudbees.com/job/jclouds/job/jclouds-labs/ws/vsphere/src/main/java/org/jclouds/vsphere/compute/options/VSphereTemplateOptions.java>:[139,26]
cannot access com.google.common.base.MoreObjects.ToStringHelper
[ERROR] class file for com.google.common.base.MoreObjects$ToStringHelper not found
[ERROR] -> [Help 1]
org.apache.maven.lifecycle.LifecycleExecutionException: Failed to execute goal org.apache.maven.plugins:maven-compiler-plugin:3.1:compile
(default-compile) on project vsphere: Compilation failure
	at org.apache.maven.lifecycle.internal.MojoExecutor.execute(MojoExecutor.java:213)
	at org.apache.maven.lifecycle.internal.MojoExecutor.execute(MojoExecutor.java:153)
	at org.apache.maven.lifecycle.internal.MojoExecutor.execute(MojoExecutor.java:145)
	at org.apache.maven.lifecycle.internal.LifecycleModuleBuilder.buildProject(LifecycleModuleBuilder.java:84)
	at org.apache.maven.lifecycle.internal.LifecycleModuleBuilder.buildProject(LifecycleModuleBuilder.java:59)
	at org.apache.maven.lifecycle.internal.LifecycleStarter.singleThreadedBuild(LifecycleStarter.java:183)
	at org.apache.maven.lifecycle.internal.LifecycleStarter.execute(LifecycleStarter.java:161)
	at org.apache.maven.DefaultMaven.doExecute(DefaultMaven.java:320)
	at org.apache.maven.DefaultMaven.execute(DefaultMaven.java:156)
	at org.jvnet.hudson.maven3.launcher.Maven3Launcher.main(Maven3Launcher.java:117)
	at sun.reflect.NativeMethodAccessorImpl.invoke0(Native Method)
	at sun.reflect.NativeMethodAccessorImpl.invoke(NativeMethodAccessorImpl.java:57)
	at sun.reflect.DelegatingMethodAccessorImpl.invoke(DelegatingMethodAccessorImpl.java:43)
	at java.lang.reflect.Method.invoke(Method.java:606)
	at org.codehaus.plexus.classworlds.launcher.Launcher.launchStandard(Launcher.java:329)
	at org.codehaus.plexus.classworlds.launcher.Launcher.launch(Launcher.java:239)
	at org.jvnet.hudson.maven3.agent.Maven3Main.launch(Maven3Main.java:178)
	at sun.reflect.NativeMethodAccessorImpl.invoke0(Native Method)
	at sun.reflect.NativeMethodAccessorImpl.invoke(NativeMethodAccessorImpl.java:57)
	at sun.reflect.DelegatingMethodAccessorImpl.invoke(DelegatingMethodAccessorImpl.java:43)
	at java.lang.reflect.Method.invoke(Method.java:606)
	at hudson.maven.Maven3Builder.call(Maven3Builder.java:134)
	at hudson.maven.Maven3Builder.call(Maven3Builder.java:69)
	at hudson.remoting.UserRequest.perform(UserRequest.java:118)
	at hudson.remoting.UserRequest.perform(UserRequest.java:48)
	at hudson.remoting.Request$2.run(Request.java:328)
	at hudson.remoting.InterceptingExecutorService$1.call(InterceptingExecutorService.java:72)
	at java.util.concurrent.FutureTask.run(FutureTask.java:262)
	at java.util.concurrent.ThreadPoolExecutor.runWorker(ThreadPoolExecutor.java:1145)
	at java.util.concurrent.ThreadPoolExecutor$Worker.run(ThreadPoolExecutor.java:615)
	at java.lang.Thread.run(Thread.java:744)
Caused by: org.apache.maven.plugin.compiler.CompilationFailureException: Compilation failure
	at org.apache.maven.plugin.compiler.AbstractCompilerMojo.execute(AbstractCompilerMojo.java:858)
	at org.apache.maven.plugin.compiler.CompilerMojo.execute(CompilerMojo.java:129)
	at org.apache.maven.plugin.DefaultBuildPluginManager.executeMojo(DefaultBuildPluginManager.java:101)
	at org.apache.maven.lifecycle.internal.MojoExecutor.execute(MojoExecutor.java:209)
	... 30 more
[ERROR] 
[ERROR] Re-run Maven using the -X switch to enable full debug logging.
[ERROR] 
[ERROR] For more information about the errors and possible solutions, please read the following
articles:
[ERROR] [Help 1] http://cwiki.apache.org/confluence/display/MAVEN/MojoFailureException
[ERROR] 
[ERROR] After correcting the problems, you can resume the build with the command
[ERROR]   mvn <goals> -rf :vsphere
[JENKINS] Archiving <https://buildhive.cloudbees.com/job/jclouds/job/jclouds-labs/ws/joyent-cloudapi/pom.xml>
to org.apache.jclouds.labs/joyent-cloudapi/2.0.0-SNAPSHOT/joyent-cloudapi-2.0.0-SNAPSHOT.pom
[JENKINS] Archiving <https://buildhive.cloudbees.com/job/jclouds/job/jclouds-labs/ws/joyent-cloudapi/target/joyent-cloudapi-2.0.0-SNAPSHOT.jar>
to org.apache.jclouds.labs/joyent-cloudapi/2.0.0-SNAPSHOT/joyent-cloudapi-2.0.0-SNAPSHOT.jar
[JENKINS] Archiving <https://buildhive.cloudbees.com/job/jclouds/job/jclouds-labs/ws/joyent-cloudapi/target/joyent-cloudapi-2.0.0-SNAPSHOT-tests.jar>
to org.apache.jclouds.labs/joyent-cloudapi/2.0.0-SNAPSHOT/joyent-cloudapi-2.0.0-SNAPSHOT-tests.jar
[JENKINS] Archiving <https://buildhive.cloudbees.com/job/jclouds/job/jclouds-labs/ws/cloudsigma2-zrh/pom.xml>
to org.apache.jclouds.labs/cloudsigma2-zrh/2.0.0-SNAPSHOT/cloudsigma2-zrh-2.0.0-SNAPSHOT.pom
[JENKINS] Archiving <https://buildhive.cloudbees.com/job/jclouds/job/jclouds-labs/ws/cloudsigma2-zrh/target/cloudsigma2-zrh-2.0.0-SNAPSHOT.jar>
to org.apache.jclouds.labs/cloudsigma2-zrh/2.0.0-SNAPSHOT/cloudsigma2-zrh-2.0.0-SNAPSHOT.jar
[JENKINS] Archiving <https://buildhive.cloudbees.com/job/jclouds/job/jclouds-labs/ws/cloudsigma2-zrh/target/cloudsigma2-zrh-2.0.0-SNAPSHOT-tests.jar>
to org.apache.jclouds.labs/cloudsigma2-zrh/2.0.0-SNAPSHOT/cloudsigma2-zrh-2.0.0-SNAPSHOT-tests.jar
[JENKINS] Archiving <https://buildhive.cloudbees.com/job/jclouds/job/jclouds-labs/ws/docker/pom.xml>
to org.apache.jclouds.labs/docker/2.0.0-SNAPSHOT/docker-2.0.0-SNAPSHOT.pom
[JENKINS] Archiving <https://buildhive.cloudbees.com/job/jclouds/job/jclouds-labs/ws/docker/target/docker-2.0.0-SNAPSHOT.jar>
to org.apache.jclouds.labs/docker/2.0.0-SNAPSHOT/docker-2.0.0-SNAPSHOT.jar
[JENKINS] Archiving <https://buildhive.cloudbees.com/job/jclouds/job/jclouds-labs/ws/docker/target/docker-2.0.0-SNAPSHOT-tests.jar>
to org.apache.jclouds.labs/docker/2.0.0-SNAPSHOT/docker-2.0.0-SNAPSHOT-tests.jar
[JENKINS] Archiving <https://buildhive.cloudbees.com/job/jclouds/job/jclouds-labs/ws/pom.xml>
to org.apache.jclouds.labs/jclouds-labs/2.0.0-SNAPSHOT/jclouds-labs-2.0.0-SNAPSHOT.pom
[JENKINS] Archiving <https://buildhive.cloudbees.com/job/jclouds/job/jclouds-labs/ws/target/jclouds-labs-2.0.0-SNAPSHOT-tests.jar>
to org.apache.jclouds.labs/jclouds-labs/2.0.0-SNAPSHOT/jclouds-labs-2.0.0-SNAPSHOT-tests.jar
[JENKINS] Archiving <https://buildhive.cloudbees.com/job/jclouds/job/jclouds-labs/ws/vcloud-director/pom.xml>
to org.apache.jclouds.labs/vcloud-director/2.0.0-SNAPSHOT/vcloud-director-2.0.0-SNAPSHOT.pom
[JENKINS] Archiving <https://buildhive.cloudbees.com/job/jclouds/job/jclouds-labs/ws/vcloud-director/target/vcloud-director-2.0.0-SNAPSHOT.jar>
to org.apache.jclouds.labs/vcloud-director/2.0.0-SNAPSHOT/vcloud-director-2.0.0-SNAPSHOT.jar
[JENKINS] Archiving <https://buildhive.cloudbees.com/job/jclouds/job/jclouds-labs/ws/vcloud-director/target/vcloud-director-2.0.0-SNAPSHOT-tests.jar>
to org.apache.jclouds.labs/vcloud-director/2.0.0-SNAPSHOT/vcloud-director-2.0.0-SNAPSHOT-tests.jar
[JENKINS] Archiving <https://buildhive.cloudbees.com/job/jclouds/job/jclouds-labs/ws/jclouds-representations/pom.xml>
to org.apache.jclouds.labs/jclouds-representations/2.0.0-SNAPSHOT/jclouds-representations-2.0.0-SNAPSHOT.pom
[JENKINS] Archiving <https://buildhive.cloudbees.com/job/jclouds/job/jclouds-labs/ws/jclouds-representations/target/jclouds-representations-2.0.0-SNAPSHOT-tests.jar>
to org.apache.jclouds.labs/jclouds-representations/2.0.0-SNAPSHOT/jclouds-representations-2.0.0-SNAPSHOT-tests.jar
[JENKINS] Archiving <https://buildhive.cloudbees.com/job/jclouds/job/jclouds-labs/ws/virtualbox/pom.xml>
to org.apache.jclouds.labs/virtualbox/2.0.0-SNAPSHOT/virtualbox-2.0.0-SNAPSHOT.pom
[JENKINS] Archiving <https://buildhive.cloudbees.com/job/jclouds/job/jclouds-labs/ws/virtualbox/target/virtualbox-2.0.0-SNAPSHOT.jar>
to org.apache.jclouds.labs/virtualbox/2.0.0-SNAPSHOT/virtualbox-2.0.0-SNAPSHOT.jar
[JENKINS] Archiving <https://buildhive.cloudbees.com/job/jclouds/job/jclouds-labs/ws/virtualbox/target/virtualbox-2.0.0-SNAPSHOT-tests.jar>
to org.apache.jclouds.labs/virtualbox/2.0.0-SNAPSHOT/virtualbox-2.0.0-SNAPSHOT-tests.jar
[JENKINS] Archiving <https://buildhive.cloudbees.com/job/jclouds/job/jclouds-labs/ws/dmtf/pom.xml>
to org.apache.jclouds.labs/dmtf/2.0.0-SNAPSHOT/dmtf-2.0.0-SNAPSHOT.pom
[JENKINS] Archiving <https://buildhive.cloudbees.com/job/jclouds/job/jclouds-labs/ws/dmtf/target/dmtf-2.0.0-SNAPSHOT.jar>
to org.apache.jclouds.labs/dmtf/2.0.0-SNAPSHOT/dmtf-2.0.0-SNAPSHOT.jar
[JENKINS] Archiving <https://buildhive.cloudbees.com/job/jclouds/job/jclouds-labs/ws/dmtf/target/dmtf-2.0.0-SNAPSHOT-tests.jar>
to org.apache.jclouds.labs/dmtf/2.0.0-SNAPSHOT/dmtf-2.0.0-SNAPSHOT-tests.jar
[JENKINS] Archiving <https://buildhive.cloudbees.com/job/jclouds/job/jclouds-labs/ws/vsphere/pom.xml>
to org.apache.jclouds.labs/vsphere/2.0.0-SNAPSHOT/vsphere-2.0.0-SNAPSHOT.pom
[JENKINS] Archiving <https://buildhive.cloudbees.com/job/jclouds/job/jclouds-labs/ws/joyentcloud/pom.xml>
to org.apache.jclouds.labs/joyentcloud/2.0.0-SNAPSHOT/joyentcloud-2.0.0-SNAPSHOT.pom
[JENKINS] Archiving <https://buildhive.cloudbees.com/job/jclouds/job/jclouds-labs/ws/joyentcloud/target/joyentcloud-2.0.0-SNAPSHOT.jar>
to org.apache.jclouds.labs/joyentcloud/2.0.0-SNAPSHOT/joyentcloud-2.0.0-SNAPSHOT.jar
[JENKINS] Archiving <https://buildhive.cloudbees.com/job/jclouds/job/jclouds-labs/ws/joyentcloud/target/joyentcloud-2.0.0-SNAPSHOT-tests.jar>
to org.apache.jclouds.labs/joyentcloud/2.0.0-SNAPSHOT/joyentcloud-2.0.0-SNAPSHOT-tests.jar
[JENKINS] Archiving <https://buildhive.cloudbees.com/job/jclouds/job/jclouds-labs/ws/cloudsigma2-lvs/pom.xml>
to org.apache.jclouds.labs/cloudsigma2-lvs/2.0.0-SNAPSHOT/cloudsigma2-lvs-2.0.0-SNAPSHOT.pom
[JENKINS] Archiving <https://buildhive.cloudbees.com/job/jclouds/job/jclouds-labs/ws/cloudsigma2-lvs/target/cloudsigma2-lvs-2.0.0-SNAPSHOT.jar>
to org.apache.jclouds.labs/cloudsigma2-lvs/2.0.0-SNAPSHOT/cloudsigma2-lvs-2.0.0-SNAPSHOT.jar
[JENKINS] Archiving <https://buildhive.cloudbees.com/job/jclouds/job/jclouds-labs/ws/cloudsigma2-lvs/target/cloudsigma2-lvs-2.0.0-SNAPSHOT-tests.jar>
to org.apache.jclouds.labs/cloudsigma2-lvs/2.0.0-SNAPSHOT/cloudsigma2-lvs-2.0.0-SNAPSHOT-tests.jar
[JENKINS] Archiving <https://buildhive.cloudbees.com/job/jclouds/job/jclouds-labs/ws/jclouds-management/management-blobstore/pom.xml>
to org.apache.jclouds.labs.management/management-blobstore/2.0.0-SNAPSHOT/management-blobstore-2.0.0-SNAPSHOT.pom
[JENKINS] Archiving <https://buildhive.cloudbees.com/job/jclouds/job/jclouds-labs/ws/jclouds-management/management-blobstore/target/management-blobstore-2.0.0-SNAPSHOT.jar>
to org.apache.jclouds.labs.management/management-blobstore/2.0.0-SNAPSHOT/management-blobstore-2.0.0-SNAPSHOT.jar
[JENKINS] Archiving <https://buildhive.cloudbees.com/job/jclouds/job/jclouds-labs/ws/jclouds-management/management-blobstore/target/management-blobstore-2.0.0-SNAPSHOT-tests.jar>
to org.apache.jclouds.labs.management/management-blobstore/2.0.0-SNAPSHOT/management-blobstore-2.0.0-SNAPSHOT-tests.jar
[JENKINS] Archiving <https://buildhive.cloudbees.com/job/jclouds/job/jclouds-labs/ws/jclouds-management/management-core/pom.xml>
to org.apache.jclouds.labs.management/management-core/2.0.0-SNAPSHOT/management-core-2.0.0-SNAPSHOT.pom
[JENKINS] Archiving <https://buildhive.cloudbees.com/job/jclouds/job/jclouds-labs/ws/jclouds-management/management-core/target/management-core-2.0.0-SNAPSHOT.jar>
to org.apache.jclouds.labs.management/management-core/2.0.0-SNAPSHOT/management-core-2.0.0-SNAPSHOT.jar
[JENKINS] Archiving <https://buildhive.cloudbees.com/job/jclouds/job/jclouds-labs/ws/jclouds-management/management-core/target/management-core-2.0.0-SNAPSHOT-tests.jar>
to org.apache.jclouds.labs.management/management-core/2.0.0-SNAPSHOT/management-core-2.0.0-SNAPSHOT-tests.jar
[JENKINS] Archiving <https://buildhive.cloudbees.com/job/jclouds/job/jclouds-labs/ws/cdmi/pom.xml>
to org.apache.jclouds.labs/cdmi/2.0.0-SNAPSHOT/cdmi-2.0.0-SNAPSHOT.pom
[JENKINS] Archiving <https://buildhive.cloudbees.com/job/jclouds/job/jclouds-labs/ws/cdmi/target/cdmi-2.0.0-SNAPSHOT.jar>
to org.apache.jclouds.labs/cdmi/2.0.0-SNAPSHOT/cdmi-2.0.0-SNAPSHOT.jar
[JENKINS] Archiving <https://buildhive.cloudbees.com/job/jclouds/job/jclouds-labs/ws/cdmi/target/cdmi-2.0.0-SNAPSHOT-tests.jar>
to org.apache.jclouds.labs/cdmi/2.0.0-SNAPSHOT/cdmi-2.0.0-SNAPSHOT-tests.jar
[JENKINS] Archiving <https://buildhive.cloudbees.com/job/jclouds/job/jclouds-labs/ws/jclouds-representations/representations-core/pom.xml>
to org.apache.jclouds.labs.representations/representations-core/2.0.0-SNAPSHOT/representations-core-2.0.0-SNAPSHOT.pom
[JENKINS] Archiving <https://buildhive.cloudbees.com/job/jclouds/job/jclouds-labs/ws/jclouds-representations/representations-core/target/representations-core-2.0.0-SNAPSHOT.jar>
to org.apache.jclouds.labs.representations/representations-core/2.0.0-SNAPSHOT/representations-core-2.0.0-SNAPSHOT.jar
[JENKINS] Archiving <https://buildhive.cloudbees.com/job/jclouds/job/jclouds-labs/ws/jclouds-representations/representations-core/target/representations-core-2.0.0-SNAPSHOT-tests.jar>
to org.apache.jclouds.labs.representations/representations-core/2.0.0-SNAPSHOT/representations-core-2.0.0-SNAPSHOT-tests.jar
[JENKINS] Archiving <https://buildhive.cloudbees.com/job/jclouds/job/jclouds-labs/ws/fgcp-au/pom.xml>
to org.apache.jclouds.labs/fgcp-au/2.0.0-SNAPSHOT/fgcp-au-2.0.0-SNAPSHOT.pom
[JENKINS] Archiving <https://buildhive.cloudbees.com/job/jclouds/job/jclouds-labs/ws/fgcp-au/target/fgcp-au-2.0.0-SNAPSHOT.jar>
to org.apache.jclouds.labs/fgcp-au/2.0.0-SNAPSHOT/fgcp-au-2.0.0-SNAPSHOT.jar
[JENKINS] Archiving <https://buildhive.cloudbees.com/job/jclouds/job/jclouds-labs/ws/fgcp-au/target/fgcp-au-2.0.0-SNAPSHOT-tests.jar>
to org.apache.jclouds.labs/fgcp-au/2.0.0-SNAPSHOT/fgcp-au-2.0.0-SNAPSHOT-tests.jar
[JENKINS] Archiving <https://buildhive.cloudbees.com/job/jclouds/job/jclouds-labs/ws/cloudsigma2-wdc/pom.xml>
to org.apache.jclouds.labs/cloudsigma2-wdc/2.0.0-SNAPSHOT/cloudsigma2-wdc-2.0.0-SNAPSHOT.pom
[JENKINS] Archiving <https://buildhive.cloudbees.com/job/jclouds/job/jclouds-labs/ws/cloudsigma2-wdc/target/cloudsigma2-wdc-2.0.0-SNAPSHOT.jar>
to org.apache.jclouds.labs/cloudsigma2-wdc/2.0.0-SNAPSHOT/cloudsigma2-wdc-2.0.0-SNAPSHOT.jar
[JENKINS] Archiving <https://buildhive.cloudbees.com/job/jclouds/job/jclouds-labs/ws/cloudsigma2-wdc/target/cloudsigma2-wdc-2.0.0-SNAPSHOT-tests.jar>
to org.apache.jclouds.labs/cloudsigma2-wdc/2.0.0-SNAPSHOT/cloudsigma2-wdc-2.0.0-SNAPSHOT-tests.jar
[JENKINS] Archiving <https://buildhive.cloudbees.com/job/jclouds/job/jclouds-labs/ws/jclouds-management/pom.xml>
to org.apache.jclouds.labs/jclouds-management/2.0.0-SNAPSHOT/jclouds-management-2.0.0-SNAPSHOT.pom
[JENKINS] Archiving <https://buildhive.cloudbees.com/job/jclouds/job/jclouds-labs/ws/jclouds-management/target/jclouds-management-2.0.0-SNAPSHOT-tests.jar>
to org.apache.jclouds.labs/jclouds-management/2.0.0-SNAPSHOT/jclouds-management-2.0.0-SNAPSHOT-tests.jar
[JENKINS] Archiving <https://buildhive.cloudbees.com/job/jclouds/job/jclouds-labs/ws/fgcp-de/pom.xml>
to org.apache.jclouds.labs/fgcp-de/2.0.0-SNAPSHOT/fgcp-de-2.0.0-SNAPSHOT.pom
[JENKINS] Archiving <https://buildhive.cloudbees.com/job/jclouds/job/jclouds-labs/ws/fgcp-de/target/fgcp-de-2.0.0-SNAPSHOT.jar>
to org.apache.jclouds.labs/fgcp-de/2.0.0-SNAPSHOT/fgcp-de-2.0.0-SNAPSHOT.jar
[JENKINS] Archiving <https://buildhive.cloudbees.com/job/jclouds/job/jclouds-labs/ws/fgcp-de/target/fgcp-de-2.0.0-SNAPSHOT-tests.jar>
to org.apache.jclouds.labs/fgcp-de/2.0.0-SNAPSHOT/fgcp-de-2.0.0-SNAPSHOT-tests.jar
[JENKINS] Archiving <https://buildhive.cloudbees.com/job/jclouds/job/jclouds-labs/ws/jclouds-representations/representations-codec/pom.xml>
to org.apache.jclouds.labs.representations/representations-codec/2.0.0-SNAPSHOT/representations-codec-2.0.0-SNAPSHOT.pom
[JENKINS] Archiving <https://buildhive.cloudbees.com/job/jclouds/job/jclouds-labs/ws/jclouds-representations/representations-codec/target/representations-codec-2.0.0-SNAPSHOT.jar>
to org.apache.jclouds.labs.representations/representations-codec/2.0.0-SNAPSHOT/representations-codec-2.0.0-SNAPSHOT.jar
[JENKINS] Archiving <https://buildhive.cloudbees.com/job/jclouds/job/jclouds-labs/ws/jclouds-representations/representations-codec/target/representations-codec-2.0.0-SNAPSHOT-tests.jar>
to org.apache.jclouds.labs.representations/representations-codec/2.0.0-SNAPSHOT/representations-codec-2.0.0-SNAPSHOT-tests.jar
[JENKINS] Archiving <https://buildhive.cloudbees.com/job/jclouds/job/jclouds-labs/ws/jclouds-management/management-compute/pom.xml>
to org.apache.jclouds.labs.management/management-compute/2.0.0-SNAPSHOT/management-compute-2.0.0-SNAPSHOT.pom
[JENKINS] Archiving <https://buildhive.cloudbees.com/job/jclouds/job/jclouds-labs/ws/jclouds-management/management-compute/target/management-compute-2.0.0-SNAPSHOT.jar>
to org.apache.jclouds.labs.management/management-compute/2.0.0-SNAPSHOT/management-compute-2.0.0-SNAPSHOT.jar
[JENKINS] Archiving <https://buildhive.cloudbees.com/job/jclouds/job/jclouds-labs/ws/jclouds-management/management-compute/target/management-compute-2.0.0-SNAPSHOT-tests.jar>
to org.apache.jclouds.labs.management/management-compute/2.0.0-SNAPSHOT/management-compute-2.0.0-SNAPSHOT-tests.jar
[JENKINS] Archiving <https://buildhive.cloudbees.com/job/jclouds/job/jclouds-labs/ws/digitalocean/pom.xml>
to org.apache.jclouds.labs/digitalocean/2.0.0-SNAPSHOT/digitalocean-2.0.0-SNAPSHOT.pom
[JENKINS] Archiving <https://buildhive.cloudbees.com/job/jclouds/job/jclouds-labs/ws/digitalocean/target/digitalocean-2.0.0-SNAPSHOT.jar>
to org.apache.jclouds.labs/digitalocean/2.0.0-SNAPSHOT/digitalocean-2.0.0-SNAPSHOT.jar
[JENKINS] Archiving <https://buildhive.cloudbees.com/job/jclouds/job/jclouds-labs/ws/digitalocean/target/digitalocean-2.0.0-SNAPSHOT-tests.jar>
to org.apache.jclouds.labs/digitalocean/2.0.0-SNAPSHOT/digitalocean-2.0.0-SNAPSHOT-tests.jar
[JENKINS] Archiving <https://buildhive.cloudbees.com/job/jclouds/job/jclouds-labs/ws/fgcp/pom.xml>
to org.apache.jclouds.labs/fgcp/2.0.0-SNAPSHOT/fgcp-2.0.0-SNAPSHOT.pom
[JENKINS] Archiving <https://buildhive.cloudbees.com/job/jclouds/job/jclouds-labs/ws/fgcp/target/fgcp-2.0.0-SNAPSHOT.jar>
to org.apache.jclouds.labs/fgcp/2.0.0-SNAPSHOT/fgcp-2.0.0-SNAPSHOT.jar
[JENKINS] Archiving <https://buildhive.cloudbees.com/job/jclouds/job/jclouds-labs/ws/fgcp/target/fgcp-2.0.0-SNAPSHOT-tests.jar>
to org.apache.jclouds.labs/fgcp/2.0.0-SNAPSHOT/fgcp-2.0.0-SNAPSHOT-tests.jar
[JENKINS] Archiving <https://buildhive.cloudbees.com/job/jclouds/job/jclouds-labs/ws/abiquo/pom.xml>
to org.apache.jclouds.labs/abiquo/2.0.0-SNAPSHOT/abiquo-2.0.0-SNAPSHOT.pom
[JENKINS] Archiving <https://buildhive.cloudbees.com/job/jclouds/job/jclouds-labs/ws/abiquo/target/abiquo-2.0.0-SNAPSHOT.jar>
to org.apache.jclouds.labs/abiquo/2.0.0-SNAPSHOT/abiquo-2.0.0-SNAPSHOT.jar
[JENKINS] Archiving <https://buildhive.cloudbees.com/job/jclouds/job/jclouds-labs/ws/abiquo/target/abiquo-2.0.0-SNAPSHOT-tests.jar>
to org.apache.jclouds.labs/abiquo/2.0.0-SNAPSHOT/abiquo-2.0.0-SNAPSHOT-tests.jar
channel stopped

Mime
View raw message