jclouds-notifications mailing list archives

Site index · List index
Message view « Date » · « Thread »
Top « Date » · « Thread »
From BuildHive <buildhive-git...@cloudbees.com>
Subject Build failed in Jenkins: jclouds » jclouds-labs #1731
Date Tue, 21 Oct 2014 18:22:10 GMT
See <https://buildhive.cloudbees.com/job/jclouds/job/jclouds-labs/1731/changes>

Changes:

[kulakov.ilya] CloudSigma2 ComputeService.

------------------------------------------
[...truncated 2542 lines...]
[INFO] Exclude: **/*.eml
[INFO] Exclude: **/*.ipr
[INFO] Exclude: **/*.iws
[INFO] Exclude: **/*.DS_STORE
[INFO] Exclude: **/TAGS
[INFO] Exclude: **/.metadata/**
[INFO] Exclude: **/atlassian-ide-plugin.xml
[INFO] Exclude: **/.DS_Store
[INFO] Exclude: .mailmap
[INFO] Exclude: .git/**
[INFO] Exclude: **/.gitignore
[INFO] Exclude: **/.gitattributes
[INFO] Exclude: .repository/**
[INFO] Exclude: .java-version
[INFO] Exclude: .repository/**
[INFO] Exclude: gc.log
[INFO] 127 resources included (use -debug for more details)
Warning:  org.apache.xerces.jaxp.SAXParserImpl$JAXPSAXParser: Property 'http://www.oracle.com/xml/jaxp/properties/entityExpansionLimit'
is not recognized.
Compiler warnings:
  WARNING:  'org.apache.xerces.jaxp.SAXParserImpl: Property 'http://javax.xml.XMLConstants/property/accessExternalDTD'
is not recognized.'
Warning:  org.apache.xerces.parsers.SAXParser: Feature 'http://javax.xml.XMLConstants/feature/secure-processing'
is not recognized.
Warning:  org.apache.xerces.parsers.SAXParser: Property 'http://javax.xml.XMLConstants/property/accessExternalDTD'
is not recognized.
Warning:  org.apache.xerces.parsers.SAXParser: Property 'http://www.oracle.com/xml/jaxp/properties/entityExpansionLimit'
is not recognized.
[INFO] Rat check: Summary of files. Unapproved: 0 unknown: 0 generated: 0 approved: 127 licence.
[INFO] 
[INFO] --- maven-jar-plugin:2.4:test-jar (default) @ cloudsigma2 ---
[INFO] Building jar: <https://buildhive.cloudbees.com/job/jclouds/job/jclouds-labs/ws/cloudsigma2/target/cloudsigma2-2.0.0-SNAPSHOT-tests.jar>
[INFO] 
[INFO] --- maven-surefire-plugin:2.17:test (integration) @ cloudsigma2 ---
[JENKINS] Recording test results[INFO] 
[INFO] --- maven-duplicate-finder-plugin:1.0.5:check (default) @ cloudsigma2 ---

[INFO] Checking compile classpath
[INFO] Checking runtime classpath
[INFO] Checking test classpath
[INFO] 
[INFO] --- maven-checkstyle-plugin:2.13:check (default) @ cloudsigma2 ---
[INFO] 
[INFO] 
[INFO] >>> modernizer-maven-plugin:1.1.0:modernizer (modernizer) @ cloudsigma2 >>>
[INFO] 
[INFO] --- maven-enforcer-plugin:1.1.1:enforce (enforce-banned-dependencies) @ cloudsigma2
---
[INFO] 
[INFO] --- maven-enforcer-plugin:1.1.1:enforce (enforce-java) @ cloudsigma2 ---
[INFO] 
[INFO] --- maven-remote-resources-plugin:1.5:process (default) @ cloudsigma2 ---
[INFO] artifact net.schmizz:sshj: checking for updates from central
[INFO] artifact net.schmizz:sshj: checking for updates from jclouds-sona-snapshots-nexus
[INFO] artifact com.google.guava:guava: checking for updates from central
[INFO] 
[INFO] --- maven-resources-plugin:2.6:resources (default-resources) @ cloudsigma2 ---
[INFO] Using 'UTF-8' encoding to copy filtered resources.
[INFO] skip non existing resourceDirectory <https://buildhive.cloudbees.com/job/jclouds/job/jclouds-labs/ws/cloudsigma2/src/main/clojure>
[INFO] Copying 1 resource
[INFO] Copying 3 resources
[INFO] Copying 3 resources
[INFO] 
[INFO] --- maven-compiler-plugin:3.1:compile (default-compile) @ cloudsigma2 ---
[INFO] Nothing to compile - all classes are up to date
[INFO] 
[INFO] --- maven-resources-plugin:2.6:testResources (default-testResources) @ cloudsigma2
---
[INFO] Using 'UTF-8' encoding to copy filtered resources.
[INFO] skip non existing resourceDirectory <https://buildhive.cloudbees.com/job/jclouds/job/jclouds-labs/ws/cloudsigma2/src/test/clojure>
[INFO] Copying 70 resources
[INFO] Copying 3 resources
[INFO] Copying 3 resources
[INFO] 
[INFO] --- maven-compiler-plugin:3.1:testCompile (default-testCompile) @ cloudsigma2 ---
[INFO] Nothing to compile - all classes are up to date
[WARNING] Failed to getClass for org.gaul.modernizer_maven_plugin.ModernizerMojo
[INFO] 
[INFO] <<< modernizer-maven-plugin:1.1.0:modernizer (modernizer) @ cloudsigma2 <<<
[INFO] 
[INFO] --- modernizer-maven-plugin:1.1.0:modernizer (modernizer) @ cloudsigma2 ---
[INFO]                                                                         
[INFO] ------------------------------------------------------------------------
[INFO] Building jclouds CloudSigma v2 Honolulu Provider 2.0.0-SNAPSHOT
[INFO] ------------------------------------------------------------------------
[INFO] 
[INFO] --- maven-clean-plugin:2.5:clean (default-clean) @ cloudsigma2-hnl ---
[INFO] 
[INFO] --- maven-enforcer-plugin:1.1.1:enforce (enforce-banned-dependencies) @ cloudsigma2-hnl
---
[INFO] 
[INFO] --- maven-enforcer-plugin:1.1.1:enforce (enforce-java) @ cloudsigma2-hnl ---
[INFO] 
[INFO] --- maven-remote-resources-plugin:1.5:process (default) @ cloudsigma2-hnl ---
[INFO] artifact net.schmizz:sshj: checking for updates from central
[INFO] artifact net.schmizz:sshj: checking for updates from jclouds-sona-snapshots-nexus
[INFO] artifact com.google.guava:guava: checking for updates from central
[INFO] 
[INFO] --- maven-resources-plugin:2.6:resources (default-resources) @ cloudsigma2-hnl ---
[INFO] Using 'UTF-8' encoding to copy filtered resources.
[INFO] skip non existing resourceDirectory <https://buildhive.cloudbees.com/job/jclouds/job/jclouds-labs/ws/cloudsigma2-hnl/src/main/clojure>
[INFO] Copying 1 resource
[INFO] Copying 3 resources
[INFO] 
[INFO] --- maven-compiler-plugin:3.1:compile (default-compile) @ cloudsigma2-hnl ---
[INFO] Changes detected - recompiling the module!
[INFO] Compiling 1 source file to <https://buildhive.cloudbees.com/job/jclouds/job/jclouds-labs/ws/cloudsigma2-hnl/target/classes>
[INFO] 
[INFO] --- maven-resources-plugin:2.6:testResources (default-testResources) @ cloudsigma2-hnl
---
[INFO] Using 'UTF-8' encoding to copy filtered resources.
[INFO] skip non existing resourceDirectory <https://buildhive.cloudbees.com/job/jclouds/job/jclouds-labs/ws/cloudsigma2-hnl/src/test/clojure>
[INFO] skip non existing resourceDirectory <https://buildhive.cloudbees.com/job/jclouds/job/jclouds-labs/ws/cloudsigma2-hnl/src/test/resources>
[INFO] Copying 3 resources
[INFO] 
[INFO] --- maven-compiler-plugin:3.1:testCompile (default-testCompile) @ cloudsigma2-hnl ---
[INFO] Changes detected - recompiling the module!
[INFO] Compiling 3 source files to <https://buildhive.cloudbees.com/job/jclouds/job/jclouds-labs/ws/cloudsigma2-hnl/target/test-classes>
[INFO] -------------------------------------------------------------
[ERROR] COMPILATION ERROR : 
[INFO] -------------------------------------------------------------
[ERROR] <https://buildhive.cloudbees.com/job/jclouds/job/jclouds-labs/ws/cloudsigma2-hnl/src/test/java/org/jclouds/cloudsigma2/compute/extensions/CloudSigma2HonoluluSecurityGroupExtensionLiveTest.java>:[22,72]
cannot find symbol
  symbol: class CloudSigma2SecurityGroupExtensionLiveTest
[ERROR] <https://buildhive.cloudbees.com/job/jclouds/job/jclouds-labs/ws/cloudsigma2-hnl/src/test/java/org/jclouds/cloudsigma2/compute/extensions/CloudSigma2HonoluluSecurityGroupExtensionLiveTest.java>:[25,7]
cannot find symbol
  symbol:   variable provider
  location: class org.jclouds.cloudsigma2.compute.extensions.CloudSigma2HonoluluSecurityGroupExtensionLiveTest
[INFO] 2 errors 
[INFO] -------------------------------------------------------------
[INFO] ------------------------------------------------------------------------
[INFO] Reactor Summary:
[INFO] 
[INFO] Apache jclouds labs ............................... SUCCESS [51.352s]
[INFO] Apache jclouds :: Azure :: Compute API ............ SUCCESS [1:35.518s]
[INFO] jclouds docker API ................................ SUCCESS [51.828s]
[INFO] jclouds virtualbox api ............................ SUCCESS [54.394s]
[INFO] jclouds vcloud-director api ....................... SUCCESS [1:47.944s]
[INFO] jclouds cdmi api .................................. SUCCESS [19.787s]
[INFO] jclouds CloudSigma v2 API ......................... SUCCESS [2:21.862s]
[INFO] jclouds CloudSigma v2 Honolulu Provider ........... FAILURE [3.186s]
[INFO] jclouds CloudSigma v2 Las Vegas Provider .......... SKIPPED
[INFO] jclouds CloudSigma v2 San Jose Provider ........... SKIPPED
[INFO] jclouds CloudSigma v2 Washington DC Provider ...... SKIPPED
[INFO] jclouds CloudSigma v2 Zurich Provider ............. SKIPPED
[INFO] jclouds DigitalOcean Provider ..................... SKIPPED
[INFO] jclouds joyent-cloudapi api ....................... SKIPPED
[INFO] jclouds joyentcloud provider ...................... SKIPPED
[INFO] jclouds Fujitsu Global Cloud Platform ............. SKIPPED
[INFO] jclouds Fujitsu Global Cloud Platform AU provider . SKIPPED
[INFO] jclouds Fujitsu Global Cloud Platform DE provider . SKIPPED
[INFO] jclouds Abiquo api ................................ SKIPPED
[INFO] jclouds :: representations ........................ SKIPPED
[INFO] jclouds :: representations :: core ................ SKIPPED
[INFO] jclouds :: representations :: codec ............... SKIPPED
[INFO] jclouds :: management ............................. SKIPPED
[INFO] jclouds :: management :: core ..................... SKIPPED
[INFO] jclouds :: management :: compute .................. SKIPPED
[INFO] jclouds :: management :: blobstore ................ SKIPPED
[INFO] ------------------------------------------------------------------------
[INFO] BUILD FAILURE
[INFO] ------------------------------------------------------------------------
[INFO] Total time: 9:05.220s
[INFO] Finished at: Tue Oct 21 18:22:04 UTC 2014
[INFO] Final Memory: 58M/151M
[INFO] ------------------------------------------------------------------------
Waiting for Jenkins to finish collecting data
[ERROR] Failed to execute goal org.apache.maven.plugins:maven-compiler-plugin:3.1:testCompile
(default-testCompile) on project cloudsigma2-hnl: Compilation failure: Compilation failure:
[ERROR] <https://buildhive.cloudbees.com/job/jclouds/job/jclouds-labs/ws/cloudsigma2-hnl/src/test/java/org/jclouds/cloudsigma2/compute/extensions/CloudSigma2HonoluluSecurityGroupExtensionLiveTest.java>:[22,72]
cannot find symbol
[ERROR] symbol: class CloudSigma2SecurityGroupExtensionLiveTest
[ERROR] <https://buildhive.cloudbees.com/job/jclouds/job/jclouds-labs/ws/cloudsigma2-hnl/src/test/java/org/jclouds/cloudsigma2/compute/extensions/CloudSigma2HonoluluSecurityGroupExtensionLiveTest.java>:[25,7]
cannot find symbol
[ERROR] symbol:   variable provider
[ERROR] location: class org.jclouds.cloudsigma2.compute.extensions.CloudSigma2HonoluluSecurityGroupExtensionLiveTest
[ERROR] -> [Help 1]
org.apache.maven.lifecycle.LifecycleExecutionException: Failed to execute goal org.apache.maven.plugins:maven-compiler-plugin:3.1:testCompile
(default-testCompile) on project cloudsigma2-hnl: Compilation failure
	at org.apache.maven.lifecycle.internal.MojoExecutor.execute(MojoExecutor.java:212)
	at org.apache.maven.lifecycle.internal.MojoExecutor.execute(MojoExecutor.java:153)
	at org.apache.maven.lifecycle.internal.MojoExecutor.execute(MojoExecutor.java:145)
	at org.apache.maven.lifecycle.internal.LifecycleModuleBuilder.buildProject(LifecycleModuleBuilder.java:84)
	at org.apache.maven.lifecycle.internal.LifecycleModuleBuilder.buildProject(LifecycleModuleBuilder.java:59)
	at org.apache.maven.lifecycle.internal.LifecycleStarter.singleThreadedBuild(LifecycleStarter.java:183)
	at org.apache.maven.lifecycle.internal.LifecycleStarter.execute(LifecycleStarter.java:161)
	at org.apache.maven.DefaultMaven.doExecute(DefaultMaven.java:317)
	at org.apache.maven.DefaultMaven.execute(DefaultMaven.java:152)
	at org.jvnet.hudson.maven3.launcher.Maven31Launcher.main(Maven31Launcher.java:132)
	at sun.reflect.NativeMethodAccessorImpl.invoke0(Native Method)
	at sun.reflect.NativeMethodAccessorImpl.invoke(NativeMethodAccessorImpl.java:57)
	at sun.reflect.DelegatingMethodAccessorImpl.invoke(DelegatingMethodAccessorImpl.java:43)
	at java.lang.reflect.Method.invoke(Method.java:606)
	at org.codehaus.plexus.classworlds.launcher.Launcher.launchStandard(Launcher.java:330)
	at org.codehaus.plexus.classworlds.launcher.Launcher.launch(Launcher.java:238)
	at jenkins.maven3.agent.Maven31Main.launch(Maven31Main.java:181)
	at sun.reflect.NativeMethodAccessorImpl.invoke0(Native Method)
	at sun.reflect.NativeMethodAccessorImpl.invoke(NativeMethodAccessorImpl.java:57)
	at sun.reflect.DelegatingMethodAccessorImpl.invoke(DelegatingMethodAccessorImpl.java:43)
	at java.lang.reflect.Method.invoke(Method.java:606)
	at hudson.maven.Maven3Builder.call(Maven3Builder.java:134)
	at hudson.maven.Maven3Builder.call(Maven3Builder.java:69)
	at hudson.remoting.UserRequest.perform(UserRequest.java:118)
	at hudson.remoting.UserRequest.perform(UserRequest.java:48)
	at hudson.remoting.Request$2.run(Request.java:328)
	at hudson.remoting.InterceptingExecutorService$1.call(InterceptingExecutorService.java:72)
	at java.util.concurrent.FutureTask.run(FutureTask.java:262)
	at java.util.concurrent.ThreadPoolExecutor.runWorker(ThreadPoolExecutor.java:1145)
	at java.util.concurrent.ThreadPoolExecutor$Worker.run(ThreadPoolExecutor.java:615)
	at java.lang.Thread.run(Thread.java:744)
Caused by: org.apache.maven.plugin.compiler.CompilationFailureException: Compilation failure
	at org.apache.maven.plugin.compiler.AbstractCompilerMojo.execute(AbstractCompilerMojo.java:858)
	at org.apache.maven.plugin.compiler.TestCompilerMojo.execute(TestCompilerMojo.java:152)
	at org.apache.maven.plugin.DefaultBuildPluginManager.executeMojo(DefaultBuildPluginManager.java:106)
	at org.apache.maven.lifecycle.internal.MojoExecutor.execute(MojoExecutor.java:208)
	... 30 more
[ERROR] 
[ERROR] Re-run Maven using the -X switch to enable full debug logging.
[ERROR] 
[ERROR] For more information about the errors and possible solutions, please read the following
articles:
[ERROR] [Help 1] http://cwiki.apache.org/confluence/display/MAVEN/MojoFailureException
[ERROR] 
[ERROR] After correcting the problems, you can resume the build with the command
[ERROR]   mvn <goals> -rf :cloudsigma2-hnl
[JENKINS] Archiving <https://buildhive.cloudbees.com/job/jclouds/job/jclouds-labs/ws/cloudsigma2/pom.xml>
to org.apache.jclouds.labs/cloudsigma2/2.0.0-SNAPSHOT/cloudsigma2-2.0.0-SNAPSHOT.pom
[JENKINS] Archiving <https://buildhive.cloudbees.com/job/jclouds/job/jclouds-labs/ws/cloudsigma2/target/cloudsigma2-2.0.0-SNAPSHOT.jar>
to org.apache.jclouds.labs/cloudsigma2/2.0.0-SNAPSHOT/cloudsigma2-2.0.0-SNAPSHOT.jar
[JENKINS] Archiving <https://buildhive.cloudbees.com/job/jclouds/job/jclouds-labs/ws/cloudsigma2/target/cloudsigma2-2.0.0-SNAPSHOT-tests.jar>
to org.apache.jclouds.labs/cloudsigma2/2.0.0-SNAPSHOT/cloudsigma2-2.0.0-SNAPSHOT-tests.jar
[JENKINS] Archiving <https://buildhive.cloudbees.com/job/jclouds/job/jclouds-labs/ws/cloudsigma2-zrh/pom.xml>
to org.apache.jclouds.labs/cloudsigma2-zrh/2.0.0-SNAPSHOT/cloudsigma2-zrh-2.0.0-SNAPSHOT.pom
[JENKINS] Archiving <https://buildhive.cloudbees.com/job/jclouds/job/jclouds-labs/ws/joyent-cloudapi/pom.xml>
to org.apache.jclouds.labs/joyent-cloudapi/2.0.0-SNAPSHOT/joyent-cloudapi-2.0.0-SNAPSHOT.pom
[JENKINS] Archiving <https://buildhive.cloudbees.com/job/jclouds/job/jclouds-labs/ws/docker/pom.xml>
to org.apache.jclouds.labs/docker/2.0.0-SNAPSHOT/docker-2.0.0-SNAPSHOT.pom
[JENKINS] Archiving <https://buildhive.cloudbees.com/job/jclouds/job/jclouds-labs/ws/docker/target/docker-2.0.0-SNAPSHOT.jar>
to org.apache.jclouds.labs/docker/2.0.0-SNAPSHOT/docker-2.0.0-SNAPSHOT.jar
[JENKINS] Archiving <https://buildhive.cloudbees.com/job/jclouds/job/jclouds-labs/ws/docker/target/docker-2.0.0-SNAPSHOT-tests.jar>
to org.apache.jclouds.labs/docker/2.0.0-SNAPSHOT/docker-2.0.0-SNAPSHOT-tests.jar
[JENKINS] Archiving <https://buildhive.cloudbees.com/job/jclouds/job/jclouds-labs/ws/pom.xml>
to org.apache.jclouds.labs/jclouds-labs/2.0.0-SNAPSHOT/jclouds-labs-2.0.0-SNAPSHOT.pom
[JENKINS] Archiving <https://buildhive.cloudbees.com/job/jclouds/job/jclouds-labs/ws/target/jclouds-labs-2.0.0-SNAPSHOT-tests.jar>
to org.apache.jclouds.labs/jclouds-labs/2.0.0-SNAPSHOT/jclouds-labs-2.0.0-SNAPSHOT-tests.jar
[JENKINS] Archiving <https://buildhive.cloudbees.com/job/jclouds/job/jclouds-labs/ws/vcloud-director/pom.xml>
to org.apache.jclouds.labs/vcloud-director/2.0.0-SNAPSHOT/vcloud-director-2.0.0-SNAPSHOT.pom
[JENKINS] Archiving <https://buildhive.cloudbees.com/job/jclouds/job/jclouds-labs/ws/vcloud-director/target/vcloud-director-2.0.0-SNAPSHOT.jar>
to org.apache.jclouds.labs/vcloud-director/2.0.0-SNAPSHOT/vcloud-director-2.0.0-SNAPSHOT.jar
[JENKINS] Archiving <https://buildhive.cloudbees.com/job/jclouds/job/jclouds-labs/ws/vcloud-director/target/vcloud-director-2.0.0-SNAPSHOT-tests.jar>
to org.apache.jclouds.labs/vcloud-director/2.0.0-SNAPSHOT/vcloud-director-2.0.0-SNAPSHOT-tests.jar
[JENKINS] Archiving <https://buildhive.cloudbees.com/job/jclouds/job/jclouds-labs/ws/jclouds-representations/pom.xml>
to org.apache.jclouds.labs/jclouds-representations/2.0.0-SNAPSHOT/jclouds-representations-2.0.0-SNAPSHOT.pom
[JENKINS] Archiving <https://buildhive.cloudbees.com/job/jclouds/job/jclouds-labs/ws/virtualbox/pom.xml>
to org.apache.jclouds.labs/virtualbox/2.0.0-SNAPSHOT/virtualbox-2.0.0-SNAPSHOT.pom
[JENKINS] Archiving <https://buildhive.cloudbees.com/job/jclouds/job/jclouds-labs/ws/virtualbox/target/virtualbox-2.0.0-SNAPSHOT.jar>
to org.apache.jclouds.labs/virtualbox/2.0.0-SNAPSHOT/virtualbox-2.0.0-SNAPSHOT.jar
[JENKINS] Archiving <https://buildhive.cloudbees.com/job/jclouds/job/jclouds-labs/ws/virtualbox/target/virtualbox-2.0.0-SNAPSHOT-tests.jar>
to org.apache.jclouds.labs/virtualbox/2.0.0-SNAPSHOT/virtualbox-2.0.0-SNAPSHOT-tests.jar
[JENKINS] Archiving <https://buildhive.cloudbees.com/job/jclouds/job/jclouds-labs/ws/cloudsigma2-sjc/pom.xml>
to org.apache.jclouds.labs/cloudsigma2-sjc/2.0.0-SNAPSHOT/cloudsigma2-sjc-2.0.0-SNAPSHOT.pom
[JENKINS] Archiving <https://buildhive.cloudbees.com/job/jclouds/job/jclouds-labs/ws/azurecompute/pom.xml>
to org.apache.jclouds.labs/azurecompute/2.0.0-SNAPSHOT/azurecompute-2.0.0-SNAPSHOT.pom
[JENKINS] Archiving <https://buildhive.cloudbees.com/job/jclouds/job/jclouds-labs/ws/azurecompute/target/azurecompute-2.0.0-SNAPSHOT.jar>
to org.apache.jclouds.labs/azurecompute/2.0.0-SNAPSHOT/azurecompute-2.0.0-SNAPSHOT.jar
[JENKINS] Archiving <https://buildhive.cloudbees.com/job/jclouds/job/jclouds-labs/ws/azurecompute/target/azurecompute-2.0.0-SNAPSHOT-tests.jar>
to org.apache.jclouds.labs/azurecompute/2.0.0-SNAPSHOT/azurecompute-2.0.0-SNAPSHOT-tests.jar
[JENKINS] Archiving <https://buildhive.cloudbees.com/job/jclouds/job/jclouds-labs/ws/joyentcloud/pom.xml>
to org.apache.jclouds.labs/joyentcloud/2.0.0-SNAPSHOT/joyentcloud-2.0.0-SNAPSHOT.pom
[JENKINS] Archiving <https://buildhive.cloudbees.com/job/jclouds/job/jclouds-labs/ws/cloudsigma2-lvs/pom.xml>
to org.apache.jclouds.labs/cloudsigma2-lvs/2.0.0-SNAPSHOT/cloudsigma2-lvs-2.0.0-SNAPSHOT.pom
[JENKINS] Archiving <https://buildhive.cloudbees.com/job/jclouds/job/jclouds-labs/ws/jclouds-management/management-blobstore/pom.xml>
to org.apache.jclouds.labs.management/management-blobstore/2.0.0-SNAPSHOT/management-blobstore-2.0.0-SNAPSHOT.pom
[JENKINS] Archiving <https://buildhive.cloudbees.com/job/jclouds/job/jclouds-labs/ws/jclouds-management/management-core/pom.xml>
to org.apache.jclouds.labs.management/management-core/2.0.0-SNAPSHOT/management-core-2.0.0-SNAPSHOT.pom
[JENKINS] Archiving <https://buildhive.cloudbees.com/job/jclouds/job/jclouds-labs/ws/cdmi/pom.xml>
to org.apache.jclouds.labs/cdmi/2.0.0-SNAPSHOT/cdmi-2.0.0-SNAPSHOT.pom
[JENKINS] Archiving <https://buildhive.cloudbees.com/job/jclouds/job/jclouds-labs/ws/cdmi/target/cdmi-2.0.0-SNAPSHOT.jar>
to org.apache.jclouds.labs/cdmi/2.0.0-SNAPSHOT/cdmi-2.0.0-SNAPSHOT.jar
[JENKINS] Archiving <https://buildhive.cloudbees.com/job/jclouds/job/jclouds-labs/ws/cdmi/target/cdmi-2.0.0-SNAPSHOT-tests.jar>
to org.apache.jclouds.labs/cdmi/2.0.0-SNAPSHOT/cdmi-2.0.0-SNAPSHOT-tests.jar
[JENKINS] Archiving <https://buildhive.cloudbees.com/job/jclouds/job/jclouds-labs/ws/jclouds-representations/representations-core/pom.xml>
to org.apache.jclouds.labs.representations/representations-core/2.0.0-SNAPSHOT/representations-core-2.0.0-SNAPSHOT.pom
[JENKINS] Archiving <https://buildhive.cloudbees.com/job/jclouds/job/jclouds-labs/ws/fgcp-au/pom.xml>
to org.apache.jclouds.labs/fgcp-au/2.0.0-SNAPSHOT/fgcp-au-2.0.0-SNAPSHOT.pom
[JENKINS] Archiving <https://buildhive.cloudbees.com/job/jclouds/job/jclouds-labs/ws/cloudsigma2-wdc/pom.xml>
to org.apache.jclouds.labs/cloudsigma2-wdc/2.0.0-SNAPSHOT/cloudsigma2-wdc-2.0.0-SNAPSHOT.pom
[JENKINS] Archiving <https://buildhive.cloudbees.com/job/jclouds/job/jclouds-labs/ws/jclouds-management/pom.xml>
to org.apache.jclouds.labs/jclouds-management/2.0.0-SNAPSHOT/jclouds-management-2.0.0-SNAPSHOT.pom
[JENKINS] Archiving <https://buildhive.cloudbees.com/job/jclouds/job/jclouds-labs/ws/fgcp-de/pom.xml>
to org.apache.jclouds.labs/fgcp-de/2.0.0-SNAPSHOT/fgcp-de-2.0.0-SNAPSHOT.pom
[JENKINS] Archiving <https://buildhive.cloudbees.com/job/jclouds/job/jclouds-labs/ws/jclouds-representations/representations-codec/pom.xml>
to org.apache.jclouds.labs.representations/representations-codec/2.0.0-SNAPSHOT/representations-codec-2.0.0-SNAPSHOT.pom
[JENKINS] Archiving <https://buildhive.cloudbees.com/job/jclouds/job/jclouds-labs/ws/jclouds-management/management-compute/pom.xml>
to org.apache.jclouds.labs.management/management-compute/2.0.0-SNAPSHOT/management-compute-2.0.0-SNAPSHOT.pom
[JENKINS] Archiving <https://buildhive.cloudbees.com/job/jclouds/job/jclouds-labs/ws/digitalocean/pom.xml>
to org.apache.jclouds.labs/digitalocean/2.0.0-SNAPSHOT/digitalocean-2.0.0-SNAPSHOT.pom
[JENKINS] Archiving <https://buildhive.cloudbees.com/job/jclouds/job/jclouds-labs/ws/fgcp/pom.xml>
to org.apache.jclouds.labs/fgcp/2.0.0-SNAPSHOT/fgcp-2.0.0-SNAPSHOT.pom
[JENKINS] Archiving <https://buildhive.cloudbees.com/job/jclouds/job/jclouds-labs/ws/cloudsigma2-hnl/pom.xml>
to org.apache.jclouds.labs/cloudsigma2-hnl/2.0.0-SNAPSHOT/cloudsigma2-hnl-2.0.0-SNAPSHOT.pom
[JENKINS] Archiving <https://buildhive.cloudbees.com/job/jclouds/job/jclouds-labs/ws/abiquo/pom.xml>
to org.apache.jclouds.labs/abiquo/2.0.0-SNAPSHOT/abiquo-2.0.0-SNAPSHOT.pom
channel stopped

Mime
View raw message