jclouds-notifications mailing list archives

Site index · List index
Message view « Date » · « Thread »
Top « Date » · « Thread »
From jenkins-no-re...@cloudbees.com
Subject Build failed in Jenkins: jclouds-labs-1.8.x-branch #21
Date Thu, 02 Oct 2014 20:42:51 GMT
See <https://jclouds.ci.cloudbees.com/job/jclouds-labs-1.8.x-branch/21/>

------------------------------------------
Started by upstream project "jclouds-1.8.x-branch" build number 22
originally caused by:
 Started by an SCM change
 Started by an SCM change
 Started by an SCM change
 Started by an SCM change
 Started by an SCM change
Building remotely on 227d07a1 (lxc-fedora17 m1.small small) in workspace <https://jclouds.ci.cloudbees.com/job/jclouds-labs-1.8.x-branch/ws/>
$ sudo /opt/jenkins/sbin/mount-webdav https://repository-jclouds.forge.cloudbees.com/private
jclouds alert
webdav mount try 1
p11-kit: couldn't read config file: /etc/pkcs11/modules/.
Private webdav filestore is mounted
Cloning the remote Git repository
Cloning repository https://git-wip-us.apache.org/repos/asf/jclouds-labs.git
Fetching upstream changes from https://git-wip-us.apache.org/repos/asf/jclouds-labs.git
Fetching upstream changes from https://git-wip-us.apache.org/repos/asf/jclouds-labs.git
Checking out Revision 3451080fd2adbb7a1f67548d7a9727b7c4eb0aff (origin/1.8.x)
Parsing POMs
Failed to transfer Could not find metadata org.apache.jclouds:jclouds-project:1.8.1-SNAPSHOT/maven-metadata.xml
in cloudbees-private-snapshot-repository (https://repository-jclouds.forge.cloudbees.com/snapshot)
Failed to transfer Could not find metadata org.apache.jclouds:jclouds-project:1.8.1-SNAPSHOT/maven-metadata.xml
in sonatype-nexus-snapshots (https://oss.sonatype.org/content/repositories/snapshots)
Downloaded artifact https://repository.apache.org/content/repositories/snapshots/org/apache/jclouds/jclouds-project/1.8.1-SNAPSHOT/maven-metadata.xml
Downloaded artifact https://repository.apache.org/content/repositories/snapshots/org/apache/jclouds/jclouds-project/1.8.1-SNAPSHOT/jclouds-project-1.8.1-20141002.191637-21.pom
Downloaded artifact http://repo.cloudbees.com/content/repositories/central/org/apache/apache/14/apache-14.pom
Downloaded artifact http://repository.apache.org/snapshots/org/apache/jclouds/jclouds-project/1.8.1-SNAPSHOT/maven-metadata.xml
maven3-agent.jar already up to date
maven3-interceptor.jar already up to date
maven3-interceptor-commons.jar already up to date
[jclouds-labs-1.8.x-branch] $ /opt/jdk/jdk1.6.latest/bin/java -Xmx512m -Xloggc:gc.log -XX:MaxPermSize=128m
-XX:+UseParallelOldGC -cp /scratch/jenkins/maven3-agent.jar:/opt/maven/apache-maven-3.0.3/boot/plexus-classworlds-2.4.jar
org.jvnet.hudson.maven3.agent.Maven3Main /opt/maven/apache-maven-3.0.3 /scratch/jenkins/slave.jar
/scratch/jenkins/maven3-interceptor.jar /scratch/jenkins/maven3-interceptor-commons.jar 45682
<===[JENKINS REMOTING CAPACITY]===>   channel started
log4j:WARN No appenders could be found for logger (org.apache.commons.beanutils.converters.BooleanConverter).
log4j:WARN Please initialize the log4j system properly.
Executing Maven:  -B -f <https://jclouds.ci.cloudbees.com/job/jclouds-labs-1.8.x-branch/ws/pom.xml>
-Dmaven.repo.local=<https://jclouds.ci.cloudbees.com/job/jclouds-labs-1.8.x-branch/ws/.repository>
-s /private/jclouds/settings.xml clean deploy -U -e -Pdoc -Psrc
[INFO] Error stacktraces are turned on.
java.lang.reflect.InvocationTargetException
	at sun.reflect.NativeMethodAccessorImpl.invoke0(Native Method)
	at sun.reflect.NativeMethodAccessorImpl.invoke(NativeMethodAccessorImpl.java:39)
	at sun.reflect.DelegatingMethodAccessorImpl.invoke(DelegatingMethodAccessorImpl.java:25)
	at java.lang.reflect.Method.invoke(Method.java:597)
	at org.codehaus.plexus.classworlds.launcher.Launcher.launchStandard(Launcher.java:329)
	at org.codehaus.plexus.classworlds.launcher.Launcher.launch(Launcher.java:239)
	at org.jvnet.hudson.maven3.agent.Maven3Main.launch(Maven3Main.java:178)
	at sun.reflect.NativeMethodAccessorImpl.invoke0(Native Method)
	at sun.reflect.NativeMethodAccessorImpl.invoke(NativeMethodAccessorImpl.java:39)
	at sun.reflect.DelegatingMethodAccessorImpl.invoke(DelegatingMethodAccessorImpl.java:25)
	at java.lang.reflect.Method.invoke(Method.java:597)
	at hudson.maven.Maven3Builder.call(Maven3Builder.java:134)
	at hudson.maven.Maven3Builder.call(Maven3Builder.java:69)
	at hudson.remoting.UserRequest.perform(UserRequest.java:118)
	at hudson.remoting.UserRequest.perform(UserRequest.java:48)
	at hudson.remoting.Request$2.run(Request.java:328)
	at hudson.remoting.InterceptingExecutorService$1.call(InterceptingExecutorService.java:72)
	at java.util.concurrent.FutureTask$Sync.innerRun(FutureTask.java:303)
	at java.util.concurrent.FutureTask.run(FutureTask.java:138)
	at java.util.concurrent.ThreadPoolExecutor$Worker.runTask(ThreadPoolExecutor.java:895)
	at java.util.concurrent.ThreadPoolExecutor$Worker.run(ThreadPoolExecutor.java:918)
	at java.lang.Thread.run(Thread.java:662)
Caused by: org.apache.maven.cli.MavenExecutionRequestsBuilderException: 1 problem was encountered
while building the effective settings
[FATAL] Non-readable settings /private/jclouds/settings.xml: /private/jclouds/settings.xml
(Resource temporarily unavailable) @ /private/jclouds/settings.xml

	at org.apache.maven.cli.DefaultMavenExecutionRequestBuilder.getMavenExecutionRequest(DefaultMavenExecutionRequestBuilder.java:135)
	at org.jvnet.hudson.maven3.launcher.Maven3Launcher.getMavenExecutionRequest(Maven3Launcher.java:132)
	at org.jvnet.hudson.maven3.launcher.Maven3Launcher.main(Maven3Launcher.java:115)
	... 22 more
Caused by: org.apache.maven.settings.building.SettingsBuildingException: 1 problem was encountered
while building the effective settings
[FATAL] Non-readable settings /private/jclouds/settings.xml: /private/jclouds/settings.xml
(Resource temporarily unavailable) @ /private/jclouds/settings.xml

	at org.apache.maven.settings.building.DefaultSettingsBuilder.build(DefaultSettingsBuilder.java:116)
	at org.apache.maven.cli.DefaultMavenExecutionRequestBuilder.settings(DefaultMavenExecutionRequestBuilder.java:420)
	at org.apache.maven.cli.DefaultMavenExecutionRequestBuilder.getMavenExecutionRequest(DefaultMavenExecutionRequestBuilder.java:125)
	... 24 more
channel stopped
ERROR: Failed to parse POMs
hudson.remoting.ProxyException: hudson.util.IOException2: java.lang.reflect.InvocationTargetException
	at hudson.maven.Maven3Builder.call(Maven3Builder.java:178)
	at hudson.maven.Maven3Builder.call(Maven3Builder.java:69)
	at hudson.remoting.UserRequest.perform(UserRequest.java:118)
	at hudson.remoting.UserRequest.perform(UserRequest.java:48)
	at hudson.remoting.Request$2.run(Request.java:328)
	at hudson.remoting.InterceptingExecutorService$1.call(InterceptingExecutorService.java:72)
	at java.util.concurrent.FutureTask$Sync.innerRun(FutureTask.java:303)
	at java.util.concurrent.FutureTask.run(FutureTask.java:138)
	at java.util.concurrent.ThreadPoolExecutor$Worker.runTask(ThreadPoolExecutor.java:895)
	at java.util.concurrent.ThreadPoolExecutor$Worker.run(ThreadPoolExecutor.java:918)
	at java.lang.Thread.run(Thread.java:662)
Caused by: hudson.remoting.ProxyException: java.lang.reflect.InvocationTargetException
	at sun.reflect.NativeMethodAccessorImpl.invoke0(Native Method)
	at sun.reflect.NativeMethodAccessorImpl.invoke(NativeMethodAccessorImpl.java:39)
	at sun.reflect.DelegatingMethodAccessorImpl.invoke(DelegatingMethodAccessorImpl.java:25)
	at java.lang.reflect.Method.invoke(Method.java:597)
	at hudson.maven.Maven3Builder.call(Maven3Builder.java:134)
	... 10 more
Caused by: hudson.remoting.ProxyException: java.lang.Exception: java.lang.reflect.InvocationTargetException
	at org.jvnet.hudson.maven3.agent.Maven3Main.launch(Maven3Main.java:181)
	... 15 more
Caused by: hudson.remoting.ProxyException: java.lang.reflect.InvocationTargetException
	at sun.reflect.NativeMethodAccessorImpl.invoke0(Native Method)
	at sun.reflect.NativeMethodAccessorImpl.invoke(NativeMethodAccessorImpl.java:39)
	at sun.reflect.DelegatingMethodAccessorImpl.invoke(DelegatingMethodAccessorImpl.java:25)
	at java.lang.reflect.Method.invoke(Method.java:597)
	at org.codehaus.plexus.classworlds.launcher.Launcher.launchStandard(Launcher.java:329)
	at org.codehaus.plexus.classworlds.launcher.Launcher.launch(Launcher.java:239)
	at org.jvnet.hudson.maven3.agent.Maven3Main.launch(Maven3Main.java:178)
	... 15 more
Caused by: hudson.remoting.ProxyException: org.apache.maven.cli.MavenExecutionRequestsBuilderException:
1 problem was encountered while building the effective settings
[FATAL] Non-readable settings /private/jclouds/settings.xml: /private/jclouds/settings.xml
(Resource temporarily unavailable) @ /private/jclouds/settings.xml

	at org.apache.maven.cli.DefaultMavenExecutionRequestBuilder.getMavenExecutionRequest(DefaultMavenExecutionRequestBuilder.java:135)
	at org.jvnet.hudson.maven3.launcher.Maven3Launcher.getMavenExecutionRequest(Maven3Launcher.java:132)
	at org.jvnet.hudson.maven3.launcher.Maven3Launcher.main(Maven3Launcher.java:115)
	... 22 more
Caused by: hudson.remoting.ProxyException: org.apache.maven.settings.building.SettingsBuildingException:
1 problem was encountered while building the effective settings
[FATAL] Non-readable settings /private/jclouds/settings.xml: /private/jclouds/settings.xml
(Resource temporarily unavailable) @ /private/jclouds/settings.xml

	at org.apache.maven.settings.building.DefaultSettingsBuilder.build(DefaultSettingsBuilder.java:116)
	at org.apache.maven.cli.DefaultMavenExecutionRequestBuilder.settings(DefaultMavenExecutionRequestBuilder.java:420)
	at org.apache.maven.cli.DefaultMavenExecutionRequestBuilder.getMavenExecutionRequest(DefaultMavenExecutionRequestBuilder.java:125)
	... 24 more

Mime
View raw message