jclouds-notifications mailing list archives

Site index · List index
Message view « Date » · « Thread »
Top « Date » · « Thread »
From BuildHive <buildhive-git...@cloudbees.com>
Subject Build failed in Jenkins: jclouds » jclouds-labs #1577
Date Wed, 01 Oct 2014 22:05:19 GMT
See <https://buildhive.cloudbees.com/job/jclouds/job/jclouds-labs/1577/changes>

Changes:

[acole] JCLOUDS-664 Renamed to azurecompute, removed dead code and refactored good code.

------------------------------------------
[...truncated 55 lines...]
[INFO] jclouds CloudSigma v2 Washington DC Provider
[INFO] jclouds CloudSigma v2 Zurich Provider
[INFO] jclouds DigitalOcean Provider
[INFO] jclouds joyent-cloudapi api
[INFO] jclouds joyentcloud provider
[INFO] jclouds Fujitsu Global Cloud Platform
[INFO] jclouds Fujitsu Global Cloud Platform AU provider
[INFO] jclouds Fujitsu Global Cloud Platform DE provider
[INFO] jclouds Abiquo api
[INFO] jclouds :: representations
[INFO] jclouds :: representations :: core
[INFO] jclouds :: representations :: codec
[INFO] jclouds :: management
[INFO] jclouds :: management :: core
[INFO] jclouds :: management :: compute
[INFO] jclouds :: management :: blobstore
[INFO]                                                                         
[INFO] ------------------------------------------------------------------------
[INFO] Building Apache jclouds :: Azure :: Management API 2.0.0-SNAPSHOT
[INFO] ------------------------------------------------------------------------
Downloading: http://repo.cloudbees.com/content/repositories/central/com/jamesmurty/utils/java-xmlbuilder/1.1/java-xmlbuilder-1.1.pom
Downloaded: http://repo.cloudbees.com/content/repositories/central/com/jamesmurty/utils/java-xmlbuilder/1.1/java-xmlbuilder-1.1.pom
(4 KB at 37.6 KB/sec)
Downloading: http://repo.cloudbees.com/content/repositories/central/net/iharder/base64/2.3.8/base64-2.3.8.pom
Downloaded: http://repo.cloudbees.com/content/repositories/central/net/iharder/base64/2.3.8/base64-2.3.8.pom
(6 KB at 119.6 KB/sec)
Downloading: https://repository.apache.org/content/repositories/snapshots/org/apache/jclouds/jclouds-compute/2.0.0-SNAPSHOT/maven-metadata.xml
Downloading: http://repository.apache.org/snapshots/org/apache/jclouds/jclouds-compute/2.0.0-SNAPSHOT/maven-metadata.xml
Downloaded: http://repository.apache.org/snapshots/org/apache/jclouds/jclouds-compute/2.0.0-SNAPSHOT/maven-metadata.xml
(2 KB at 2.6 KB/sec)
Downloaded: https://repository.apache.org/content/repositories/snapshots/org/apache/jclouds/jclouds-compute/2.0.0-SNAPSHOT/maven-metadata.xml
(2 KB at 2.1 KB/sec)
Downloading: http://repository.apache.org/snapshots/org/apache/jclouds/jclouds-project/2.0.0-SNAPSHOT/maven-metadata.xml
Downloaded: http://repository.apache.org/snapshots/org/apache/jclouds/jclouds-project/2.0.0-SNAPSHOT/maven-metadata.xml
(825 B at 3.4 KB/sec)
Downloading: https://repository.apache.org/content/repositories/snapshots/org/apache/jclouds/jclouds-scriptbuilder/2.0.0-SNAPSHOT/maven-metadata.xml
Downloading: http://repository.apache.org/snapshots/org/apache/jclouds/jclouds-scriptbuilder/2.0.0-SNAPSHOT/maven-metadata.xml
Downloaded: https://repository.apache.org/content/repositories/snapshots/org/apache/jclouds/jclouds-scriptbuilder/2.0.0-SNAPSHOT/maven-metadata.xml
(2 KB at 5.9 KB/sec)
Downloaded: http://repository.apache.org/snapshots/org/apache/jclouds/jclouds-scriptbuilder/2.0.0-SNAPSHOT/maven-metadata.xml
(2 KB at 6.0 KB/sec)
Downloading: https://repository.apache.org/content/repositories/snapshots/org/apache/jclouds/jclouds-core/2.0.0-SNAPSHOT/maven-metadata.xml
Downloading: http://repository.apache.org/snapshots/org/apache/jclouds/jclouds-core/2.0.0-SNAPSHOT/maven-metadata.xml
Downloaded: http://repository.apache.org/snapshots/org/apache/jclouds/jclouds-core/2.0.0-SNAPSHOT/maven-metadata.xml
(2 KB at 4.4 KB/sec)
Downloaded: https://repository.apache.org/content/repositories/snapshots/org/apache/jclouds/jclouds-core/2.0.0-SNAPSHOT/maven-metadata.xml
(2 KB at 4.3 KB/sec)
Downloading: https://repository.apache.org/content/repositories/snapshots/org/apache/jclouds/driver/jclouds-slf4j/2.0.0-SNAPSHOT/maven-metadata.xml
Downloading: http://repository.apache.org/snapshots/org/apache/jclouds/driver/jclouds-slf4j/2.0.0-SNAPSHOT/maven-metadata.xml
Downloaded: http://repository.apache.org/snapshots/org/apache/jclouds/driver/jclouds-slf4j/2.0.0-SNAPSHOT/maven-metadata.xml
(2 KB at 6.2 KB/sec)
Downloaded: https://repository.apache.org/content/repositories/snapshots/org/apache/jclouds/driver/jclouds-slf4j/2.0.0-SNAPSHOT/maven-metadata.xml
(2 KB at 6.0 KB/sec)
Downloading: https://repository.apache.org/content/repositories/snapshots/org/apache/jclouds/driver/jclouds-sshj/2.0.0-SNAPSHOT/maven-metadata.xml
Downloading: http://repository.apache.org/snapshots/org/apache/jclouds/driver/jclouds-sshj/2.0.0-SNAPSHOT/maven-metadata.xml
Downloaded: https://repository.apache.org/content/repositories/snapshots/org/apache/jclouds/driver/jclouds-sshj/2.0.0-SNAPSHOT/maven-metadata.xml
(2 KB at 6.3 KB/sec)
Downloaded: http://repository.apache.org/snapshots/org/apache/jclouds/driver/jclouds-sshj/2.0.0-SNAPSHOT/maven-metadata.xml
(2 KB at 6.4 KB/sec)
Downloading: https://repository.apache.org/content/repositories/snapshots/org/apache/jclouds/driver/jclouds-bouncycastle/2.0.0-SNAPSHOT/maven-metadata.xml
Downloading: http://repository.apache.org/snapshots/org/apache/jclouds/driver/jclouds-bouncycastle/2.0.0-SNAPSHOT/maven-metadata.xml
Downloading: https://oss.sonatype.org/content/repositories/snapshots/org/apache/jclouds/driver/jclouds-bouncycastle/2.0.0-SNAPSHOT/maven-metadata.xml
Downloaded: http://repository.apache.org/snapshots/org/apache/jclouds/driver/jclouds-bouncycastle/2.0.0-SNAPSHOT/maven-metadata.xml
(2 KB at 6.0 KB/sec)
Downloaded: https://repository.apache.org/content/repositories/snapshots/org/apache/jclouds/driver/jclouds-bouncycastle/2.0.0-SNAPSHOT/maven-metadata.xml
(2 KB at 5.8 KB/sec)
Downloading: http://repo.cloudbees.com/content/repositories/central/net/schmizz/sshj/maven-metadata.xml
Downloading: https://repository.apache.org/content/repositories/snapshots/net/schmizz/sshj/maven-metadata.xml
Downloading: http://repository.apache.org/snapshots/net/schmizz/sshj/maven-metadata.xml
Downloading: https://oss.sonatype.org/content/repositories/snapshots/net/schmizz/sshj/maven-metadata.xml
Downloaded: http://repo.cloudbees.com/content/repositories/central/net/schmizz/sshj/maven-metadata.xml
(790 B at 12.6 KB/sec)
Downloading: https://oss.sonatype.org/content/repositories/snapshots/net/schmizz/sshj/maven-metadata.xml
Downloaded: https://oss.sonatype.org/content/repositories/snapshots/net/schmizz/sshj/maven-metadata.xml
(398 B at 0.8 KB/sec)
Downloaded: https://oss.sonatype.org/content/repositories/snapshots/net/schmizz/sshj/maven-metadata.xml
(398 B at 1.0 KB/sec)
Downloading: https://repository.apache.org/content/repositories/snapshots/net/schmizz/sshj/0.9.1-SNAPSHOT/maven-metadata.xml
Downloading: https://oss.sonatype.org/content/repositories/snapshots/net/schmizz/sshj/0.9.1-SNAPSHOT/maven-metadata.xml
Downloading: http://repository.apache.org/snapshots/net/schmizz/sshj/0.9.1-SNAPSHOT/maven-metadata.xml
Downloading: https://oss.sonatype.org/content/repositories/snapshots/net/schmizz/sshj/0.9.1-SNAPSHOT/maven-metadata.xml
Downloaded: https://oss.sonatype.org/content/repositories/snapshots/net/schmizz/sshj/0.9.1-SNAPSHOT/maven-metadata.xml
(2 KB at 6.0 KB/sec)
Downloaded: https://oss.sonatype.org/content/repositories/snapshots/net/schmizz/sshj/0.9.1-SNAPSHOT/maven-metadata.xml
(2 KB at 11.5 KB/sec)
Downloading: https://repository.apache.org/content/repositories/snapshots/net/schmizz/sshj/0.10.1-SNAPSHOT/maven-metadata.xml
Downloading: https://oss.sonatype.org/content/repositories/snapshots/net/schmizz/sshj/0.10.1-SNAPSHOT/maven-metadata.xml
Downloading: http://repository.apache.org/snapshots/net/schmizz/sshj/0.10.1-SNAPSHOT/maven-metadata.xml
Downloading: https://oss.sonatype.org/content/repositories/snapshots/net/schmizz/sshj/0.10.1-SNAPSHOT/maven-metadata.xml
Downloaded: https://oss.sonatype.org/content/repositories/snapshots/net/schmizz/sshj/0.10.1-SNAPSHOT/maven-metadata.xml
(2 KB at 13.2 KB/sec)
Downloaded: https://oss.sonatype.org/content/repositories/snapshots/net/schmizz/sshj/0.10.1-SNAPSHOT/maven-metadata.xml
(2 KB at 13.7 KB/sec)
Downloading: http://repo.cloudbees.com/content/repositories/central/com/google/guava/guava/maven-metadata.xml
Downloading: http://repository.apache.org/snapshots/com/google/guava/guava/maven-metadata.xml
Downloading: https://repository.apache.org/content/repositories/snapshots/com/google/guava/guava/maven-metadata.xml
Downloading: https://oss.sonatype.org/content/repositories/snapshots/com/google/guava/guava/maven-metadata.xml
Downloaded: http://repo.cloudbees.com/content/repositories/central/com/google/guava/guava/maven-metadata.xml
(2 KB at 17.3 KB/sec)
Downloading: http://repo.cloudbees.com/content/repositories/central/com/jamesmurty/utils/java-xmlbuilder/1.1/java-xmlbuilder-1.1.jar
Downloading: http://repo.cloudbees.com/content/repositories/central/net/iharder/base64/2.3.8/base64-2.3.8.jar
Downloaded: http://repo.cloudbees.com/content/repositories/central/com/jamesmurty/utils/java-xmlbuilder/1.1/java-xmlbuilder-1.1.jar
(17 KB at 325.2 KB/sec)
Downloaded: http://repo.cloudbees.com/content/repositories/central/net/iharder/base64/2.3.8/base64-2.3.8.jar
(17 KB at 325.7 KB/sec)
[INFO] 
[INFO] --- maven-clean-plugin:2.5:clean (default-clean) @ azurecompute ---
[INFO] 
[INFO] --- maven-enforcer-plugin:1.1.1:enforce (enforce-banned-dependencies) @ azurecompute
---
[INFO] 
[INFO] --- maven-enforcer-plugin:1.1.1:enforce (enforce-java) @ azurecompute ---
[INFO] 
[INFO] --- maven-checkstyle-plugin:2.13:check (checkstyle) @ azurecompute ---
Downloading: http://repository.apache.org/snapshots/org/apache/jclouds/jclouds-resources/2.0.0-SNAPSHOT/maven-metadata.xml
Downloaded: http://repository.apache.org/snapshots/org/apache/jclouds/jclouds-resources/2.0.0-SNAPSHOT/maven-metadata.xml
(2 KB at 3.3 KB/sec)
Downloading: http://repository.apache.org/snapshots/org/apache/jclouds/jclouds-resources/2.0.0-SNAPSHOT/jclouds-resources-2.0.0-20141001.130648-62.pom
Downloaded: http://repository.apache.org/snapshots/org/apache/jclouds/jclouds-resources/2.0.0-SNAPSHOT/jclouds-resources-2.0.0-20141001.130648-62.pom
(2 KB at 7.8 KB/sec)
Downloading: http://repository.apache.org/snapshots/org/apache/jclouds/jclouds-resources/2.0.0-SNAPSHOT/jclouds-resources-2.0.0-20141001.130648-62.jar
Downloaded: http://repository.apache.org/snapshots/org/apache/jclouds/jclouds-resources/2.0.0-SNAPSHOT/jclouds-resources-2.0.0-20141001.130648-62.jar
(10 KB at 31.2 KB/sec)
[INFO] 
[INFO] 
[INFO] --- maven-checkstyle-plugin:2.13:check (default) @ azurecompute ---
[INFO] 
[INFO] 
[INFO] --- maven-remote-resources-plugin:1.5:process (default) @ azurecompute ---
Downloading: https://oss.sonatype.org/content/repositories/snapshots/org/apache/jclouds/jclouds-project/2.0.0-SNAPSHOT/maven-metadata.xml
Downloading: https://oss.sonatype.org/content/repositories/snapshots/org/apache/jclouds/jclouds-core/2.0.0-SNAPSHOT/maven-metadata.xml
Downloading: https://oss.sonatype.org/content/repositories/snapshots/org/apache/jclouds/jclouds-compute/2.0.0-SNAPSHOT/maven-metadata.xml
Downloading: https://oss.sonatype.org/content/repositories/snapshots/org/apache/jclouds/driver/jclouds-slf4j/2.0.0-SNAPSHOT/maven-metadata.xml
[INFO] artifact net.schmizz:sshj: checking for updates from central
[INFO] artifact net.schmizz:sshj: checking for updates from jclouds-sona-snapshots-nexus
[INFO] artifact com.google.guava:guava: checking for updates from central
[INFO] 
[INFO] --- maven-resources-plugin:2.6:resources (default-resources) @ azurecompute ---
[INFO] Using 'UTF-8' encoding to copy filtered resources.
[INFO] skip non existing resourceDirectory <https://buildhive.cloudbees.com/job/jclouds/job/jclouds-labs/ws/azurecompute/src/main/clojure>
[INFO] Copying 1 resource
[INFO] Copying 3 resources
[INFO] 
[INFO] --- maven-compiler-plugin:3.1:compile (default-compile) @ azurecompute ---
[INFO] Changes detected - recompiling the module!
[INFO] Compiling 58 source files to <https://buildhive.cloudbees.com/job/jclouds/job/jclouds-labs/ws/azurecompute/target/classes>
[INFO] -------------------------------------------------------------
[WARNING] COMPILATION WARNING : 
[INFO] -------------------------------------------------------------
[WARNING] <https://buildhive.cloudbees.com/job/jclouds/job/jclouds-labs/ws/azurecompute/src/main/java/org/jclouds/azurecompute/config/AzureComputeHttpApiModule.java>:
Some input files use or override a deprecated API.
[WARNING] <https://buildhive.cloudbees.com/job/jclouds/job/jclouds-labs/ws/azurecompute/src/main/java/org/jclouds/azurecompute/config/AzureComputeHttpApiModule.java>:
Recompile with -Xlint:deprecation for details.
[WARNING] <https://buildhive.cloudbees.com/job/jclouds/job/jclouds-labs/ws/azurecompute/src/main/java/org/jclouds/azurecompute/binders/BindOSImageParamsToXmlPayload.java>:
Some input files use unchecked or unsafe operations.
[WARNING] <https://buildhive.cloudbees.com/job/jclouds/job/jclouds-labs/ws/azurecompute/src/main/java/org/jclouds/azurecompute/binders/BindOSImageParamsToXmlPayload.java>:
Recompile with -Xlint:unchecked for details.
[INFO] 4 warnings 
[INFO] -------------------------------------------------------------
[INFO] -------------------------------------------------------------
[ERROR] COMPILATION ERROR : 
[INFO] -------------------------------------------------------------
[ERROR] <https://buildhive.cloudbees.com/job/jclouds/job/jclouds-labs/ws/azurecompute/src/main/java/org/jclouds/azurecompute/features/ImageApi.java>:[33,42]
cannot find symbol
  symbol:   class ImageParamsName
  location: package org.jclouds.azurecompute.functions
[ERROR] <https://buildhive.cloudbees.com/job/jclouds/job/jclouds-labs/ws/azurecompute/src/main/java/org/jclouds/azurecompute/features/ImageApi.java>:[84,55]
cannot find symbol
  symbol:   class ImageParamsName
  location: interface org.jclouds.azurecompute.features.ImageApi
[INFO] 2 errors 
[INFO] -------------------------------------------------------------
[INFO] ------------------------------------------------------------------------
[INFO] Reactor Summary:
[INFO] 
[INFO] Apache jclouds :: Azure :: Management API ......... FAILURE [57.932s]
[INFO] Apache jclouds labs ............................... SKIPPED
[INFO] jclouds docker API ................................ SKIPPED
[INFO] jclouds virtualbox api ............................ SKIPPED
[INFO] jclouds dmtf domain objects ....................... SKIPPED
[INFO] jclouds vcloud-director api ....................... SKIPPED
[INFO] jclouds cdmi api .................................. SKIPPED
[INFO] jclouds CloudSigma v2 API ......................... SKIPPED
[INFO] jclouds CloudSigma v2 Las Vegas Provider .......... SKIPPED
[INFO] jclouds CloudSigma v2 Washington DC Provider ...... SKIPPED
[INFO] jclouds CloudSigma v2 Zurich Provider ............. SKIPPED
[INFO] jclouds DigitalOcean Provider ..................... SKIPPED
[INFO] jclouds joyent-cloudapi api ....................... SKIPPED
[INFO] jclouds joyentcloud provider ...................... SKIPPED
[INFO] jclouds Fujitsu Global Cloud Platform ............. SKIPPED
[INFO] jclouds Fujitsu Global Cloud Platform AU provider . SKIPPED
[INFO] jclouds Fujitsu Global Cloud Platform DE provider . SKIPPED
[INFO] jclouds Abiquo api ................................ SKIPPED
[INFO] jclouds :: representations ........................ SKIPPED
[INFO] jclouds :: representations :: core ................ SKIPPED
[INFO] jclouds :: representations :: codec ............... SKIPPED
[INFO] jclouds :: management ............................. SKIPPED
[INFO] jclouds :: management :: core ..................... SKIPPED
[INFO] jclouds :: management :: compute .................. SKIPPED
[INFO] jclouds :: management :: blobstore ................ SKIPPED
[INFO] ------------------------------------------------------------------------
[INFO] BUILD FAILURE
[INFO] ------------------------------------------------------------------------
[INFO] Total time: 1:15.925s
[INFO] Finished at: Wed Oct 01 22:05:11 UTC 2014
[INFO] Final Memory: 26M/63M
[INFO] ------------------------------------------------------------------------
[ERROR] Failed to execute goal org.apache.maven.plugins:maven-compiler-plugin:3.1:compile
(default-compile) on project azurecompute: Compilation failure: Compilation failure:
[ERROR] <https://buildhive.cloudbees.com/job/jclouds/job/jclouds-labs/ws/azurecompute/src/main/java/org/jclouds/azurecompute/features/ImageApi.java>:[33,42]
cannot find symbol
[ERROR] symbol:   class ImageParamsName
[ERROR] location: package org.jclouds.azurecompute.functions
[ERROR] <https://buildhive.cloudbees.com/job/jclouds/job/jclouds-labs/ws/azurecompute/src/main/java/org/jclouds/azurecompute/features/ImageApi.java>:[84,55]
cannot find symbol
[ERROR] symbol:   class ImageParamsName
[ERROR] location: interface org.jclouds.azurecompute.features.ImageApi
[ERROR] -> [Help 1]
org.apache.maven.lifecycle.LifecycleExecutionException: Failed to execute goal org.apache.maven.plugins:maven-compiler-plugin:3.1:compile
(default-compile) on project azurecompute: Compilation failure
	at org.apache.maven.lifecycle.internal.MojoExecutor.execute(MojoExecutor.java:213)
	at org.apache.maven.lifecycle.internal.MojoExecutor.execute(MojoExecutor.java:153)
	at org.apache.maven.lifecycle.internal.MojoExecutor.execute(MojoExecutor.java:145)
	at org.apache.maven.lifecycle.internal.LifecycleModuleBuilder.buildProject(LifecycleModuleBuilder.java:84)
	at org.apache.maven.lifecycle.internal.LifecycleModuleBuilder.buildProject(LifecycleModuleBuilder.java:59)
	at org.apache.maven.lifecycle.internal.LifecycleStarter.singleThreadedBuild(LifecycleStarter.java:183)
	at org.apache.maven.lifecycle.internal.LifecycleStarter.execute(LifecycleStarter.java:161)
	at org.apache.maven.DefaultMaven.doExecute(DefaultMaven.java:320)
	at org.apache.maven.DefaultMaven.execute(DefaultMaven.java:156)
	at org.jvnet.hudson.maven3.launcher.Maven3Launcher.main(Maven3Launcher.java:117)
	at sun.reflect.NativeMethodAccessorImpl.invoke0(Native Method)
	at sun.reflect.NativeMethodAccessorImpl.invoke(NativeMethodAccessorImpl.java:57)
	at sun.reflect.DelegatingMethodAccessorImpl.invoke(DelegatingMethodAccessorImpl.java:43)
	at java.lang.reflect.Method.invoke(Method.java:606)
	at org.codehaus.plexus.classworlds.launcher.Launcher.launchStandard(Launcher.java:329)
	at org.codehaus.plexus.classworlds.launcher.Launcher.launch(Launcher.java:239)
	at org.jvnet.hudson.maven3.agent.Maven3Main.launch(Maven3Main.java:178)
	at sun.reflect.NativeMethodAccessorImpl.invoke0(Native Method)
	at sun.reflect.NativeMethodAccessorImpl.invoke(NativeMethodAccessorImpl.java:57)
	at sun.reflect.DelegatingMethodAccessorImpl.invoke(DelegatingMethodAccessorImpl.java:43)
	at java.lang.reflect.Method.invoke(Method.java:606)
	at hudson.maven.Maven3Builder.call(Maven3Builder.java:134)
	at hudson.maven.Maven3Builder.call(Maven3Builder.java:69)
	at hudson.remoting.UserRequest.perform(UserRequest.java:118)
	at hudson.remoting.UserRequest.perform(UserRequest.java:48)
	at hudson.remoting.Request$2.run(Request.java:328)
	at hudson.remoting.InterceptingExecutorService$1.call(InterceptingExecutorService.java:72)
	at java.util.concurrent.FutureTask.run(FutureTask.java:262)
	at java.util.concurrent.ThreadPoolExecutor.runWorker(ThreadPoolExecutor.java:1145)
	at java.util.concurrent.ThreadPoolExecutor$Worker.run(ThreadPoolExecutor.java:615)
	at java.lang.Thread.run(Thread.java:744)
Caused by: org.apache.maven.plugin.compiler.CompilationFailureException: Compilation failure
	at org.apache.maven.plugin.compiler.AbstractCompilerMojo.execute(AbstractCompilerMojo.java:858)
	at org.apache.maven.plugin.compiler.CompilerMojo.execute(CompilerMojo.java:129)
	at org.apache.maven.plugin.DefaultBuildPluginManager.executeMojo(DefaultBuildPluginManager.java:101)
	at org.apache.maven.lifecycle.internal.MojoExecutor.execute(MojoExecutor.java:209)
	... 30 more
[ERROR] 
[ERROR] Re-run Maven using the -X switch to enable full debug logging.
[ERROR] 
[ERROR] For more information about the errors and possible solutions, please read the following
articles:
[ERROR] [Help 1] http://cwiki.apache.org/confluence/display/MAVEN/MojoFailureException
[JENKINS] Archiving <https://buildhive.cloudbees.com/job/jclouds/job/jclouds-labs/ws/cloudsigma2/pom.xml>
to org.apache.jclouds.labs/cloudsigma2/2.0.0-SNAPSHOT/cloudsigma2-2.0.0-SNAPSHOT.pom
[JENKINS] Archiving <https://buildhive.cloudbees.com/job/jclouds/job/jclouds-labs/ws/joyent-cloudapi/pom.xml>
to org.apache.jclouds.labs/joyent-cloudapi/2.0.0-SNAPSHOT/joyent-cloudapi-2.0.0-SNAPSHOT.pom
[JENKINS] Archiving <https://buildhive.cloudbees.com/job/jclouds/job/jclouds-labs/ws/cloudsigma2-zrh/pom.xml>
to org.apache.jclouds.labs/cloudsigma2-zrh/2.0.0-SNAPSHOT/cloudsigma2-zrh-2.0.0-SNAPSHOT.pom
[JENKINS] Archiving <https://buildhive.cloudbees.com/job/jclouds/job/jclouds-labs/ws/docker/pom.xml>
to org.apache.jclouds.labs/docker/2.0.0-SNAPSHOT/docker-2.0.0-SNAPSHOT.pom
[JENKINS] Archiving <https://buildhive.cloudbees.com/job/jclouds/job/jclouds-labs/ws/pom.xml>
to org.apache.jclouds.labs/jclouds-labs/2.0.0-SNAPSHOT/jclouds-labs-2.0.0-SNAPSHOT.pom
[JENKINS] Archiving <https://buildhive.cloudbees.com/job/jclouds/job/jclouds-labs/ws/vcloud-director/pom.xml>
to org.apache.jclouds.labs/vcloud-director/2.0.0-SNAPSHOT/vcloud-director-2.0.0-SNAPSHOT.pom
[JENKINS] Archiving <https://buildhive.cloudbees.com/job/jclouds/job/jclouds-labs/ws/jclouds-representations/pom.xml>
to org.apache.jclouds.labs/jclouds-representations/2.0.0-SNAPSHOT/jclouds-representations-2.0.0-SNAPSHOT.pom
[JENKINS] Archiving <https://buildhive.cloudbees.com/job/jclouds/job/jclouds-labs/ws/virtualbox/pom.xml>
to org.apache.jclouds.labs/virtualbox/2.0.0-SNAPSHOT/virtualbox-2.0.0-SNAPSHOT.pom
[JENKINS] Archiving <https://buildhive.cloudbees.com/job/jclouds/job/jclouds-labs/ws/dmtf/pom.xml>
to org.apache.jclouds.labs/dmtf/2.0.0-SNAPSHOT/dmtf-2.0.0-SNAPSHOT.pom
[JENKINS] Archiving <https://buildhive.cloudbees.com/job/jclouds/job/jclouds-labs/ws/azurecompute/pom.xml>
to org.apache.jclouds.labs/azurecompute/2.0.0-SNAPSHOT/azurecompute-2.0.0-SNAPSHOT.pom
[JENKINS] Archiving <https://buildhive.cloudbees.com/job/jclouds/job/jclouds-labs/ws/joyentcloud/pom.xml>
to org.apache.jclouds.labs/joyentcloud/2.0.0-SNAPSHOT/joyentcloud-2.0.0-SNAPSHOT.pom
[JENKINS] Archiving <https://buildhive.cloudbees.com/job/jclouds/job/jclouds-labs/ws/cloudsigma2-lvs/pom.xml>
to org.apache.jclouds.labs/cloudsigma2-lvs/2.0.0-SNAPSHOT/cloudsigma2-lvs-2.0.0-SNAPSHOT.pom
[JENKINS] Archiving <https://buildhive.cloudbees.com/job/jclouds/job/jclouds-labs/ws/jclouds-management/management-blobstore/pom.xml>
to org.apache.jclouds.labs.management/management-blobstore/2.0.0-SNAPSHOT/management-blobstore-2.0.0-SNAPSHOT.pom
[JENKINS] Archiving <https://buildhive.cloudbees.com/job/jclouds/job/jclouds-labs/ws/jclouds-management/management-core/pom.xml>
to org.apache.jclouds.labs.management/management-core/2.0.0-SNAPSHOT/management-core-2.0.0-SNAPSHOT.pom
[JENKINS] Archiving <https://buildhive.cloudbees.com/job/jclouds/job/jclouds-labs/ws/cdmi/pom.xml>
to org.apache.jclouds.labs/cdmi/2.0.0-SNAPSHOT/cdmi-2.0.0-SNAPSHOT.pom
[JENKINS] Archiving <https://buildhive.cloudbees.com/job/jclouds/job/jclouds-labs/ws/jclouds-representations/representations-core/pom.xml>
to org.apache.jclouds.labs.representations/representations-core/2.0.0-SNAPSHOT/representations-core-2.0.0-SNAPSHOT.pom
[JENKINS] Archiving <https://buildhive.cloudbees.com/job/jclouds/job/jclouds-labs/ws/fgcp-au/pom.xml>
to org.apache.jclouds.labs/fgcp-au/2.0.0-SNAPSHOT/fgcp-au-2.0.0-SNAPSHOT.pom
[JENKINS] Archiving <https://buildhive.cloudbees.com/job/jclouds/job/jclouds-labs/ws/cloudsigma2-wdc/pom.xml>
to org.apache.jclouds.labs/cloudsigma2-wdc/2.0.0-SNAPSHOT/cloudsigma2-wdc-2.0.0-SNAPSHOT.pom
[JENKINS] Archiving <https://buildhive.cloudbees.com/job/jclouds/job/jclouds-labs/ws/jclouds-management/pom.xml>
to org.apache.jclouds.labs/jclouds-management/2.0.0-SNAPSHOT/jclouds-management-2.0.0-SNAPSHOT.pom
[JENKINS] Archiving <https://buildhive.cloudbees.com/job/jclouds/job/jclouds-labs/ws/fgcp-de/pom.xml>
to org.apache.jclouds.labs/fgcp-de/2.0.0-SNAPSHOT/fgcp-de-2.0.0-SNAPSHOT.pom
[JENKINS] Archiving <https://buildhive.cloudbees.com/job/jclouds/job/jclouds-labs/ws/jclouds-representations/representations-codec/pom.xml>
to org.apache.jclouds.labs.representations/representations-codec/2.0.0-SNAPSHOT/representations-codec-2.0.0-SNAPSHOT.pom
[JENKINS] Archiving <https://buildhive.cloudbees.com/job/jclouds/job/jclouds-labs/ws/jclouds-management/management-compute/pom.xml>
to org.apache.jclouds.labs.management/management-compute/2.0.0-SNAPSHOT/management-compute-2.0.0-SNAPSHOT.pom
[JENKINS] Archiving <https://buildhive.cloudbees.com/job/jclouds/job/jclouds-labs/ws/digitalocean/pom.xml>
to org.apache.jclouds.labs/digitalocean/2.0.0-SNAPSHOT/digitalocean-2.0.0-SNAPSHOT.pom
[JENKINS] Archiving <https://buildhive.cloudbees.com/job/jclouds/job/jclouds-labs/ws/fgcp/pom.xml>
to org.apache.jclouds.labs/fgcp/2.0.0-SNAPSHOT/fgcp-2.0.0-SNAPSHOT.pom
[JENKINS] Archiving <https://buildhive.cloudbees.com/job/jclouds/job/jclouds-labs/ws/abiquo/pom.xml>
to org.apache.jclouds.labs/abiquo/2.0.0-SNAPSHOT/abiquo-2.0.0-SNAPSHOT.pom
channel stopped

Mime
View raw message