jclouds-notifications mailing list archives

Site index · List index
Message view « Date » · « Thread »
Top « Date » · « Thread »
From BuildHive <buildhive-git...@cloudbees.com>
Subject Build failed in Jenkins: jclouds » jclouds-labs-aws #1554
Date Thu, 30 Oct 2014 17:33:20 GMT
See <https://buildhive.cloudbees.com/job/jclouds/job/jclouds-labs-aws/1554/changes>

Changes:

[romancoedo] JCLOUDS-750: Add @AutoValue to pom.xml and refactor VaultMetadata

[romancoedo] JCLOUDS-750: Refactor PartMetadata using @AutoValue

[romancoedo] JCLOUDS-750: Refactor some collections using @AutoValue

[romancoedo] JCLOUDS-750: Refactor JobMetadata using @AutoValue

[romancoedo] JCLOUDS-750: Refactor GlacierError using @AutoValue

[romancoedo] JCLOUDS-750: Refactor ArchiveMetadata using @AutoValue

------------------------------------------
[...truncated 1518 lines...]
Starting test testContentRangeFromPartNumberWithZeroPartSize(org.jclouds.glacier.util.ContentRangeTest)
[pool-6-thread-1] Test testContentRangeFromPartNumberWithZeroPartSize(org.jclouds.glacier.util.ContentRangeTest)
succeeded: 0ms
Test suite progress: tests succeeded: 41, failed: 0, skipped: 0.
Starting test testContentRangeFromString(org.jclouds.glacier.util.ContentRangeTest)
Starting test testBuildContentRangeWithTransposedValues(org.jclouds.glacier.util.ContentRangeTest)
[pool-6-thread-1] Test testContentRangeFromString(org.jclouds.glacier.util.ContentRangeTest)
succeeded: 2ms
Test suite progress: tests succeeded: 42, failed: 0, skipped: 0.
Starting test testBuildContentRangeWithZeroTo(org.jclouds.glacier.util.ContentRangeTest)
[pool-6-thread-2] Test testBuildContentRangeWithNegatives(org.jclouds.glacier.util.ContentRangeTest)
succeeded: 7ms
Test suite progress: tests succeeded: 43, failed: 0, skipped: 0.
Starting test testContentRangeFromStringWithNullString(org.jclouds.glacier.util.ContentRangeTest)
[pool-6-thread-2] Test testContentRangeFromStringWithNullString(org.jclouds.glacier.util.ContentRangeTest)
succeeded: 0ms
Test suite progress: tests succeeded: 44, failed: 0, skipped: 0.
Starting test testContentRangeFromStringWithoutFrom(org.jclouds.glacier.util.ContentRangeTest)
[pool-6-thread-2] Test testContentRangeFromStringWithoutFrom(org.jclouds.glacier.util.ContentRangeTest)
succeeded: 0ms
Test suite progress: tests succeeded: 45, failed: 0, skipped: 0.
Starting test testContentRangeFromPartNumber(org.jclouds.glacier.util.ContentRangeTest)
[pool-6-thread-5] Test testContentRangeFromPartNumber(org.jclouds.glacier.util.ContentRangeTest)
succeeded: 0ms
Test suite progress: tests succeeded: 46, failed: 0, skipped: 0.
[pool-6-thread-3] Test testBuildContentRangeWithTransposedValues(org.jclouds.glacier.util.ContentRangeTest)
succeeded: 32ms
Test suite progress: tests succeeded: 47, failed: 0, skipped: 0.
Starting test testContentRangeFromStringWithEmptyString(org.jclouds.glacier.util.ContentRangeTest)
[pool-6-thread-1] Test testContentRangeFromStringWithEmptyString(org.jclouds.glacier.util.ContentRangeTest)
succeeded: 0ms
Test suite progress: tests succeeded: 48, failed: 0, skipped: 0.
[pool-6-thread-4] Test testBuildContentRangeWithZeroTo(org.jclouds.glacier.util.ContentRangeTest)
succeeded: 31ms
Test suite progress: tests succeeded: 49, failed: 0, skipped: 0.
Starting test testContentRangeFromStringWithoutTo(org.jclouds.glacier.util.ContentRangeTest)
[pool-6-thread-2] Test testContentRangeFromStringWithoutTo(org.jclouds.glacier.util.ContentRangeTest)
succeeded: 1ms
Test suite progress: tests succeeded: 50, failed: 0, skipped: 0.
Starting test testEmptyName(org.jclouds.glacier.predicates.validators.VaultNameValidatorTest)
[pool-7-thread-1] Test testEmptyName(org.jclouds.glacier.predicates.validators.VaultNameValidatorTest)
succeeded: 0ms
Test suite progress: tests succeeded: 51, failed: 0, skipped: 0.
Starting test testIllegalCharacters(org.jclouds.glacier.predicates.validators.VaultNameValidatorTest)
Starting test testIllegalCharacters2(org.jclouds.glacier.predicates.validators.VaultNameValidatorTest)
Starting test testNameTooLong(org.jclouds.glacier.predicates.validators.VaultNameValidatorTest)
Starting test testValidate(org.jclouds.glacier.predicates.validators.VaultNameValidatorTest)
[pool-7-thread-2] Test testIllegalCharacters(org.jclouds.glacier.predicates.validators.VaultNameValidatorTest)
succeeded: 28ms
Test suite progress: tests succeeded: 52, failed: 0, skipped: 0.
[pool-7-thread-3] Test testIllegalCharacters2(org.jclouds.glacier.predicates.validators.VaultNameValidatorTest)
succeeded: 28ms
Test suite progress: tests succeeded: 53, failed: 0, skipped: 0.
[pool-7-thread-4] Test testNameTooLong(org.jclouds.glacier.predicates.validators.VaultNameValidatorTest)
succeeded: 28ms
Test suite progress: tests succeeded: 54, failed: 0, skipped: 0.
[pool-7-thread-5] Test testValidate(org.jclouds.glacier.predicates.validators.VaultNameValidatorTest)
succeeded: 4ms
Test suite progress: tests succeeded: 55, failed: 0, skipped: 0.
Starting test testNotPowerOfTwo(org.jclouds.glacier.predicates.validators.PartSizeValidatorTest)
[pool-8-thread-1] Test testNotPowerOfTwo(org.jclouds.glacier.predicates.validators.PartSizeValidatorTest)
succeeded: 0ms
Test suite progress: tests succeeded: 56, failed: 0, skipped: 0.
Starting test testTooBig(org.jclouds.glacier.predicates.validators.PartSizeValidatorTest)
Starting test testValidate(org.jclouds.glacier.predicates.validators.PartSizeValidatorTest)
[pool-8-thread-2] Test testTooBig(org.jclouds.glacier.predicates.validators.PartSizeValidatorTest)
succeeded: 1ms
Test suite progress: tests succeeded: 57, failed: 0, skipped: 0.
[pool-8-thread-3] Test testValidate(org.jclouds.glacier.predicates.validators.PartSizeValidatorTest)
succeeded: 2ms
Test suite progress: tests succeeded: 58, failed: 0, skipped: 0.
Starting test testZero(org.jclouds.glacier.predicates.validators.PartSizeValidatorTest)
[pool-8-thread-4] Test testZero(org.jclouds.glacier.predicates.validators.PartSizeValidatorTest)
succeeded: 1ms
Test suite progress: tests succeeded: 59, failed: 0, skipped: 0.
Starting test testDescriptionTooLong(org.jclouds.glacier.predicates.validators.DescriptionValidatorTest)
[pool-9-thread-1] Test testDescriptionTooLong(org.jclouds.glacier.predicates.validators.DescriptionValidatorTest)
succeeded: 1ms
Test suite progress: tests succeeded: 60, failed: 0, skipped: 0.
Starting test testIllegalCharacter(org.jclouds.glacier.predicates.validators.DescriptionValidatorTest)
Starting test testIllegalCharacter2(org.jclouds.glacier.predicates.validators.DescriptionValidatorTest)
[pool-9-thread-2] Test testIllegalCharacter(org.jclouds.glacier.predicates.validators.DescriptionValidatorTest)
succeeded: 2ms
Test suite progress: tests succeeded: 61, failed: 0, skipped: 0.
[pool-9-thread-3] Test testIllegalCharacter2(org.jclouds.glacier.predicates.validators.DescriptionValidatorTest)
succeeded: 2ms
Test suite progress: tests succeeded: 62, failed: 0, skipped: 0.
Starting test testValidate(org.jclouds.glacier.predicates.validators.DescriptionValidatorTest)
[pool-9-thread-4] Test testValidate(org.jclouds.glacier.predicates.validators.DescriptionValidatorTest)
succeeded: 1ms
Test suite progress: tests succeeded: 63, failed: 0, skipped: 0.
Starting test testContentLengthTooBig(org.jclouds.glacier.predicates.validators.PayloadValidatorTest)
[pool-10-thread-1] Test testContentLengthTooBig(org.jclouds.glacier.predicates.validators.PayloadValidatorTest)
succeeded: 1ms
Test suite progress: tests succeeded: 64, failed: 0, skipped: 0.
Starting test testNoContentLength(org.jclouds.glacier.predicates.validators.PayloadValidatorTest)
Starting test testNullPayload(org.jclouds.glacier.predicates.validators.PayloadValidatorTest)
[pool-10-thread-2] Test testNoContentLength(org.jclouds.glacier.predicates.validators.PayloadValidatorTest)
succeeded: 49ms
Test suite progress: tests succeeded: 65, failed: 0, skipped: 0.
[pool-10-thread-3] Test testNullPayload(org.jclouds.glacier.predicates.validators.PayloadValidatorTest)
succeeded: 50ms
Test suite progress: tests succeeded: 66, failed: 0, skipped: 0.
Starting test testValidate(org.jclouds.glacier.predicates.validators.PayloadValidatorTest)
[pool-10-thread-4] Test testValidate(org.jclouds.glacier.predicates.validators.PayloadValidatorTest)
succeeded: 0ms
Test suite progress: tests succeeded: 67, failed: 0, skipped: 0.
Tests run: 67, Failures: 0, Errors: 0, Skipped: 0, Time elapsed: 44.095 sec - in TestSuite

Results :

Tests run: 67, Failures: 0, Errors: 0, Skipped: 0

[JENKINS] Recording test results
[INFO] 
[INFO] --- maven-bundle-plugin:2.3.7:bundle (default-bundle) @ glacier ---
[INFO] 
[INFO] --- maven-site-plugin:3.3:attach-descriptor (attach-descriptor) @ glacier ---
[INFO] 
[INFO] --- apache-rat-plugin:0.10:check (default) @ glacier ---
[INFO] 51 implicit excludes (use -debug for more details).
[INFO] Exclude: **/src/test/resources/**/*.sh
[INFO] Exclude: **/src/test/resources/**/*.bat
[INFO] Exclude: **/src/test/resources/**/*.cmd
[INFO] Exclude: **/src/test/resources/**/*.txt
[INFO] Exclude: **/src/test/resources/**/*.gz
[INFO] Exclude: **/src/test/resources/**/*.xml
[INFO] Exclude: **/services/*LoggingModule
[INFO] Exclude: **/services/*ApiMetadata
[INFO] Exclude: **/services/*ProviderMetadata
[INFO] Exclude: **/LICENSE.txt
[INFO] Exclude: **/header.txt
[INFO] Exclude: **/NOTICE.txt
[INFO] Exclude: **/DISCLAIMER
[INFO] Exclude: **/BUILD.txt
[INFO] Exclude: **/CHANGES.txt
[INFO] Exclude: **/README.md
[INFO] Exclude: **/README.txt
[INFO] Exclude: **/DEPENDENCIES
[INFO] Exclude: **/CONTRIBUTING.md
[INFO] Exclude: **/*json
[INFO] Exclude: **/*readme
[INFO] Exclude: **/test
[INFO] Exclude: **/test.pub
[INFO] Exclude: **/target/**
[INFO] Exclude: **/test-output/**
[INFO] Exclude: **/bin/**
[INFO] Exclude: **/.settings/**
[INFO] Exclude: **/.classpath
[INFO] Exclude: **/.dir-locals.el
[INFO] Exclude: **/.project
[INFO] Exclude: **/.idea/**
[INFO] Exclude: **/*.iml
[INFO] Exclude: **/*.eml
[INFO] Exclude: **/*.ipr
[INFO] Exclude: **/*.iws
[INFO] Exclude: **/*.DS_STORE
[INFO] Exclude: **/TAGS
[INFO] Exclude: **/.metadata/**
[INFO] Exclude: **/atlassian-ide-plugin.xml
[INFO] Exclude: **/.DS_Store
[INFO] Exclude: .mailmap
[INFO] Exclude: .git/**
[INFO] Exclude: **/.gitignore
[INFO] Exclude: **/.gitattributes
[INFO] Exclude: **/.java-version
[INFO] Exclude: **/modernizer_exclusions.txt
[INFO] Exclude: .repository/**
[INFO] Exclude: gc.log
[INFO] 81 resources included (use -debug for more details)
Warning:  org.apache.xerces.jaxp.SAXParserImpl$JAXPSAXParser: Property 'http://www.oracle.com/xml/jaxp/properties/entityExpansionLimit'
is not recognized.
Compiler warnings:
  WARNING:  'org.apache.xerces.jaxp.SAXParserImpl: Property 'http://javax.xml.XMLConstants/property/accessExternalDTD'
is not recognized.'
Warning:  org.apache.xerces.parsers.SAXParser: Feature 'http://javax.xml.XMLConstants/feature/secure-processing'
is not recognized.
Warning:  org.apache.xerces.parsers.SAXParser: Property 'http://javax.xml.XMLConstants/property/accessExternalDTD'
is not recognized.
Warning:  org.apache.xerces.parsers.SAXParser: Property 'http://www.oracle.com/xml/jaxp/properties/entityExpansionLimit'
is not recognized.
[INFO] Rat check: Summary of files. Unapproved: 0 unknown: 0 generated: 0 approved: 81 licence.
[INFO] 
[INFO] --- maven-jar-plugin:2.4:test-jar (default) @ glacier ---
[INFO] Building jar: <https://buildhive.cloudbees.com/job/jclouds/job/jclouds-labs-aws/ws/glacier/target/glacier-2.0.0-SNAPSHOT-tests.jar>
[INFO] 
[INFO] --- maven-surefire-plugin:2.17:test (integration) @ glacier ---
[JENKINS] Recording test results[INFO] 
[INFO] --- maven-duplicate-finder-plugin:1.0.5:check (default) @ glacier ---
[INFO] Checking compile classpath

[INFO] Checking runtime classpath
[INFO] Checking test classpath
[INFO] 
[INFO] --- maven-checkstyle-plugin:2.13:check (default) @ glacier ---
[INFO] 
[WARNING] PartMetadata.java[19:15] (imports) UnusedImports: Unused import - com.google.common.base.Preconditions.checkNotNull.
[WARNING] PartMetadata.java[21:8] (imports) UnusedImports: Unused import - java.beans.ConstructorProperties.
[WARNING] PartMetadata.java[28:8] (imports) UnusedImports: Unused import - com.google.gson.annotations.SerializedName.
[INFO] ------------------------------------------------------------------------
[INFO] Reactor Summary:
[INFO] 
[INFO] Apache jclouds labs aws ........................... SUCCESS [37.478s]
[INFO] jcloud elb api .................................... SUCCESS [1:29.196s]
[INFO] jcloud iam api .................................... SUCCESS [47.425s]
[INFO] jcloud rds api .................................... SUCCESS [41.530s]
[INFO] Apache jclouds :: AWS :: Glacier API .............. FAILURE [1:05.543s]
[INFO] jclouds Amazon Elastic Load Balancer provider ..... SKIPPED
[INFO] jclouds Amazon Identity and Access Management (IAM) provider  SKIPPED
[INFO] jclouds Amazon Relational Database Service provider  SKIPPED
[INFO] ------------------------------------------------------------------------
[INFO] BUILD FAILURE
[INFO] ------------------------------------------------------------------------
[INFO] Total time: 4:54.889s
[INFO] Finished at: Thu Oct 30 17:33:17 UTC 2014
[INFO] Final Memory: 44M/126M
[INFO] ------------------------------------------------------------------------
[ERROR] Failed to execute goal org.apache.maven.plugins:maven-checkstyle-plugin:2.13:check
(default) on project glacier: You have 3 Checkstyle violations. -> [Help 1]
org.apache.maven.lifecycle.LifecycleExecutionException: Failed to execute goal org.apache.maven.plugins:maven-checkstyle-plugin:2.13:check
(default) on project glacier: You have 3 Checkstyle violations.
	at org.apache.maven.lifecycle.internal.MojoExecutor.execute(MojoExecutor.java:212)
	at org.apache.maven.lifecycle.internal.MojoExecutor.execute(MojoExecutor.java:153)
	at org.apache.maven.lifecycle.internal.MojoExecutor.execute(MojoExecutor.java:145)
	at org.apache.maven.lifecycle.internal.LifecycleModuleBuilder.buildProject(LifecycleModuleBuilder.java:84)
	at org.apache.maven.lifecycle.internal.LifecycleModuleBuilder.buildProject(LifecycleModuleBuilder.java:59)
	at org.apache.maven.lifecycle.internal.LifecycleStarter.singleThreadedBuild(LifecycleStarter.java:183)
	at org.apache.maven.lifecycle.internal.LifecycleStarter.execute(LifecycleStarter.java:161)
	at org.apache.maven.DefaultMaven.doExecute(DefaultMaven.java:317)
	at org.apache.maven.DefaultMaven.execute(DefaultMaven.java:152)
	at org.jvnet.hudson.maven3.launcher.Maven31Launcher.main(Maven31Launcher.java:132)
	at sun.reflect.NativeMethodAccessorImpl.invoke0(Native Method)
	at sun.reflect.NativeMethodAccessorImpl.invoke(NativeMethodAccessorImpl.java:57)
	at sun.reflect.DelegatingMethodAccessorImpl.invoke(DelegatingMethodAccessorImpl.java:43)
	at java.lang.reflect.Method.invoke(Method.java:606)
	at org.codehaus.plexus.classworlds.launcher.Launcher.launchStandard(Launcher.java:330)
	at org.codehaus.plexus.classworlds.launcher.Launcher.launch(Launcher.java:238)
	at jenkins.maven3.agent.Maven31Main.launch(Maven31Main.java:181)
	at sun.reflect.NativeMethodAccessorImpl.invoke0(Native Method)
	at sun.reflect.NativeMethodAccessorImpl.invoke(NativeMethodAccessorImpl.java:57)
	at sun.reflect.DelegatingMethodAccessorImpl.invoke(DelegatingMethodAccessorImpl.java:43)
	at java.lang.reflect.Method.invoke(Method.java:606)
	at hudson.maven.Maven3Builder.call(Maven3Builder.java:134)
	at hudson.maven.Maven3Builder.call(Maven3Builder.java:69)
	at hudson.remoting.UserRequest.perform(UserRequest.java:118)
	at hudson.remoting.UserRequest.perform(UserRequest.java:48)
	at hudson.remoting.Request$2.run(Request.java:328)
	at hudson.remoting.InterceptingExecutorService$1.call(InterceptingExecutorService.java:72)
	at java.util.concurrent.FutureTask.run(FutureTask.java:262)
	at java.util.concurrent.ThreadPoolExecutor.runWorker(ThreadPoolExecutor.java:1145)
	at java.util.concurrent.ThreadPoolExecutor$Worker.run(ThreadPoolExecutor.java:615)
	at java.lang.Thread.run(Thread.java:744)
Caused by: org.apache.maven.plugin.MojoFailureException: You have 3 Checkstyle violations.
	at org.apache.maven.plugin.checkstyle.CheckstyleViolationCheckMojo.execute(CheckstyleViolationCheckMojo.java:582)
	at org.apache.maven.plugin.DefaultBuildPluginManager.executeMojo(DefaultBuildPluginManager.java:106)
	at org.apache.maven.lifecycle.internal.MojoExecutor.execute(MojoExecutor.java:208)
	... 30 more
[ERROR] 
[ERROR] Re-run Maven using the -X switch to enable full debug logging.
[ERROR] 
[ERROR] For more information about the errors and possible solutions, please read the following
articles:
[ERROR] [Help 1] http://cwiki.apache.org/confluence/display/MAVEN/MojoFailureException
[ERROR] 
[ERROR] After correcting the problems, you can resume the build with the command
[ERROR]   mvn <goals> -rf :glacier
[JENKINS] Archiving <https://buildhive.cloudbees.com/job/jclouds/job/jclouds-labs-aws/ws/aws-elb/pom.xml>
to org.apache.jclouds.labs/aws-elb/2.0.0-SNAPSHOT/aws-elb-2.0.0-SNAPSHOT.pom
[JENKINS] Archiving <https://buildhive.cloudbees.com/job/jclouds/job/jclouds-labs-aws/ws/glacier/pom.xml>
to org.apache.jclouds.labs/glacier/2.0.0-SNAPSHOT/glacier-2.0.0-SNAPSHOT.pom
[JENKINS] Archiving <https://buildhive.cloudbees.com/job/jclouds/job/jclouds-labs-aws/ws/glacier/target/glacier-2.0.0-SNAPSHOT.jar>
to org.apache.jclouds.labs/glacier/2.0.0-SNAPSHOT/glacier-2.0.0-SNAPSHOT.jar
[JENKINS] Archiving <https://buildhive.cloudbees.com/job/jclouds/job/jclouds-labs-aws/ws/glacier/target/glacier-2.0.0-SNAPSHOT-tests.jar>
to org.apache.jclouds.labs/glacier/2.0.0-SNAPSHOT/glacier-2.0.0-SNAPSHOT-tests.jar
[JENKINS] Archiving <https://buildhive.cloudbees.com/job/jclouds/job/jclouds-labs-aws/ws/aws-iam/pom.xml>
to org.apache.jclouds.labs/aws-iam/2.0.0-SNAPSHOT/aws-iam-2.0.0-SNAPSHOT.pom
[JENKINS] Archiving <https://buildhive.cloudbees.com/job/jclouds/job/jclouds-labs-aws/ws/pom.xml>
to org.apache.jclouds.labs/jclouds-labs-aws/2.0.0-SNAPSHOT/jclouds-labs-aws-2.0.0-SNAPSHOT.pom
[JENKINS] Archiving <https://buildhive.cloudbees.com/job/jclouds/job/jclouds-labs-aws/ws/target/jclouds-labs-aws-2.0.0-SNAPSHOT-tests.jar>
to org.apache.jclouds.labs/jclouds-labs-aws/2.0.0-SNAPSHOT/jclouds-labs-aws-2.0.0-SNAPSHOT-tests.jar
[JENKINS] Archiving <https://buildhive.cloudbees.com/job/jclouds/job/jclouds-labs-aws/ws/rds/pom.xml>
to org.apache.jclouds.labs/rds/2.0.0-SNAPSHOT/rds-2.0.0-SNAPSHOT.pom
[JENKINS] Archiving <https://buildhive.cloudbees.com/job/jclouds/job/jclouds-labs-aws/ws/rds/target/rds-2.0.0-SNAPSHOT.jar>
to org.apache.jclouds.labs/rds/2.0.0-SNAPSHOT/rds-2.0.0-SNAPSHOT.jar
[JENKINS] Archiving <https://buildhive.cloudbees.com/job/jclouds/job/jclouds-labs-aws/ws/rds/target/rds-2.0.0-SNAPSHOT-tests.jar>
to org.apache.jclouds.labs/rds/2.0.0-SNAPSHOT/rds-2.0.0-SNAPSHOT-tests.jar
[JENKINS] Archiving <https://buildhive.cloudbees.com/job/jclouds/job/jclouds-labs-aws/ws/elb/pom.xml>
to org.apache.jclouds.labs/elb/2.0.0-SNAPSHOT/elb-2.0.0-SNAPSHOT.pom
[JENKINS] Archiving <https://buildhive.cloudbees.com/job/jclouds/job/jclouds-labs-aws/ws/elb/target/elb-2.0.0-SNAPSHOT.jar>
to org.apache.jclouds.labs/elb/2.0.0-SNAPSHOT/elb-2.0.0-SNAPSHOT.jar
[JENKINS] Archiving <https://buildhive.cloudbees.com/job/jclouds/job/jclouds-labs-aws/ws/elb/target/elb-2.0.0-SNAPSHOT-tests.jar>
to org.apache.jclouds.labs/elb/2.0.0-SNAPSHOT/elb-2.0.0-SNAPSHOT-tests.jar
[JENKINS] Archiving <https://buildhive.cloudbees.com/job/jclouds/job/jclouds-labs-aws/ws/iam/pom.xml>
to org.apache.jclouds.labs/iam/2.0.0-SNAPSHOT/iam-2.0.0-SNAPSHOT.pom
[JENKINS] Archiving <https://buildhive.cloudbees.com/job/jclouds/job/jclouds-labs-aws/ws/iam/target/iam-2.0.0-SNAPSHOT.jar>
to org.apache.jclouds.labs/iam/2.0.0-SNAPSHOT/iam-2.0.0-SNAPSHOT.jar
[JENKINS] Archiving <https://buildhive.cloudbees.com/job/jclouds/job/jclouds-labs-aws/ws/iam/target/iam-2.0.0-SNAPSHOT-tests.jar>
to org.apache.jclouds.labs/iam/2.0.0-SNAPSHOT/iam-2.0.0-SNAPSHOT-tests.jar
[JENKINS] Archiving <https://buildhive.cloudbees.com/job/jclouds/job/jclouds-labs-aws/ws/aws-rds/pom.xml>
to org.apache.jclouds.labs/aws-rds/2.0.0-SNAPSHOT/aws-rds-2.0.0-SNAPSHOT.pom
channel stopped

Mime
View raw message