jclouds-notifications mailing list archives

Site index · List index
Message view « Date » · « Thread »
Top « Date » · « Thread »
From BuildHive <buildhive-git...@cloudbees.com>
Subject Build failed in Jenkins: jclouds » jclouds-labs-aws #1616
Date Sat, 29 Nov 2014 00:49:24 GMT
See <https://buildhive.cloudbees.com/job/jclouds/job/jclouds-labs-aws/1616/>

------------------------------------------
[...truncated 1200 lines...]
[INFO] --- maven-enforcer-plugin:1.1.1:enforce (enforce-banned-dependencies) @ rds ---
[INFO] 
[INFO] --- maven-enforcer-plugin:1.1.1:enforce (enforce-java) @ rds ---
[INFO] 
[INFO] --- maven-remote-resources-plugin:1.5:process (default) @ rds ---
[INFO] 
[INFO] --- maven-resources-plugin:2.6:resources (default-resources) @ rds ---
[INFO] Using 'UTF-8' encoding to copy filtered resources.
[INFO] skip non existing resourceDirectory <https://buildhive.cloudbees.com/job/jclouds/job/jclouds-labs-aws/ws/rds/src/main/clojure>
[INFO] Copying 1 resource
[INFO] Copying 1 resource
[INFO] Copying 3 resources
[INFO] Copying 3 resources
[INFO] 
[INFO] --- maven-compiler-plugin:3.1:compile (default-compile) @ rds ---
[INFO] Nothing to compile - all classes are up to date
[INFO] 
[INFO] --- maven-resources-plugin:2.6:testResources (default-testResources) @ rds ---
[INFO] Using 'UTF-8' encoding to copy filtered resources.
[INFO] skip non existing resourceDirectory <https://buildhive.cloudbees.com/job/jclouds/job/jclouds-labs-aws/ws/rds/src/test/clojure>
[INFO] Copying 16 resources
[INFO] Copying 3 resources
[INFO] Copying 3 resources
[INFO] 
[INFO] --- maven-compiler-plugin:3.1:testCompile (default-testCompile) @ rds ---
[INFO] Nothing to compile - all classes are up to date
[WARNING] Failed to getClass for org.gaul.modernizer_maven_plugin.ModernizerMojo
[INFO] 
[INFO] <<< modernizer-maven-plugin:1.1.0:modernizer (modernizer) @ rds <<<
[INFO] 
[INFO] --- modernizer-maven-plugin:1.1.0:modernizer (modernizer) @ rds ---
[INFO]                                                                         
[INFO] ------------------------------------------------------------------------
[INFO] Building Apache jclouds :: AWS :: Glacier API 2.0.0-SNAPSHOT
[INFO] ------------------------------------------------------------------------
[INFO] Downloading: https://repository.apache.org/content/repositories/snapshots/org/apache/jclouds/jclouds-blobstore/2.0.0-SNAPSHOT/maven-metadata.xml
[INFO] Downloading: http://repository.apache.org/snapshots/org/apache/jclouds/jclouds-blobstore/2.0.0-SNAPSHOT/maven-metadata.xml
[INFO] Downloaded: http://repository.apache.org/snapshots/org/apache/jclouds/jclouds-blobstore/2.0.0-SNAPSHOT/maven-metadata.xml
(1005 B at 3.0 KB/sec)
[INFO] Downloaded: https://repository.apache.org/content/repositories/snapshots/org/apache/jclouds/jclouds-blobstore/2.0.0-SNAPSHOT/maven-metadata.xml
(1005 B at 2.4 KB/sec)
[INFO] Downloading: https://repository.apache.org/content/repositories/snapshots/org/apache/jclouds/driver/jclouds-log4j/2.0.0-SNAPSHOT/maven-metadata.xml
[INFO] Downloading: http://repository.apache.org/snapshots/org/apache/jclouds/driver/jclouds-log4j/2.0.0-SNAPSHOT/maven-metadata.xml
[INFO] Downloaded: https://repository.apache.org/content/repositories/snapshots/org/apache/jclouds/driver/jclouds-log4j/2.0.0-SNAPSHOT/maven-metadata.xml
(1008 B at 3.0 KB/sec)
[INFO] Downloaded: http://repository.apache.org/snapshots/org/apache/jclouds/driver/jclouds-log4j/2.0.0-SNAPSHOT/maven-metadata.xml
(1008 B at 3.0 KB/sec)
[INFO] 
[INFO] --- maven-clean-plugin:2.5:clean (default-clean) @ glacier ---
[INFO] 
[INFO] --- maven-enforcer-plugin:1.1.1:enforce (enforce-banned-dependencies) @ glacier ---
[INFO] 
[INFO] --- maven-enforcer-plugin:1.1.1:enforce (enforce-java) @ glacier ---
[INFO] 
[INFO] --- maven-remote-resources-plugin:1.5:process (default) @ glacier ---
[INFO] 
[INFO] --- maven-resources-plugin:2.6:resources (default-resources) @ glacier ---
[INFO] Using 'UTF-8' encoding to copy filtered resources.
[INFO] skip non existing resourceDirectory <https://buildhive.cloudbees.com/job/jclouds/job/jclouds-labs-aws/ws/glacier/src/main/clojure>
[INFO] Copying 1 resource
[INFO] Copying 1 resource
[INFO] Copying 3 resources
[INFO] 
[INFO] --- maven-compiler-plugin:3.1:compile (default-compile) @ glacier ---
[INFO] Changes detected - recompiling the module!
[INFO] Compiling 66 source files to <https://buildhive.cloudbees.com/job/jclouds/job/jclouds-labs-aws/ws/glacier/target/classes>
[WARNING] bootstrap class path not set in conjunction with -source 1.6
[WARNING] <https://buildhive.cloudbees.com/job/jclouds/job/jclouds-labs-aws/ws/glacier/src/main/java/org/jclouds/glacier/blobstore/strategy/internal/BaseSlicingStrategy.java>:[62,25]
redundant cast to long
[WARNING] <https://buildhive.cloudbees.com/job/jclouds/job/jclouds-labs-aws/ws/glacier/src/main/java/org/jclouds/glacier/binders/BindPartSizeToHeaders.java>:
Some input files use unchecked or unsafe operations.
[WARNING] <https://buildhive.cloudbees.com/job/jclouds/job/jclouds-labs-aws/ws/glacier/src/main/java/org/jclouds/glacier/binders/BindPartSizeToHeaders.java>:
Recompile with -Xlint:unchecked for details.
[INFO] 
[INFO] --- maven-resources-plugin:2.6:testResources (default-testResources) @ glacier ---
[INFO] Using 'UTF-8' encoding to copy filtered resources.
[INFO] skip non existing resourceDirectory <https://buildhive.cloudbees.com/job/jclouds/job/jclouds-labs-aws/ws/glacier/src/test/clojure>
[INFO] Copying 11 resources
[INFO] Copying 3 resources
[INFO] 
[INFO] --- maven-compiler-plugin:3.1:testCompile (default-testCompile) @ glacier ---
[INFO] Changes detected - recompiling the module!
[INFO] Compiling 14 source files to <https://buildhive.cloudbees.com/job/jclouds/job/jclouds-labs-aws/ws/glacier/target/test-classes>
[INFO] -------------------------------------------------------------
[WARNING] COMPILATION WARNING : 
[INFO] -------------------------------------------------------------
[WARNING] bootstrap class path not set in conjunction with -source 1.6
[WARNING] <https://buildhive.cloudbees.com/job/jclouds/job/jclouds-labs-aws/ws/glacier/src/test/java/org/jclouds/glacier/blobstore/strategy/internal/MultipartUploadStrategyMockTest.java>:
Some input files use or override a deprecated API.
[WARNING] <https://buildhive.cloudbees.com/job/jclouds/job/jclouds-labs-aws/ws/glacier/src/test/java/org/jclouds/glacier/blobstore/strategy/internal/MultipartUploadStrategyMockTest.java>:
Recompile with -Xlint:deprecation for details.
[INFO] 3 warnings 
[INFO] -------------------------------------------------------------
[INFO] -------------------------------------------------------------
[ERROR] COMPILATION ERROR : 
[INFO] -------------------------------------------------------------
[ERROR] <https://buildhive.cloudbees.com/job/jclouds/job/jclouds-labs-aws/ws/glacier/src/test/java/org/jclouds/glacier/GlacierClientMockTest.java>:[162,60]
cannot find symbol
  symbol:   variable length
  location: class okio.Buffer
[ERROR] <https://buildhive.cloudbees.com/job/jclouds/job/jclouds-labs-aws/ws/glacier/src/test/java/org/jclouds/glacier/GlacierClientMockTest.java>:[179,60]
cannot find symbol
  symbol:   variable length
  location: class okio.Buffer
[ERROR] <https://buildhive.cloudbees.com/job/jclouds/job/jclouds-labs-aws/ws/glacier/src/test/java/org/jclouds/glacier/GlacierClientMockTest.java>:[192,60]
cannot find symbol
  symbol:   variable length
  location: class okio.Buffer
[ERROR] <https://buildhive.cloudbees.com/job/jclouds/job/jclouds-labs-aws/ws/glacier/src/test/java/org/jclouds/glacier/GlacierClientMockTest.java>:[203,60]
cannot find symbol
  symbol:   variable length
  location: class okio.Buffer
[ERROR] <https://buildhive.cloudbees.com/job/jclouds/job/jclouds-labs-aws/ws/glacier/src/test/java/org/jclouds/glacier/GlacierClientMockTest.java>:[339,60]
cannot find symbol
  symbol:   variable length
  location: class okio.Buffer
[ERROR] <https://buildhive.cloudbees.com/job/jclouds/job/jclouds-labs-aws/ws/glacier/src/test/java/org/jclouds/glacier/GlacierClientMockTest.java>:[358,60]
cannot find symbol
  symbol:   variable length
  location: class okio.Buffer
[ERROR] <https://buildhive.cloudbees.com/job/jclouds/job/jclouds-labs-aws/ws/glacier/src/test/java/org/jclouds/glacier/GlacierClientMockTest.java>:[376,60]
cannot find symbol
  symbol:   variable length
  location: class okio.Buffer
[ERROR] <https://buildhive.cloudbees.com/job/jclouds/job/jclouds-labs-aws/ws/glacier/src/test/java/org/jclouds/glacier/GlacierClientMockTest.java>:[450,60]
cannot find symbol
  symbol:   variable length
  location: class okio.Buffer
[ERROR] <https://buildhive.cloudbees.com/job/jclouds/job/jclouds-labs-aws/ws/glacier/src/test/java/org/jclouds/glacier/GlacierClientMockTest.java>:[467,60]
cannot find symbol
  symbol:   variable length
  location: class okio.Buffer
[ERROR] <https://buildhive.cloudbees.com/job/jclouds/job/jclouds-labs-aws/ws/glacier/src/test/java/org/jclouds/glacier/GlacierClientMockTest.java>:[482,60]
cannot find symbol
  symbol:   variable length
  location: class okio.Buffer
[ERROR] <https://buildhive.cloudbees.com/job/jclouds/job/jclouds-labs-aws/ws/glacier/src/test/java/org/jclouds/glacier/GlacierClientMockTest.java>:[487,89]
cannot find symbol
  symbol:   variable length
  location: class okio.Buffer
[ERROR] <https://buildhive.cloudbees.com/job/jclouds/job/jclouds-labs-aws/ws/glacier/src/test/java/org/jclouds/glacier/GlacierClientMockTest.java>:[501,60]
cannot find symbol
  symbol:   variable length
  location: class okio.Buffer
[ERROR] <https://buildhive.cloudbees.com/job/jclouds/job/jclouds-labs-aws/ws/glacier/src/test/java/org/jclouds/glacier/GlacierClientMockTest.java>:[518,60]
cannot find symbol
  symbol:   variable length
  location: class okio.Buffer
[INFO] 13 errors 
[INFO] -------------------------------------------------------------
[INFO] ------------------------------------------------------------------------
[INFO] Reactor Summary:
[INFO] 
[INFO] Apache jclouds labs aws ........................... SUCCESS [56.157s]
[INFO] jcloud elb api .................................... SUCCESS [1:42.317s]
[INFO] jcloud iam api .................................... SUCCESS [58.729s]
[INFO] jcloud rds api .................................... SUCCESS [47.791s]
[INFO] Apache jclouds :: AWS :: Glacier API .............. FAILURE [6.275s]
[INFO] jclouds Amazon Elastic Load Balancer provider ..... SKIPPED
[INFO] jclouds Amazon Identity and Access Management (IAM) provider  SKIPPED
[INFO] jclouds Amazon Relational Database Service provider  SKIPPED
[INFO] ------------------------------------------------------------------------
[INFO] BUILD FAILURE
[INFO] ------------------------------------------------------------------------
[INFO] Total time: 4:43.338s
[INFO] Finished at: Sat Nov 29 00:49:20 UTC 2014
[INFO] Final Memory: 49M/118M
[INFO] ------------------------------------------------------------------------
[ERROR] Failed to execute goal org.apache.maven.plugins:maven-compiler-plugin:3.1:testCompile
(default-testCompile) on project glacier: Compilation failure: Compilation failure:
[ERROR] <https://buildhive.cloudbees.com/job/jclouds/job/jclouds-labs-aws/ws/glacier/src/test/java/org/jclouds/glacier/GlacierClientMockTest.java>:[162,60]
cannot find symbol
[ERROR] symbol:   variable length
[ERROR] location: class okio.Buffer
[ERROR] <https://buildhive.cloudbees.com/job/jclouds/job/jclouds-labs-aws/ws/glacier/src/test/java/org/jclouds/glacier/GlacierClientMockTest.java>:[179,60]
cannot find symbol
[ERROR] symbol:   variable length
[ERROR] location: class okio.Buffer
[ERROR] <https://buildhive.cloudbees.com/job/jclouds/job/jclouds-labs-aws/ws/glacier/src/test/java/org/jclouds/glacier/GlacierClientMockTest.java>:[192,60]
cannot find symbol
[ERROR] symbol:   variable length
[ERROR] location: class okio.Buffer
[ERROR] <https://buildhive.cloudbees.com/job/jclouds/job/jclouds-labs-aws/ws/glacier/src/test/java/org/jclouds/glacier/GlacierClientMockTest.java>:[203,60]
cannot find symbol
[ERROR] symbol:   variable length
[ERROR] location: class okio.Buffer
[ERROR] <https://buildhive.cloudbees.com/job/jclouds/job/jclouds-labs-aws/ws/glacier/src/test/java/org/jclouds/glacier/GlacierClientMockTest.java>:[339,60]
cannot find symbol
[ERROR] symbol:   variable length
[ERROR] location: class okio.Buffer
[ERROR] <https://buildhive.cloudbees.com/job/jclouds/job/jclouds-labs-aws/ws/glacier/src/test/java/org/jclouds/glacier/GlacierClientMockTest.java>:[358,60]
cannot find symbol
[ERROR] symbol:   variable length
[ERROR] location: class okio.Buffer
[ERROR] <https://buildhive.cloudbees.com/job/jclouds/job/jclouds-labs-aws/ws/glacier/src/test/java/org/jclouds/glacier/GlacierClientMockTest.java>:[376,60]
cannot find symbol
[ERROR] symbol:   variable length
[ERROR] location: class okio.Buffer
[ERROR] <https://buildhive.cloudbees.com/job/jclouds/job/jclouds-labs-aws/ws/glacier/src/test/java/org/jclouds/glacier/GlacierClientMockTest.java>:[450,60]
cannot find symbol
[ERROR] symbol:   variable length
[ERROR] location: class okio.Buffer
[ERROR] <https://buildhive.cloudbees.com/job/jclouds/job/jclouds-labs-aws/ws/glacier/src/test/java/org/jclouds/glacier/GlacierClientMockTest.java>:[467,60]
cannot find symbol
[ERROR] symbol:   variable length
[ERROR] location: class okio.Buffer
[ERROR] <https://buildhive.cloudbees.com/job/jclouds/job/jclouds-labs-aws/ws/glacier/src/test/java/org/jclouds/glacier/GlacierClientMockTest.java>:[482,60]
cannot find symbol
[ERROR] symbol:   variable length
[ERROR] location: class okio.Buffer
[ERROR] <https://buildhive.cloudbees.com/job/jclouds/job/jclouds-labs-aws/ws/glacier/src/test/java/org/jclouds/glacier/GlacierClientMockTest.java>:[487,89]
cannot find symbol
[ERROR] symbol:   variable length
[ERROR] location: class okio.Buffer
[ERROR] <https://buildhive.cloudbees.com/job/jclouds/job/jclouds-labs-aws/ws/glacier/src/test/java/org/jclouds/glacier/GlacierClientMockTest.java>:[501,60]
cannot find symbol
[ERROR] symbol:   variable length
[ERROR] location: class okio.Buffer
[ERROR] <https://buildhive.cloudbees.com/job/jclouds/job/jclouds-labs-aws/ws/glacier/src/test/java/org/jclouds/glacier/GlacierClientMockTest.java>:[518,60]
cannot find symbol
[ERROR] symbol:   variable length
[ERROR] location: class okio.Buffer
[ERROR] -> [Help 1]
org.apache.maven.lifecycle.LifecycleExecutionException: Failed to execute goal org.apache.maven.plugins:maven-compiler-plugin:3.1:testCompile
(default-testCompile) on project glacier: Compilation failure
	at org.apache.maven.lifecycle.internal.MojoExecutor.execute(MojoExecutor.java:212)
	at org.apache.maven.lifecycle.internal.MojoExecutor.execute(MojoExecutor.java:153)
	at org.apache.maven.lifecycle.internal.MojoExecutor.execute(MojoExecutor.java:145)
	at org.apache.maven.lifecycle.internal.LifecycleModuleBuilder.buildProject(LifecycleModuleBuilder.java:84)
	at org.apache.maven.lifecycle.internal.LifecycleModuleBuilder.buildProject(LifecycleModuleBuilder.java:59)
	at org.apache.maven.lifecycle.internal.LifecycleStarter.singleThreadedBuild(LifecycleStarter.java:183)
	at org.apache.maven.lifecycle.internal.LifecycleStarter.execute(LifecycleStarter.java:161)
	at org.apache.maven.DefaultMaven.doExecute(DefaultMaven.java:317)
	at org.apache.maven.DefaultMaven.execute(DefaultMaven.java:152)
	at org.jvnet.hudson.maven3.launcher.Maven31Launcher.main(Maven31Launcher.java:132)
	at sun.reflect.NativeMethodAccessorImpl.invoke0(Native Method)
	at sun.reflect.NativeMethodAccessorImpl.invoke(NativeMethodAccessorImpl.java:57)
	at sun.reflect.DelegatingMethodAccessorImpl.invoke(DelegatingMethodAccessorImpl.java:43)
	at java.lang.reflect.Method.invoke(Method.java:606)
	at org.codehaus.plexus.classworlds.launcher.Launcher.launchStandard(Launcher.java:330)
	at org.codehaus.plexus.classworlds.launcher.Launcher.launch(Launcher.java:238)
	at jenkins.maven3.agent.Maven31Main.launch(Maven31Main.java:181)
	at sun.reflect.NativeMethodAccessorImpl.invoke0(Native Method)
	at sun.reflect.NativeMethodAccessorImpl.invoke(NativeMethodAccessorImpl.java:57)
	at sun.reflect.DelegatingMethodAccessorImpl.invoke(DelegatingMethodAccessorImpl.java:43)
	at java.lang.reflect.Method.invoke(Method.java:606)
	at hudson.maven.Maven3Builder.call(Maven3Builder.java:134)
	at hudson.maven.Maven3Builder.call(Maven3Builder.java:69)
	at hudson.remoting.UserRequest.perform(UserRequest.java:118)
	at hudson.remoting.UserRequest.perform(UserRequest.java:48)
	at hudson.remoting.Request$2.run(Request.java:328)
	at hudson.remoting.InterceptingExecutorService$1.call(InterceptingExecutorService.java:72)
	at java.util.concurrent.FutureTask.run(FutureTask.java:262)
	at java.util.concurrent.ThreadPoolExecutor.runWorker(ThreadPoolExecutor.java:1145)
	at java.util.concurrent.ThreadPoolExecutor$Worker.run(ThreadPoolExecutor.java:615)
	at java.lang.Thread.run(Thread.java:744)
Caused by: org.apache.maven.plugin.compiler.CompilationFailureException: Compilation failure
	at org.apache.maven.plugin.compiler.AbstractCompilerMojo.execute(AbstractCompilerMojo.java:858)
	at org.apache.maven.plugin.compiler.TestCompilerMojo.execute(TestCompilerMojo.java:152)
	at org.apache.maven.plugin.DefaultBuildPluginManager.executeMojo(DefaultBuildPluginManager.java:106)
	at org.apache.maven.lifecycle.internal.MojoExecutor.execute(MojoExecutor.java:208)
	... 30 more
[ERROR] 
[ERROR] Re-run Maven using the -X switch to enable full debug logging.
[ERROR] 
[ERROR] For more information about the errors and possible solutions, please read the following
articles:
[ERROR] [Help 1] http://cwiki.apache.org/confluence/display/MAVEN/MojoFailureException
[ERROR] 
[ERROR] After correcting the problems, you can resume the build with the command
[ERROR]   mvn <goals> -rf :glacier
[JENKINS] Archiving <https://buildhive.cloudbees.com/job/jclouds/job/jclouds-labs-aws/ws/aws-elb/pom.xml>
to org.apache.jclouds.labs/aws-elb/2.0.0-SNAPSHOT/aws-elb-2.0.0-SNAPSHOT.pom
[JENKINS] Archiving <https://buildhive.cloudbees.com/job/jclouds/job/jclouds-labs-aws/ws/glacier/pom.xml>
to org.apache.jclouds.labs/glacier/2.0.0-SNAPSHOT/glacier-2.0.0-SNAPSHOT.pom
[JENKINS] Archiving <https://buildhive.cloudbees.com/job/jclouds/job/jclouds-labs-aws/ws/aws-iam/pom.xml>
to org.apache.jclouds.labs/aws-iam/2.0.0-SNAPSHOT/aws-iam-2.0.0-SNAPSHOT.pom
[JENKINS] Archiving <https://buildhive.cloudbees.com/job/jclouds/job/jclouds-labs-aws/ws/pom.xml>
to org.apache.jclouds.labs/jclouds-labs-aws/2.0.0-SNAPSHOT/jclouds-labs-aws-2.0.0-SNAPSHOT.pom
[JENKINS] Archiving <https://buildhive.cloudbees.com/job/jclouds/job/jclouds-labs-aws/ws/target/jclouds-labs-aws-2.0.0-SNAPSHOT-tests.jar>
to org.apache.jclouds.labs/jclouds-labs-aws/2.0.0-SNAPSHOT/jclouds-labs-aws-2.0.0-SNAPSHOT-tests.jar
[JENKINS] Archiving <https://buildhive.cloudbees.com/job/jclouds/job/jclouds-labs-aws/ws/rds/pom.xml>
to org.apache.jclouds.labs/rds/2.0.0-SNAPSHOT/rds-2.0.0-SNAPSHOT.pom
[JENKINS] Archiving <https://buildhive.cloudbees.com/job/jclouds/job/jclouds-labs-aws/ws/rds/target/rds-2.0.0-SNAPSHOT.jar>
to org.apache.jclouds.labs/rds/2.0.0-SNAPSHOT/rds-2.0.0-SNAPSHOT.jar
[JENKINS] Archiving <https://buildhive.cloudbees.com/job/jclouds/job/jclouds-labs-aws/ws/rds/target/rds-2.0.0-SNAPSHOT-tests.jar>
to org.apache.jclouds.labs/rds/2.0.0-SNAPSHOT/rds-2.0.0-SNAPSHOT-tests.jar
[JENKINS] Archiving <https://buildhive.cloudbees.com/job/jclouds/job/jclouds-labs-aws/ws/elb/pom.xml>
to org.apache.jclouds.labs/elb/2.0.0-SNAPSHOT/elb-2.0.0-SNAPSHOT.pom
[JENKINS] Archiving <https://buildhive.cloudbees.com/job/jclouds/job/jclouds-labs-aws/ws/elb/target/elb-2.0.0-SNAPSHOT.jar>
to org.apache.jclouds.labs/elb/2.0.0-SNAPSHOT/elb-2.0.0-SNAPSHOT.jar
[JENKINS] Archiving <https://buildhive.cloudbees.com/job/jclouds/job/jclouds-labs-aws/ws/elb/target/elb-2.0.0-SNAPSHOT-tests.jar>
to org.apache.jclouds.labs/elb/2.0.0-SNAPSHOT/elb-2.0.0-SNAPSHOT-tests.jar
[JENKINS] Archiving <https://buildhive.cloudbees.com/job/jclouds/job/jclouds-labs-aws/ws/iam/pom.xml>
to org.apache.jclouds.labs/iam/2.0.0-SNAPSHOT/iam-2.0.0-SNAPSHOT.pom
[JENKINS] Archiving <https://buildhive.cloudbees.com/job/jclouds/job/jclouds-labs-aws/ws/iam/target/iam-2.0.0-SNAPSHOT.jar>
to org.apache.jclouds.labs/iam/2.0.0-SNAPSHOT/iam-2.0.0-SNAPSHOT.jar
[JENKINS] Archiving <https://buildhive.cloudbees.com/job/jclouds/job/jclouds-labs-aws/ws/iam/target/iam-2.0.0-SNAPSHOT-tests.jar>
to org.apache.jclouds.labs/iam/2.0.0-SNAPSHOT/iam-2.0.0-SNAPSHOT-tests.jar
[JENKINS] Archiving <https://buildhive.cloudbees.com/job/jclouds/job/jclouds-labs-aws/ws/aws-rds/pom.xml>
to org.apache.jclouds.labs/aws-rds/2.0.0-SNAPSHOT/aws-rds-2.0.0-SNAPSHOT.pom
channel stopped

Mime
View raw message