jclouds-notifications mailing list archives

Site index · List index
Message view « Date » · « Thread »
Top « Date » · « Thread »
From BuildHive <buildhive-git...@cloudbees.com>
Subject Build failed in Jenkins: jclouds » jclouds-labs #1854
Date Mon, 03 Nov 2014 17:33:23 GMT
See <https://buildhive.cloudbees.com/job/jclouds/job/jclouds-labs/1854/changes>

Changes:

[Andrea Turli] JCLOUDS-737 update docker to support v1.3

------------------------------------------
[...truncated 758 lines...]
Starting test testWithId(org.jclouds.docker.DockerApiMetadataTest)
Starting test testDockerApiRegistered(org.jclouds.docker.DockerApiMetadataTest)
[pool-4-thread-3] Test testWithId(org.jclouds.docker.DockerApiMetadataTest) succeeded: 7ms
Test suite progress: tests succeeded: 21, failed: 1, skipped: 0.
Starting test testAllContains(org.jclouds.docker.DockerApiMetadataTest)
[pool-4-thread-2] Test testTransformableToContains(org.jclouds.docker.DockerApiMetadataTest)
succeeded: 109ms
Test suite progress: tests succeeded: 22, failed: 1, skipped: 0.
[pool-4-thread-4] Test testDockerApiRegistered(org.jclouds.docker.DockerApiMetadataTest) succeeded:
101ms
Test suite progress: tests succeeded: 23, failed: 1, skipped: 0.
[pool-4-thread-1] Test testAllContains(org.jclouds.docker.DockerApiMetadataTest) succeeded:
4ms
Test suite progress: tests succeeded: 24, failed: 1, skipped: 0.
Starting test networkSettings(org.jclouds.docker.config.DockerParserModuleTest)
Starting test port(org.jclouds.docker.config.DockerParserModuleTest)
Starting test testContainerWithVolumesNull(org.jclouds.docker.config.DockerParserModuleTest)
[pool-5-thread-2] Test port(org.jclouds.docker.config.DockerParserModuleTest) succeeded: 32ms
Test suite progress: tests succeeded: 25, failed: 1, skipped: 0.
[pool-5-thread-1] Test networkSettings(org.jclouds.docker.config.DockerParserModuleTest) succeeded:
49ms
Test suite progress: tests succeeded: 26, failed: 1, skipped: 0.
[pool-5-thread-3] Test testContainerWithVolumesNull(org.jclouds.docker.config.DockerParserModuleTest)
succeeded: 89ms
Test suite progress: tests succeeded: 27, failed: 1, skipped: 0.
Starting test testVirtualMachineToNodeMetadata(org.jclouds.docker.compute.functions.ContainerToNodeMetadataTest)
[pool-6-thread-1] Test testVirtualMachineToNodeMetadata(org.jclouds.docker.compute.functions.ContainerToNodeMetadataTest)
succeeded: 290ms
Test suite progress: tests succeeded: 28, failed: 1, skipped: 0.
Starting test testImageToImage(org.jclouds.docker.compute.functions.ImageToImageTest)
[pool-7-thread-1] Test testImageToImage(org.jclouds.docker.compute.functions.ImageToImageTest)
succeeded: 191ms
Test suite progress: tests succeeded: 29, failed: 1, skipped: 0.
Starting test testStateNotRunningToStatusTerminated(org.jclouds.docker.compute.functions.StateToStatusTest)
[pool-8-thread-1] Test testStateNotRunningToStatusTerminated(org.jclouds.docker.compute.functions.StateToStatusTest)
succeeded: 20ms
Test suite progress: tests succeeded: 30, failed: 1, skipped: 0.
Starting test testStateRunningToStatusRunning(org.jclouds.docker.compute.functions.StateToStatusTest)
[pool-8-thread-2] Test testStateRunningToStatusRunning(org.jclouds.docker.compute.functions.StateToStatusTest)
succeeded: 2ms
Test suite progress: tests succeeded: 31, failed: 1, skipped: 0.
Starting test testCpuShares(org.jclouds.docker.compute.options.DockerTemplateOptionsTest)
[pool-9-thread-1] Test testCpuShares(org.jclouds.docker.compute.options.DockerTemplateOptionsTest)
succeeded: 1ms
Test suite progress: tests succeeded: 32, failed: 1, skipped: 0.
Starting test testDns(org.jclouds.docker.compute.options.DockerTemplateOptionsTest)
Starting test testHostname(org.jclouds.docker.compute.options.DockerTemplateOptionsTest)
[pool-9-thread-2] Test testDns(org.jclouds.docker.compute.options.DockerTemplateOptionsTest)
succeeded: 2ms
Test suite progress: tests succeeded: 33, failed: 1, skipped: 0.
[pool-9-thread-3] Test testHostname(org.jclouds.docker.compute.options.DockerTemplateOptionsTest)
succeeded: 2ms
Test suite progress: tests succeeded: 34, failed: 1, skipped: 0.
Starting test testMemory(org.jclouds.docker.compute.options.DockerTemplateOptionsTest)
[pool-9-thread-4] Test testMemory(org.jclouds.docker.compute.options.DockerTemplateOptionsTest)
succeeded: 0ms
Test suite progress: tests succeeded: 35, failed: 1, skipped: 0.
Starting test testVolumes(org.jclouds.docker.compute.options.DockerTemplateOptionsTest)
[pool-9-thread-5] Test testVolumes(org.jclouds.docker.compute.options.DockerTemplateOptionsTest)
succeeded: 12ms
Test suite progress: tests succeeded: 36, failed: 1, skipped: 0.
Tests run: 37, Failures: 1, Errors: 0, Skipped: 0, Time elapsed: 33.556 sec <<< FAILURE!
- in TestSuite
testListNonexistentContainers(org.jclouds.docker.features.ContainerApiMockTest)  Time elapsed:
0.813 sec  <<< FAILURE!
java.lang.ClassCastException: com.google.common.collect.EmptyImmutableSet cannot be cast to
java.util.List
	at com.sun.proxy.$Proxy49.listContainers(Unknown Source)
	at org.jclouds.docker.features.ContainerApiMockTest.testListNonexistentContainers(ContainerApiMockTest.java:69)


Results :

Failed tests: 
  ContainerApiMockTest.testListNonexistentContainers:69 » ClassCast com.google.c...

Tests run: 37, Failures: 1, Errors: 0, Skipped: 0

[ERROR] There are test failures.

Please refer to <https://buildhive.cloudbees.com/job/jclouds/job/jclouds-labs/ws/docker/target/surefire-reports>
for the individual test results.
[JENKINS] Recording test results
[INFO] 
[INFO] --- maven-bundle-plugin:2.3.7:bundle (default-bundle) @ docker ---
[INFO] 
[INFO] --- maven-site-plugin:3.3:attach-descriptor (attach-descriptor) @ docker ---
[INFO] 
[INFO] --- apache-rat-plugin:0.10:check (default) @ docker ---
[INFO] 51 implicit excludes (use -debug for more details).
[INFO] Exclude: **/src/test/resources/**/*.sh
[INFO] Exclude: **/src/test/resources/**/*.bat
[INFO] Exclude: **/src/test/resources/**/*.cmd
[INFO] Exclude: **/src/test/resources/**/*.txt
[INFO] Exclude: **/src/test/resources/**/*.gz
[INFO] Exclude: **/src/test/resources/**/*.xml
[INFO] Exclude: **/src/test/resources/**/*.iso
[INFO] Exclude: **/LICENSE.txt
[INFO] Exclude: **/header.txt
[INFO] Exclude: **/NOTICE.txt
[INFO] Exclude: **/DISCLAIMER
[INFO] Exclude: **/BUILD.txt
[INFO] Exclude: **/CHANGES.txt
[INFO] Exclude: **/README.md
[INFO] Exclude: **/README.txt
[INFO] Exclude: **/DEPENDENCIES
[INFO] Exclude: **/CONTRIBUTING.md
[INFO] Exclude: **/*json
[INFO] Exclude: **/*readme
[INFO] Exclude: **/*ProviderMetadata
[INFO] Exclude: **/*ApiMetadata
[INFO] Exclude: **/*LoggingModule
[INFO] Exclude: **/*ViewMBeanFactory
[INFO] Exclude: **/target/**
[INFO] Exclude: **/test-output/**
[INFO] Exclude: **/bin/**
[INFO] Exclude: **/.settings/**
[INFO] Exclude: **/.classpath
[INFO] Exclude: **/.dir-locals.el
[INFO] Exclude: **/.project
[INFO] Exclude: **/.idea/**
[INFO] Exclude: **/*.iml
[INFO] Exclude: **/*.eml
[INFO] Exclude: **/*.ipr
[INFO] Exclude: **/*.iws
[INFO] Exclude: **/*.DS_STORE
[INFO] Exclude: **/TAGS
[INFO] Exclude: **/.metadata/**
[INFO] Exclude: **/atlassian-ide-plugin.xml
[INFO] Exclude: **/.DS_Store
[INFO] Exclude: .mailmap
[INFO] Exclude: .git/**
[INFO] Exclude: **/.gitignore
[INFO] Exclude: **/.gitattributes
[INFO] Exclude: .repository/**
[INFO] Exclude: .java-version
[INFO] Exclude: .repository/**
[INFO] Exclude: gc.log
[INFO] 55 resources included (use -debug for more details)
Warning:  org.apache.xerces.jaxp.SAXParserImpl$JAXPSAXParser: Property 'http://www.oracle.com/xml/jaxp/properties/entityExpansionLimit'
is not recognized.
Compiler warnings:
  WARNING:  'org.apache.xerces.jaxp.SAXParserImpl: Property 'http://javax.xml.XMLConstants/property/accessExternalDTD'
is not recognized.'
Warning:  org.apache.xerces.parsers.SAXParser: Feature 'http://javax.xml.XMLConstants/feature/secure-processing'
is not recognized.
Warning:  org.apache.xerces.parsers.SAXParser: Property 'http://javax.xml.XMLConstants/property/accessExternalDTD'
is not recognized.
Warning:  org.apache.xerces.parsers.SAXParser: Property 'http://www.oracle.com/xml/jaxp/properties/entityExpansionLimit'
is not recognized.
[INFO] Rat check: Summary of files. Unapproved: 0 unknown: 0 generated: 0 approved: 55 licence.
[INFO] 
[INFO] --- maven-jar-plugin:2.4:test-jar (default) @ docker ---
[INFO] Building jar: <https://buildhive.cloudbees.com/job/jclouds/job/jclouds-labs/ws/docker/target/docker-2.0.0-SNAPSHOT-tests.jar>
[INFO] 
[INFO] --- maven-surefire-plugin:2.17:test (integration) @ docker ---
[JENKINS] Recording test results[INFO] 
[INFO] --- maven-duplicate-finder-plugin:1.0.5:check (default) @ docker ---

[INFO] Checking compile classpath
[INFO] Checking runtime classpath
[INFO] Checking test classpath
[INFO] 
[INFO] --- maven-checkstyle-plugin:2.13:check (default) @ docker ---
[INFO] 
[WARNING] ContainerApiMockTest.java[24:8] (imports) UnusedImports: Unused import - java.util.Set.
[INFO] ------------------------------------------------------------------------
[INFO] Reactor Summary:
[INFO] 
[INFO] Apache jclouds labs ............................... SUCCESS [57.393s]
[INFO] Apache jclouds :: Azure :: Compute API ............ SUCCESS [1:50.422s]
[INFO] jclouds docker API ................................ FAILURE [58.271s]
[INFO] jclouds vcloud-director api ....................... SKIPPED
[INFO] jclouds cdmi api .................................. SKIPPED
[INFO] jclouds CloudSigma v2 API ......................... SKIPPED
[INFO] jclouds CloudSigma v2 Honolulu Provider ........... SKIPPED
[INFO] jclouds CloudSigma v2 Las Vegas Provider .......... SKIPPED
[INFO] jclouds CloudSigma v2 San Jose Provider ........... SKIPPED
[INFO] jclouds CloudSigma v2 Washington DC Provider ...... SKIPPED
[INFO] jclouds CloudSigma v2 Zurich Provider ............. SKIPPED
[INFO] jclouds DigitalOcean Provider ..................... SKIPPED
[INFO] jclouds joyent-cloudapi api ....................... SKIPPED
[INFO] jclouds joyentcloud provider ...................... SKIPPED
[INFO] jclouds Abiquo api ................................ SKIPPED
[INFO] jclouds :: representations ........................ SKIPPED
[INFO] jclouds :: representations :: core ................ SKIPPED
[INFO] jclouds :: representations :: codec ............... SKIPPED
[INFO] jclouds :: management ............................. SKIPPED
[INFO] jclouds :: management :: core ..................... SKIPPED
[INFO] jclouds :: management :: compute .................. SKIPPED
[INFO] jclouds :: management :: blobstore ................ SKIPPED
[INFO] ------------------------------------------------------------------------
[INFO] BUILD FAILURE
[INFO] ------------------------------------------------------------------------
[INFO] Total time: 3:59.316s
[INFO] Finished at: Mon Nov 03 17:33:19 UTC 2014
[INFO] Final Memory: 45M/126M
[INFO] ------------------------------------------------------------------------
[ERROR] Failed to execute goal org.apache.maven.plugins:maven-checkstyle-plugin:2.13:check
(default) on project docker: You have 1 Checkstyle violation. -> [Help 1]
org.apache.maven.lifecycle.LifecycleExecutionException: Failed to execute goal org.apache.maven.plugins:maven-checkstyle-plugin:2.13:check
(default) on project docker: You have 1 Checkstyle violation.
	at org.apache.maven.lifecycle.internal.MojoExecutor.execute(MojoExecutor.java:212)
	at org.apache.maven.lifecycle.internal.MojoExecutor.execute(MojoExecutor.java:153)
	at org.apache.maven.lifecycle.internal.MojoExecutor.execute(MojoExecutor.java:145)
	at org.apache.maven.lifecycle.internal.LifecycleModuleBuilder.buildProject(LifecycleModuleBuilder.java:84)
	at org.apache.maven.lifecycle.internal.LifecycleModuleBuilder.buildProject(LifecycleModuleBuilder.java:59)
	at org.apache.maven.lifecycle.internal.LifecycleStarter.singleThreadedBuild(LifecycleStarter.java:183)
	at org.apache.maven.lifecycle.internal.LifecycleStarter.execute(LifecycleStarter.java:161)
	at org.apache.maven.DefaultMaven.doExecute(DefaultMaven.java:317)
	at org.apache.maven.DefaultMaven.execute(DefaultMaven.java:152)
	at org.jvnet.hudson.maven3.launcher.Maven31Launcher.main(Maven31Launcher.java:132)
	at sun.reflect.NativeMethodAccessorImpl.invoke0(Native Method)
	at sun.reflect.NativeMethodAccessorImpl.invoke(NativeMethodAccessorImpl.java:57)
	at sun.reflect.DelegatingMethodAccessorImpl.invoke(DelegatingMethodAccessorImpl.java:43)
	at java.lang.reflect.Method.invoke(Method.java:606)
	at org.codehaus.plexus.classworlds.launcher.Launcher.launchStandard(Launcher.java:330)
	at org.codehaus.plexus.classworlds.launcher.Launcher.launch(Launcher.java:238)
	at jenkins.maven3.agent.Maven31Main.launch(Maven31Main.java:181)
	at sun.reflect.NativeMethodAccessorImpl.invoke0(Native Method)
	at sun.reflect.NativeMethodAccessorImpl.invoke(NativeMethodAccessorImpl.java:57)
	at sun.reflect.DelegatingMethodAccessorImpl.invoke(DelegatingMethodAccessorImpl.java:43)
	at java.lang.reflect.Method.invoke(Method.java:606)
	at hudson.maven.Maven3Builder.call(Maven3Builder.java:134)
	at hudson.maven.Maven3Builder.call(Maven3Builder.java:69)
	at hudson.remoting.UserRequest.perform(UserRequest.java:118)
	at hudson.remoting.UserRequest.perform(UserRequest.java:48)
	at hudson.remoting.Request$2.run(Request.java:328)
	at hudson.remoting.InterceptingExecutorService$1.call(InterceptingExecutorService.java:72)
	at java.util.concurrent.FutureTask.run(FutureTask.java:262)
	at java.util.concurrent.ThreadPoolExecutor.runWorker(ThreadPoolExecutor.java:1145)
	at java.util.concurrent.ThreadPoolExecutor$Worker.run(ThreadPoolExecutor.java:615)
	at java.lang.Thread.run(Thread.java:744)
Caused by: org.apache.maven.plugin.MojoFailureException: You have 1 Checkstyle violation.
	at org.apache.maven.plugin.checkstyle.CheckstyleViolationCheckMojo.execute(CheckstyleViolationCheckMojo.java:582)
	at org.apache.maven.plugin.DefaultBuildPluginManager.executeMojo(DefaultBuildPluginManager.java:106)
	at org.apache.maven.lifecycle.internal.MojoExecutor.execute(MojoExecutor.java:208)
	... 30 more
[ERROR] 
[ERROR] Re-run Maven using the -X switch to enable full debug logging.
[ERROR] 
[ERROR] For more information about the errors and possible solutions, please read the following
articles:
[ERROR] [Help 1] http://cwiki.apache.org/confluence/display/MAVEN/MojoFailureException
[ERROR] 
[ERROR] After correcting the problems, you can resume the build with the command
[ERROR]   mvn <goals> -rf :docker
[JENKINS] Archiving <https://buildhive.cloudbees.com/job/jclouds/job/jclouds-labs/ws/cloudsigma2/pom.xml>
to org.apache.jclouds.labs/cloudsigma2/2.0.0-SNAPSHOT/cloudsigma2-2.0.0-SNAPSHOT.pom
[JENKINS] Archiving <https://buildhive.cloudbees.com/job/jclouds/job/jclouds-labs/ws/cloudsigma2-zrh/pom.xml>
to org.apache.jclouds.labs/cloudsigma2-zrh/2.0.0-SNAPSHOT/cloudsigma2-zrh-2.0.0-SNAPSHOT.pom
[JENKINS] Archiving <https://buildhive.cloudbees.com/job/jclouds/job/jclouds-labs/ws/joyent-cloudapi/pom.xml>
to org.apache.jclouds.labs/joyent-cloudapi/2.0.0-SNAPSHOT/joyent-cloudapi-2.0.0-SNAPSHOT.pom
[JENKINS] Archiving <https://buildhive.cloudbees.com/job/jclouds/job/jclouds-labs/ws/pom.xml>
to org.apache.jclouds.labs/jclouds-labs/2.0.0-SNAPSHOT/jclouds-labs-2.0.0-SNAPSHOT.pom
[JENKINS] Archiving <https://buildhive.cloudbees.com/job/jclouds/job/jclouds-labs/ws/target/jclouds-labs-2.0.0-SNAPSHOT-tests.jar>
to org.apache.jclouds.labs/jclouds-labs/2.0.0-SNAPSHOT/jclouds-labs-2.0.0-SNAPSHOT-tests.jar
[JENKINS] Archiving <https://buildhive.cloudbees.com/job/jclouds/job/jclouds-labs/ws/docker/pom.xml>
to org.apache.jclouds.labs/docker/2.0.0-SNAPSHOT/docker-2.0.0-SNAPSHOT.pom
[JENKINS] Archiving <https://buildhive.cloudbees.com/job/jclouds/job/jclouds-labs/ws/docker/target/docker-2.0.0-SNAPSHOT.jar>
to org.apache.jclouds.labs/docker/2.0.0-SNAPSHOT/docker-2.0.0-SNAPSHOT.jar
[JENKINS] Archiving <https://buildhive.cloudbees.com/job/jclouds/job/jclouds-labs/ws/docker/target/docker-2.0.0-SNAPSHOT-tests.jar>
to org.apache.jclouds.labs/docker/2.0.0-SNAPSHOT/docker-2.0.0-SNAPSHOT-tests.jar
[JENKINS] Archiving <https://buildhive.cloudbees.com/job/jclouds/job/jclouds-labs/ws/cloudsigma2-wdc/pom.xml>
to org.apache.jclouds.labs/cloudsigma2-wdc/2.0.0-SNAPSHOT/cloudsigma2-wdc-2.0.0-SNAPSHOT.pom
[JENKINS] Archiving <https://buildhive.cloudbees.com/job/jclouds/job/jclouds-labs/ws/vcloud-director/pom.xml>
to org.apache.jclouds.labs/vcloud-director/2.0.0-SNAPSHOT/vcloud-director-2.0.0-SNAPSHOT.pom
[JENKINS] Archiving <https://buildhive.cloudbees.com/job/jclouds/job/jclouds-labs/ws/jclouds-representations/pom.xml>
to org.apache.jclouds.labs/jclouds-representations/2.0.0-SNAPSHOT/jclouds-representations-2.0.0-SNAPSHOT.pom
[JENKINS] Archiving <https://buildhive.cloudbees.com/job/jclouds/job/jclouds-labs/ws/jclouds-management/pom.xml>
to org.apache.jclouds.labs/jclouds-management/2.0.0-SNAPSHOT/jclouds-management-2.0.0-SNAPSHOT.pom
[JENKINS] Archiving <https://buildhive.cloudbees.com/job/jclouds/job/jclouds-labs/ws/jclouds-representations/representations-codec/pom.xml>
to org.apache.jclouds.labs.representations/representations-codec/2.0.0-SNAPSHOT/representations-codec-2.0.0-SNAPSHOT.pom
[JENKINS] Archiving <https://buildhive.cloudbees.com/job/jclouds/job/jclouds-labs/ws/jclouds-management/management-compute/pom.xml>
to org.apache.jclouds.labs.management/management-compute/2.0.0-SNAPSHOT/management-compute-2.0.0-SNAPSHOT.pom
[JENKINS] Archiving <https://buildhive.cloudbees.com/job/jclouds/job/jclouds-labs/ws/cloudsigma2-sjc/pom.xml>
to org.apache.jclouds.labs/cloudsigma2-sjc/2.0.0-SNAPSHOT/cloudsigma2-sjc-2.0.0-SNAPSHOT.pom
[JENKINS] Archiving <https://buildhive.cloudbees.com/job/jclouds/job/jclouds-labs/ws/digitalocean/pom.xml>
to org.apache.jclouds.labs/digitalocean/2.0.0-SNAPSHOT/digitalocean-2.0.0-SNAPSHOT.pom
[JENKINS] Archiving <https://buildhive.cloudbees.com/job/jclouds/job/jclouds-labs/ws/azurecompute/pom.xml>
to org.apache.jclouds.labs/azurecompute/2.0.0-SNAPSHOT/azurecompute-2.0.0-SNAPSHOT.pom
[JENKINS] Archiving <https://buildhive.cloudbees.com/job/jclouds/job/jclouds-labs/ws/azurecompute/target/azurecompute-2.0.0-SNAPSHOT.jar>
to org.apache.jclouds.labs/azurecompute/2.0.0-SNAPSHOT/azurecompute-2.0.0-SNAPSHOT.jar
[JENKINS] Archiving <https://buildhive.cloudbees.com/job/jclouds/job/jclouds-labs/ws/azurecompute/target/azurecompute-2.0.0-SNAPSHOT-tests.jar>
to org.apache.jclouds.labs/azurecompute/2.0.0-SNAPSHOT/azurecompute-2.0.0-SNAPSHOT-tests.jar
[JENKINS] Archiving <https://buildhive.cloudbees.com/job/jclouds/job/jclouds-labs/ws/joyentcloud/pom.xml>
to org.apache.jclouds.labs/joyentcloud/2.0.0-SNAPSHOT/joyentcloud-2.0.0-SNAPSHOT.pom
[JENKINS] Archiving <https://buildhive.cloudbees.com/job/jclouds/job/jclouds-labs/ws/cloudsigma2-lvs/pom.xml>
to org.apache.jclouds.labs/cloudsigma2-lvs/2.0.0-SNAPSHOT/cloudsigma2-lvs-2.0.0-SNAPSHOT.pom
[JENKINS] Archiving <https://buildhive.cloudbees.com/job/jclouds/job/jclouds-labs/ws/jclouds-management/management-blobstore/pom.xml>
to org.apache.jclouds.labs.management/management-blobstore/2.0.0-SNAPSHOT/management-blobstore-2.0.0-SNAPSHOT.pom
[JENKINS] Archiving <https://buildhive.cloudbees.com/job/jclouds/job/jclouds-labs/ws/jclouds-management/management-core/pom.xml>
to org.apache.jclouds.labs.management/management-core/2.0.0-SNAPSHOT/management-core-2.0.0-SNAPSHOT.pom
[JENKINS] Archiving <https://buildhive.cloudbees.com/job/jclouds/job/jclouds-labs/ws/abiquo/pom.xml>
to org.apache.jclouds.labs/abiquo/2.0.0-SNAPSHOT/abiquo-2.0.0-SNAPSHOT.pom
[JENKINS] Archiving <https://buildhive.cloudbees.com/job/jclouds/job/jclouds-labs/ws/cloudsigma2-hnl/pom.xml>
to org.apache.jclouds.labs/cloudsigma2-hnl/2.0.0-SNAPSHOT/cloudsigma2-hnl-2.0.0-SNAPSHOT.pom
[JENKINS] Archiving <https://buildhive.cloudbees.com/job/jclouds/job/jclouds-labs/ws/jclouds-representations/representations-core/pom.xml>
to org.apache.jclouds.labs.representations/representations-core/2.0.0-SNAPSHOT/representations-core-2.0.0-SNAPSHOT.pom
[JENKINS] Archiving <https://buildhive.cloudbees.com/job/jclouds/job/jclouds-labs/ws/cdmi/pom.xml>
to org.apache.jclouds.labs/cdmi/2.0.0-SNAPSHOT/cdmi-2.0.0-SNAPSHOT.pom
channel stopped

Mime
View raw message