jclouds-notifications mailing list archives

Site index · List index
Message view « Date » · « Thread »
Top « Date » · « Thread »
From BuildHive <buildhive-git...@cloudbees.com>
Subject Build failed in Jenkins: jclouds » jclouds-labs-google #1615
Date Tue, 04 Nov 2014 04:56:11 GMT
See <https://buildhive.cloudbees.com/job/jclouds/job/jclouds-labs-google/1615/changes>

Changes:

[Adrian Cole] JCLOUDS-458 Fix some obvious bugs in google-cloud-storage.

------------------------------------------
[...truncated 1451 lines...]
Test suite progress: tests succeeded: 34, failed: 0, skipped: 0.
Starting test testGetDefaultObjectAclResponseIs4xx(org.jclouds.googlecloudstorage.features.DefaultObjectAccessControlsApiExpectTest)
[pool-1-thread-3] Test testDeleteDefaultObjectAclResponseIs2xx(org.jclouds.googlecloudstorage.features.DefaultObjectAccessControlsApiExpectTest)
succeeded: 1565ms
Test suite progress: tests succeeded: 35, failed: 0, skipped: 0.
Starting test testInsertDefaultObjectAclResponseIs2xx(org.jclouds.googlecloudstorage.features.DefaultObjectAccessControlsApiExpectTest)
[pool-1-thread-1] Test testUpdateBucketWithOptionsResponseIs2xx(org.jclouds.googlecloudstorage.features.BucketApiExpectTest)
succeeded: 2782ms
Test suite progress: tests succeeded: 36, failed: 0, skipped: 0.
Starting test testListDefaultObjectAclResponseIs4xx(org.jclouds.googlecloudstorage.features.DefaultObjectAccessControlsApiExpectTest)
[pool-1-thread-5] Test testDeleteObjectAclResponseIs4xx(org.jclouds.googlecloudstorage.features.DefaultObjectAccessControlsApiExpectTest)
succeeded: 2243ms
Test suite progress: tests succeeded: 37, failed: 0, skipped: 0.
Starting test testListDefaultObjectAclWithNoOptionsResponseIs2xx(org.jclouds.googlecloudstorage.features.DefaultObjectAccessControlsApiExpectTest)
[pool-1-thread-4] Test testGetDefaultObjectAclResponseIs2xx(org.jclouds.googlecloudstorage.features.DefaultObjectAccessControlsApiExpectTest)
succeeded: 2486ms
Test suite progress: tests succeeded: 38, failed: 0, skipped: 0.
Starting test testPatchDefaultObjectAclWithNoOptionsResponseIs2xx(org.jclouds.googlecloudstorage.features.DefaultObjectAccessControlsApiExpectTest)
[pool-1-thread-2] Test testGetDefaultObjectAclResponseIs4xx(org.jclouds.googlecloudstorage.features.DefaultObjectAccessControlsApiExpectTest)
succeeded: 3015ms
Test suite progress: tests succeeded: 39, failed: 0, skipped: 0.
Starting test testUpdateDefaultObjectAclWithNoOptionsResponseIs2xx(org.jclouds.googlecloudstorage.features.DefaultObjectAccessControlsApiExpectTest)
[pool-1-thread-3] Test testInsertDefaultObjectAclResponseIs2xx(org.jclouds.googlecloudstorage.features.DefaultObjectAccessControlsApiExpectTest)
succeeded: 2420ms
Test suite progress: tests succeeded: 40, failed: 0, skipped: 0.
Starting test testUpdateDefaultObjectAclWithOptionsResponseIs2xx(org.jclouds.googlecloudstorage.features.DefaultObjectAccessControlsApiExpectTest)
[pool-1-thread-1] Test testListDefaultObjectAclResponseIs4xx(org.jclouds.googlecloudstorage.features.DefaultObjectAccessControlsApiExpectTest)
succeeded: 2479ms
Test suite progress: tests succeeded: 41, failed: 0, skipped: 0.
Starting test testGetObjectaclResponseIs4xx(org.jclouds.googlecloudstorage.features.ObjectAccessControlsApiExpectTest)
[pool-1-thread-4] Test testPatchDefaultObjectAclWithNoOptionsResponseIs2xx(org.jclouds.googlecloudstorage.features.DefaultObjectAccessControlsApiExpectTest)
succeeded: 2591ms
Test suite progress: tests succeeded: 42, failed: 0, skipped: 0.
Starting test testGetObjectaclWithNoOptionsResponseIs2xx(org.jclouds.googlecloudstorage.features.ObjectAccessControlsApiExpectTest)
[pool-1-thread-5] Test testListDefaultObjectAclWithNoOptionsResponseIs2xx(org.jclouds.googlecloudstorage.features.DefaultObjectAccessControlsApiExpectTest)
succeeded: 3382ms
Test suite progress: tests succeeded: 43, failed: 0, skipped: 0.
Starting test testGetObjectaclWithOptionsResponseIs2xx(org.jclouds.googlecloudstorage.features.ObjectAccessControlsApiExpectTest)
[pool-1-thread-2] Test testUpdateDefaultObjectAclWithNoOptionsResponseIs2xx(org.jclouds.googlecloudstorage.features.DefaultObjectAccessControlsApiExpectTest)
succeeded: 2342ms
Test suite progress: tests succeeded: 44, failed: 0, skipped: 0.
Starting test testInsertObjectaclWithNoOptionsResponseIs2xx(org.jclouds.googlecloudstorage.features.ObjectAccessControlsApiExpectTest)
[pool-1-thread-1] Test testGetObjectaclResponseIs4xx(org.jclouds.googlecloudstorage.features.ObjectAccessControlsApiExpectTest)
succeeded: 1921ms
Test suite progress: tests succeeded: 45, failed: 0, skipped: 0.
Starting test testInsertObjectaclWithOptionsResponseIs2xx(org.jclouds.googlecloudstorage.features.ObjectAccessControlsApiExpectTest)
[pool-1-thread-3] Test testUpdateDefaultObjectAclWithOptionsResponseIs2xx(org.jclouds.googlecloudstorage.features.DefaultObjectAccessControlsApiExpectTest)
succeeded: 2857ms
Test suite progress: tests succeeded: 46, failed: 0, skipped: 0.
Starting test testListObjectaclResponseIs4xx(org.jclouds.googlecloudstorage.features.ObjectAccessControlsApiExpectTest)
[pool-1-thread-2] Test testInsertObjectaclWithNoOptionsResponseIs2xx(org.jclouds.googlecloudstorage.features.ObjectAccessControlsApiExpectTest)
succeeded: 1672ms
Test suite progress: tests succeeded: 47, failed: 0, skipped: 0.
Starting test testListObjectaclWithNoOptionsResponseIs2xx(org.jclouds.googlecloudstorage.features.ObjectAccessControlsApiExpectTest)
[pool-1-thread-5] Test testGetObjectaclWithOptionsResponseIs2xx(org.jclouds.googlecloudstorage.features.ObjectAccessControlsApiExpectTest)
succeeded: 2517ms
Test suite progress: tests succeeded: 48, failed: 0, skipped: 0.
Starting test testListObjectaclWithOptionsResponseIs2xx(org.jclouds.googlecloudstorage.features.ObjectAccessControlsApiExpectTest)
[pool-1-thread-3] Test testListObjectaclResponseIs4xx(org.jclouds.googlecloudstorage.features.ObjectAccessControlsApiExpectTest)
succeeded: 1697ms
Test suite progress: tests succeeded: 49, failed: 0, skipped: 0.
Starting test testPatchObjectaclWithNoOptionsResponseIs2xx(org.jclouds.googlecloudstorage.features.ObjectAccessControlsApiExpectTest)
[pool-1-thread-4] Test testGetObjectaclWithNoOptionsResponseIs2xx(org.jclouds.googlecloudstorage.features.ObjectAccessControlsApiExpectTest)
succeeded: 3542ms
Test suite progress: tests succeeded: 50, failed: 0, skipped: 0.
Starting test testPatchObjectaclWithOptionsResponseIs2xx(org.jclouds.googlecloudstorage.features.ObjectAccessControlsApiExpectTest)
[pool-1-thread-1] Test testInsertObjectaclWithOptionsResponseIs2xx(org.jclouds.googlecloudstorage.features.ObjectAccessControlsApiExpectTest)
succeeded: 3090ms
Test suite progress: tests succeeded: 51, failed: 0, skipped: 0.
Starting test testUpdateObjectaclWithNoOptionsResponseIs2xx(org.jclouds.googlecloudstorage.features.ObjectAccessControlsApiExpectTest)
[pool-1-thread-5] Test testListObjectaclWithOptionsResponseIs2xx(org.jclouds.googlecloudstorage.features.ObjectAccessControlsApiExpectTest)
succeeded: 1498ms
Test suite progress: tests succeeded: 52, failed: 0, skipped: 0.
Starting test testUpdateObjectaclWithOptionsResponseIs2xx(org.jclouds.googlecloudstorage.features.ObjectAccessControlsApiExpectTest)
[pool-1-thread-2] Test testListObjectaclWithNoOptionsResponseIs2xx(org.jclouds.googlecloudstorage.features.ObjectAccessControlsApiExpectTest)
succeeded: 2229ms
Test suite progress: tests succeeded: 53, failed: 0, skipped: 0.
[pool-1-thread-3] Test testPatchObjectaclWithNoOptionsResponseIs2xx(org.jclouds.googlecloudstorage.features.ObjectAccessControlsApiExpectTest)
succeeded: 1960ms
Test suite progress: tests succeeded: 54, failed: 0, skipped: 0.
[pool-1-thread-4] Test testPatchObjectaclWithOptionsResponseIs2xx(org.jclouds.googlecloudstorage.features.ObjectAccessControlsApiExpectTest)
succeeded: 1789ms
Test suite progress: tests succeeded: 55, failed: 0, skipped: 0.
[pool-1-thread-5] Test testUpdateObjectaclWithOptionsResponseIs2xx(org.jclouds.googlecloudstorage.features.ObjectAccessControlsApiExpectTest)
succeeded: 1550ms
Test suite progress: tests succeeded: 56, failed: 0, skipped: 0.
[pool-1-thread-1] Test testUpdateObjectaclWithNoOptionsResponseIs2xx(org.jclouds.googlecloudstorage.features.ObjectAccessControlsApiExpectTest)
succeeded: 1863ms
Test suite progress: tests succeeded: 57, failed: 0, skipped: 0.
Starting test testAllContains(org.jclouds.googlecloudstorage.GoogleCloudStorageApiMetadataTest)
Starting test testTransformableToContains(org.jclouds.googlecloudstorage.GoogleCloudStorageApiMetadataTest)
[pool-2-thread-2] Test testTransformableToContains(org.jclouds.googlecloudstorage.GoogleCloudStorageApiMetadataTest)
succeeded: 1ms
Test suite progress: tests succeeded: 58, failed: 0, skipped: 0.
Starting test testWithId(org.jclouds.googlecloudstorage.GoogleCloudStorageApiMetadataTest)
[pool-2-thread-1] Test testAllContains(org.jclouds.googlecloudstorage.GoogleCloudStorageApiMetadataTest)
succeeded: 89ms
Test suite progress: tests succeeded: 59, failed: 0, skipped: 0.
[pool-2-thread-3] Test testWithId(org.jclouds.googlecloudstorage.GoogleCloudStorageApiMetadataTest)
succeeded: 83ms
Test suite progress: tests succeeded: 60, failed: 0, skipped: 0.
Starting test test404MakesResourceNotFoundException(org.jclouds.googlecloudstorage.handlers.GoogleCloudStorageErrorHandlerTest)
Starting test test403MakesAuthorizationException(org.jclouds.googlecloudstorage.handlers.GoogleCloudStorageErrorHandlerTest)
Starting test test409MakesIllegalStateException(org.jclouds.googlecloudstorage.handlers.GoogleCloudStorageErrorHandlerTest)
[pool-3-thread-3] Test test404MakesResourceNotFoundException(org.jclouds.googlecloudstorage.handlers.GoogleCloudStorageErrorHandlerTest)
succeeded: 45ms
Test suite progress: tests succeeded: 61, failed: 0, skipped: 0.
Starting test test401MakesAuthorizationException(org.jclouds.googlecloudstorage.handlers.GoogleCloudStorageErrorHandlerTest)
[pool-3-thread-1] Test test401MakesAuthorizationException(org.jclouds.googlecloudstorage.handlers.GoogleCloudStorageErrorHandlerTest)
succeeded: 4ms
Test suite progress: tests succeeded: 62, failed: 0, skipped: 0.
[pool-3-thread-2] Test test403MakesAuthorizationException(org.jclouds.googlecloudstorage.handlers.GoogleCloudStorageErrorHandlerTest)
succeeded: 100ms
Test suite progress: tests succeeded: 63, failed: 0, skipped: 0.
[pool-3-thread-4] Test test409MakesIllegalStateException(org.jclouds.googlecloudstorage.handlers.GoogleCloudStorageErrorHandlerTest)
succeeded: 101ms
Test suite progress: tests succeeded: 64, failed: 0, skipped: 0.
Tests run: 64, Failures: 0, Errors: 0, Skipped: 0, Time elapsed: 38.046 sec - in TestSuite

Results :

Tests run: 64, Failures: 0, Errors: 0, Skipped: 0

[JENKINS] Recording test results
[INFO] 
[INFO] --- maven-jar-plugin:2.4:jar (default-jar) @ google-cloud-storage ---
[INFO] Building jar: <https://buildhive.cloudbees.com/job/jclouds/job/jclouds-labs-google/ws/google-cloud-storage/target/google-cloud-storage-2.0.0-SNAPSHOT.jar>
[INFO] 
[INFO] --- maven-site-plugin:3.3:attach-descriptor (attach-descriptor) @ google-cloud-storage
---
[INFO] 
[INFO] --- apache-rat-plugin:0.10:check (default) @ google-cloud-storage ---
[INFO] 51 implicit excludes (use -debug for more details).
[INFO] Exclude: **/src/test/resources/**/*.sh
[INFO] Exclude: **/src/test/resources/**/*.bat
[INFO] Exclude: **/src/test/resources/**/*.cmd
[INFO] Exclude: **/src/test/resources/**/*.txt
[INFO] Exclude: **/src/test/resources/**/*.gz
[INFO] Exclude: **/src/test/resources/**/*.xml
[INFO] Exclude: **/services/*LoggingModule
[INFO] Exclude: **/services/*ApiMetadata
[INFO] Exclude: **/services/*ProviderMetadata
[INFO] Exclude: **/LICENSE.txt
[INFO] Exclude: **/header.txt
[INFO] Exclude: **/NOTICE.txt
[INFO] Exclude: **/DISCLAIMER
[INFO] Exclude: **/BUILD.txt
[INFO] Exclude: **/CHANGES.txt
[INFO] Exclude: **/README.md
[INFO] Exclude: **/README.txt
[INFO] Exclude: **/DEPENDENCIES
[INFO] Exclude: **/CONTRIBUTING.md
[INFO] Exclude: **/*json
[INFO] Exclude: **/*readme
[INFO] Exclude: **/test
[INFO] Exclude: **/test.pub
[INFO] Exclude: **/target/**
[INFO] Exclude: **/test-output/**
[INFO] Exclude: **/bin/**
[INFO] Exclude: **/.settings/**
[INFO] Exclude: **/.classpath
[INFO] Exclude: **/.dir-locals.el
[INFO] Exclude: **/.project
[INFO] Exclude: **/.idea/**
[INFO] Exclude: **/*.iml
[INFO] Exclude: **/*.eml
[INFO] Exclude: **/*.ipr
[INFO] Exclude: **/*.iws
[INFO] Exclude: **/*.DS_STORE
[INFO] Exclude: **/TAGS
[INFO] Exclude: **/.metadata/**
[INFO] Exclude: **/atlassian-ide-plugin.xml
[INFO] Exclude: **/.DS_Store
[INFO] Exclude: .mailmap
[INFO] Exclude: .git/**
[INFO] Exclude: **/.gitignore
[INFO] Exclude: **/.gitattributes
[INFO] Exclude: **/.java-version
[INFO] Exclude: **/modernizer_exclusions.txt
[INFO] Exclude: .repository/**
[INFO] Exclude: gc.log
[INFO] 94 resources included (use -debug for more details)
Warning:  org.apache.xerces.jaxp.SAXParserImpl$JAXPSAXParser: Property 'http://www.oracle.com/xml/jaxp/properties/entityExpansionLimit'
is not recognized.
Compiler warnings:
  WARNING:  'org.apache.xerces.jaxp.SAXParserImpl: Property 'http://javax.xml.XMLConstants/property/accessExternalDTD'
is not recognized.'
Warning:  org.apache.xerces.parsers.SAXParser: Feature 'http://javax.xml.XMLConstants/feature/secure-processing'
is not recognized.
Warning:  org.apache.xerces.parsers.SAXParser: Property 'http://javax.xml.XMLConstants/property/accessExternalDTD'
is not recognized.
Warning:  org.apache.xerces.parsers.SAXParser: Property 'http://www.oracle.com/xml/jaxp/properties/entityExpansionLimit'
is not recognized.
[INFO] Rat check: Summary of files. Unapproved: 0 unknown: 0 generated: 0 approved: 94 licence.
[INFO] 
[INFO] --- maven-jar-plugin:2.4:test-jar (default) @ google-cloud-storage ---
[INFO] Building jar: <https://buildhive.cloudbees.com/job/jclouds/job/jclouds-labs-google/ws/google-cloud-storage/target/google-cloud-storage-2.0.0-SNAPSHOT-tests.jar>
[INFO] 
[INFO] --- maven-surefire-plugin:2.17:test (integration) @ google-cloud-storage ---
[JENKINS] Recording test results[INFO] 
[INFO] --- maven-duplicate-finder-plugin:1.0.5:check (default) @ google-cloud-storage ---

[INFO] Checking compile classpath
[INFO] Checking runtime classpath
[INFO] Checking test classpath
[INFO] 
[INFO] --- maven-checkstyle-plugin:2.13:check (default) @ google-cloud-storage ---
[INFO] 
[WARNING] SequentialMultipartUploadStrategy.java[23:8] (imports) UnusedImports: Unused import
- javax.annotation.Resource.
[WARNING] SequentialMultipartUploadStrategy.java[24:8] (imports) UnusedImports: Unused import
- javax.inject.Named.
[WARNING] SequentialMultipartUploadStrategy.java[29:8] (imports) UnusedImports: Unused import
- org.jclouds.blobstore.reference.BlobStoreConstants.
[WARNING] SequentialMultipartUploadStrategy.java[37:8] (imports) UnusedImports: Unused import
- org.jclouds.logging.Logger.
[WARNING] GCSBlobStore.java[26:8] (imports) UnusedImports: Unused import - javax.inject.Singleton.
[INFO] ------------------------------------------------------------------------
[INFO] Reactor Summary:
[INFO] 
[INFO] Apache jclouds labs google ........................ SUCCESS [35.837s]
[INFO] jclouds OAuth core ................................ SUCCESS [49.656s]
[INFO] jclouds Google Compute Engine provider ............ SUCCESS [2:33.535s]
[INFO] jclouds Google Cloud Storage provider ............. FAILURE [53.089s]
[INFO] ------------------------------------------------------------------------
[INFO] BUILD FAILURE
[INFO] ------------------------------------------------------------------------
[INFO] Total time: 5:01.856s
[INFO] Finished at: Tue Nov 04 04:56:08 UTC 2014
[INFO] Final Memory: 50M/145M
[INFO] ------------------------------------------------------------------------
[ERROR] Failed to execute goal org.apache.maven.plugins:maven-checkstyle-plugin:2.13:check
(default) on project google-cloud-storage: You have 5 Checkstyle violations. -> [Help 1]
org.apache.maven.lifecycle.LifecycleExecutionException: Failed to execute goal org.apache.maven.plugins:maven-checkstyle-plugin:2.13:check
(default) on project google-cloud-storage: You have 5 Checkstyle violations.
	at org.apache.maven.lifecycle.internal.MojoExecutor.execute(MojoExecutor.java:212)
	at org.apache.maven.lifecycle.internal.MojoExecutor.execute(MojoExecutor.java:153)
	at org.apache.maven.lifecycle.internal.MojoExecutor.execute(MojoExecutor.java:145)
	at org.apache.maven.lifecycle.internal.LifecycleModuleBuilder.buildProject(LifecycleModuleBuilder.java:84)
	at org.apache.maven.lifecycle.internal.LifecycleModuleBuilder.buildProject(LifecycleModuleBuilder.java:59)
	at org.apache.maven.lifecycle.internal.LifecycleStarter.singleThreadedBuild(LifecycleStarter.java:183)
	at org.apache.maven.lifecycle.internal.LifecycleStarter.execute(LifecycleStarter.java:161)
	at org.apache.maven.DefaultMaven.doExecute(DefaultMaven.java:317)
	at org.apache.maven.DefaultMaven.execute(DefaultMaven.java:152)
	at org.jvnet.hudson.maven3.launcher.Maven31Launcher.main(Maven31Launcher.java:132)
	at sun.reflect.NativeMethodAccessorImpl.invoke0(Native Method)
	at sun.reflect.NativeMethodAccessorImpl.invoke(NativeMethodAccessorImpl.java:57)
	at sun.reflect.DelegatingMethodAccessorImpl.invoke(DelegatingMethodAccessorImpl.java:43)
	at java.lang.reflect.Method.invoke(Method.java:606)
	at org.codehaus.plexus.classworlds.launcher.Launcher.launchStandard(Launcher.java:330)
	at org.codehaus.plexus.classworlds.launcher.Launcher.launch(Launcher.java:238)
	at jenkins.maven3.agent.Maven31Main.launch(Maven31Main.java:181)
	at sun.reflect.NativeMethodAccessorImpl.invoke0(Native Method)
	at sun.reflect.NativeMethodAccessorImpl.invoke(NativeMethodAccessorImpl.java:57)
	at sun.reflect.DelegatingMethodAccessorImpl.invoke(DelegatingMethodAccessorImpl.java:43)
	at java.lang.reflect.Method.invoke(Method.java:606)
	at hudson.maven.Maven3Builder.call(Maven3Builder.java:134)
	at hudson.maven.Maven3Builder.call(Maven3Builder.java:69)
	at hudson.remoting.UserRequest.perform(UserRequest.java:118)
	at hudson.remoting.UserRequest.perform(UserRequest.java:48)
	at hudson.remoting.Request$2.run(Request.java:328)
	at hudson.remoting.InterceptingExecutorService$1.call(InterceptingExecutorService.java:72)
	at java.util.concurrent.FutureTask.run(FutureTask.java:262)
	at java.util.concurrent.ThreadPoolExecutor.runWorker(ThreadPoolExecutor.java:1145)
	at java.util.concurrent.ThreadPoolExecutor$Worker.run(ThreadPoolExecutor.java:615)
	at java.lang.Thread.run(Thread.java:744)
Caused by: org.apache.maven.plugin.MojoFailureException: You have 5 Checkstyle violations.
	at org.apache.maven.plugin.checkstyle.CheckstyleViolationCheckMojo.execute(CheckstyleViolationCheckMojo.java:582)
	at org.apache.maven.plugin.DefaultBuildPluginManager.executeMojo(DefaultBuildPluginManager.java:106)
	at org.apache.maven.lifecycle.internal.MojoExecutor.execute(MojoExecutor.java:208)
	... 30 more
[ERROR] 
[ERROR] Re-run Maven using the -X switch to enable full debug logging.
[ERROR] 
[ERROR] For more information about the errors and possible solutions, please read the following
articles:
[ERROR] [Help 1] http://cwiki.apache.org/confluence/display/MAVEN/MojoFailureException
[ERROR] 
[ERROR] After correcting the problems, you can resume the build with the command
[ERROR]   mvn <goals> -rf :google-cloud-storage
[JENKINS] Archiving <https://buildhive.cloudbees.com/job/jclouds/job/jclouds-labs-google/ws/pom.xml>
to org.apache.jclouds.labs/jclouds-labs-google/2.0.0-SNAPSHOT/jclouds-labs-google-2.0.0-SNAPSHOT.pom
[JENKINS] Archiving <https://buildhive.cloudbees.com/job/jclouds/job/jclouds-labs-google/ws/target/jclouds-labs-google-2.0.0-SNAPSHOT-tests.jar>
to org.apache.jclouds.labs/jclouds-labs-google/2.0.0-SNAPSHOT/jclouds-labs-google-2.0.0-SNAPSHOT-tests.jar
[JENKINS] Archiving <https://buildhive.cloudbees.com/job/jclouds/job/jclouds-labs-google/ws/google-cloud-storage/pom.xml>
to org.apache.jclouds.labs/google-cloud-storage/2.0.0-SNAPSHOT/google-cloud-storage-2.0.0-SNAPSHOT.pom
[JENKINS] Archiving <https://buildhive.cloudbees.com/job/jclouds/job/jclouds-labs-google/ws/google-cloud-storage/target/google-cloud-storage-2.0.0-SNAPSHOT.jar>
to org.apache.jclouds.labs/google-cloud-storage/2.0.0-SNAPSHOT/google-cloud-storage-2.0.0-SNAPSHOT.jar
[JENKINS] Archiving <https://buildhive.cloudbees.com/job/jclouds/job/jclouds-labs-google/ws/google-cloud-storage/target/google-cloud-storage-2.0.0-SNAPSHOT-tests.jar>
to org.apache.jclouds.labs/google-cloud-storage/2.0.0-SNAPSHOT/google-cloud-storage-2.0.0-SNAPSHOT-tests.jar
[JENKINS] Archiving <https://buildhive.cloudbees.com/job/jclouds/job/jclouds-labs-google/ws/google-compute-engine/pom.xml>
to org.apache.jclouds.labs/google-compute-engine/2.0.0-SNAPSHOT/google-compute-engine-2.0.0-SNAPSHOT.pom
[JENKINS] Archiving <https://buildhive.cloudbees.com/job/jclouds/job/jclouds-labs-google/ws/google-compute-engine/target/google-compute-engine-2.0.0-SNAPSHOT.jar>
to org.apache.jclouds.labs/google-compute-engine/2.0.0-SNAPSHOT/google-compute-engine-2.0.0-SNAPSHOT.jar
[JENKINS] Archiving <https://buildhive.cloudbees.com/job/jclouds/job/jclouds-labs-google/ws/google-compute-engine/target/google-compute-engine-2.0.0-SNAPSHOT-tests.jar>
to org.apache.jclouds.labs/google-compute-engine/2.0.0-SNAPSHOT/google-compute-engine-2.0.0-SNAPSHOT-tests.jar
[JENKINS] Archiving <https://buildhive.cloudbees.com/job/jclouds/job/jclouds-labs-google/ws/oauth/pom.xml>
to org.apache.jclouds.labs/oauth/2.0.0-SNAPSHOT/oauth-2.0.0-SNAPSHOT.pom
[JENKINS] Archiving <https://buildhive.cloudbees.com/job/jclouds/job/jclouds-labs-google/ws/oauth/target/oauth-2.0.0-SNAPSHOT.jar>
to org.apache.jclouds.labs/oauth/2.0.0-SNAPSHOT/oauth-2.0.0-SNAPSHOT.jar
[JENKINS] Archiving <https://buildhive.cloudbees.com/job/jclouds/job/jclouds-labs-google/ws/oauth/target/oauth-2.0.0-SNAPSHOT-tests.jar>
to org.apache.jclouds.labs/oauth/2.0.0-SNAPSHOT/oauth-2.0.0-SNAPSHOT-tests.jar
channel stopped

Mime
View raw message