jclouds-notifications mailing list archives

Site index · List index
Message view « Date » · « Thread »
Top « Date » · « Thread »
From jenkins-no-re...@cloudbees.com
Subject Build failed in Jenkins: jclouds-labs #680
Date Sat, 29 Nov 2014 22:53:23 GMT
See <https://jclouds.ci.cloudbees.com/job/jclouds-labs/680/>

------------------------------------------
Started by upstream project "jclouds" build number 2861
originally caused by:
 Started by user Ignasi Barrera
Building remotely on s-95eb5a70 (m1.small swarm) in workspace <https://jclouds.ci.cloudbees.com/job/jclouds-labs/ws/>
$ sudo /opt/jenkins/sbin/mount-webdav https://repository-jclouds.forge.cloudbees.com/private
jclouds alert
webdav mount try 1
Private webdav filestore is mounted
Cloning the remote Git repository
Cloning repository https://git-wip-us.apache.org/repos/asf/jclouds-labs.git
Fetching upstream changes from https://git-wip-us.apache.org/repos/asf/jclouds-labs.git
Fetching upstream changes from https://git-wip-us.apache.org/repos/asf/jclouds-labs.git
Checking out Revision 1b689dc17ff1cc78e981ca87e13094b47109d3fa (origin/master)
Parsing POMs
Failed to transfer Could not find metadata org.apache.jclouds:jclouds-project:2.0.0-SNAPSHOT/maven-metadata.xml
in cloudbees-private-snapshot-repository (https://repository-jclouds.forge.cloudbees.com/snapshot)
Failed to transfer Could not find metadata org.apache.jclouds:jclouds-project:2.0.0-SNAPSHOT/maven-metadata.xml
in sonatype-nexus-snapshots (https://oss.sonatype.org/content/repositories/snapshots)
Downloaded artifact https://repository.apache.org/content/repositories/snapshots/org/apache/jclouds/jclouds-project/2.0.0-SNAPSHOT/maven-metadata.xml
Downloaded artifact https://repository.apache.org/content/repositories/snapshots/org/apache/jclouds/jclouds-project/2.0.0-SNAPSHOT/jclouds-project-2.0.0-20141129.220729-149.pom
Failed to transfer Could not find artifact org.apache:apache:pom:14 in central (http://repo.cloudbees.com/content/repositories/central)
Failed to transfer Could not find artifact org.apache:apache:pom:14 in cloudbees-private-release-repository
(https://repository-jclouds.forge.cloudbees.com/release)
ERROR: Failed to parse POMs
java.io.IOException: remote file operation failed: <https://jclouds.ci.cloudbees.com/job/jclouds-labs/ws/>
at hudson.remoting.Channel@5724729d:s-95eb5a70: hudson.remoting.ProxyException: hudson.maven.MavenModuleSetBuild$MavenExecutionException:
org.apache.maven.project.ProjectBuildingException: Some problems were encountered while processing
the POMs:
[FATAL] Non-resolvable parent POM for org.apache.jclouds:jclouds-project:2.0.0-SNAPSHOT: Could
not find artifact org.apache:apache:pom:14 in central (http://repo.cloudbees.com/content/repositories/central)
@ org.apache.jclouds:jclouds-project:2.0.0-SNAPSHOT, <https://jclouds.ci.cloudbees.com/job/jclouds-labs/ws/.repository/org/apache/jclouds/jclouds-project/2.0.0-SNAPSHOT/jclouds-project-2.0.0-SNAPSHOT.pom,>
line 22, column 11

	at hudson.FilePath.act(FilePath.java:974)
	at hudson.FilePath.act(FilePath.java:951)
	at hudson.maven.MavenModuleSetBuild$MavenModuleSetBuildExecution.parsePoms(MavenModuleSetBuild.java:953)
	at hudson.maven.MavenModuleSetBuild$MavenModuleSetBuildExecution.doRun(MavenModuleSetBuild.java:681)
	at hudson.model.AbstractBuild$AbstractBuildExecution.run(AbstractBuild.java:606)
	at hudson.model.Run.execute(Run.java:1684)
	at hudson.maven.MavenModuleSetBuild.run(MavenModuleSetBuild.java:529)
	at hudson.model.ResourceController.execute(ResourceController.java:88)
	at hudson.model.Executor.run(Executor.java:232)
Caused by: hudson.remoting.ProxyException: hudson.maven.MavenModuleSetBuild$MavenExecutionException:
org.apache.maven.project.ProjectBuildingException: Some problems were encountered while processing
the POMs:
[FATAL] Non-resolvable parent POM for org.apache.jclouds:jclouds-project:2.0.0-SNAPSHOT: Could
not find artifact org.apache:apache:pom:14 in central (http://repo.cloudbees.com/content/repositories/central)
@ org.apache.jclouds:jclouds-project:2.0.0-SNAPSHOT, <https://jclouds.ci.cloudbees.com/job/jclouds-labs/ws/.repository/org/apache/jclouds/jclouds-project/2.0.0-SNAPSHOT/jclouds-project-2.0.0-SNAPSHOT.pom,>
line 22, column 11

	at hudson.maven.MavenModuleSetBuild$PomParser.invoke(MavenModuleSetBuild.java:1357)
	at hudson.maven.MavenModuleSetBuild$PomParser.invoke(MavenModuleSetBuild.java:1091)
	at hudson.FilePath$FileCallableWrapper.call(FilePath.java:2557)
	at hudson.remoting.UserRequest.perform(UserRequest.java:121)
	at hudson.remoting.UserRequest.perform(UserRequest.java:49)
	at hudson.remoting.Request$2.run(Request.java:324)
	at hudson.remoting.InterceptingExecutorService$1.call(InterceptingExecutorService.java:68)
	at java.util.concurrent.FutureTask.run(FutureTask.java:262)
	at java.util.concurrent.ThreadPoolExecutor.runWorker(ThreadPoolExecutor.java:1145)
	at java.util.concurrent.ThreadPoolExecutor$Worker.run(ThreadPoolExecutor.java:615)
	at java.lang.Thread.run(Thread.java:744)
	at ......remote call to s-95eb5a70(Native Method)
	at hudson.remoting.Channel.attachCallSiteStackTrace(Channel.java:1356)
	at hudson.remoting.UserResponse.retrieve(UserRequest.java:221)
	at hudson.remoting.Channel.call(Channel.java:752)
	at hudson.FilePath.act(FilePath.java:967)
	... 8 more
Caused by: hudson.remoting.ProxyException: org.apache.maven.project.ProjectBuildingException:
Some problems were encountered while processing the POMs:
[FATAL] Non-resolvable parent POM for org.apache.jclouds:jclouds-project:2.0.0-SNAPSHOT: Could
not find artifact org.apache:apache:pom:14 in central (http://repo.cloudbees.com/content/repositories/central)
@ org.apache.jclouds:jclouds-project:2.0.0-SNAPSHOT, <https://jclouds.ci.cloudbees.com/job/jclouds-labs/ws/.repository/org/apache/jclouds/jclouds-project/2.0.0-SNAPSHOT/jclouds-project-2.0.0-SNAPSHOT.pom,>
line 22, column 11

	at org.apache.maven.project.DefaultProjectBuilder.build(DefaultProjectBuilder.java:364)
	at hudson.maven.MavenEmbedder.buildProjects(MavenEmbedder.java:361)
	at hudson.maven.MavenEmbedder.readProjects(MavenEmbedder.java:331)
	at hudson.maven.MavenModuleSetBuild$PomParser.invoke(MavenModuleSetBuild.java:1294)
	at hudson.maven.MavenModuleSetBuild$PomParser.invoke(MavenModuleSetBuild.java:1091)
	at hudson.FilePath$FileCallableWrapper.call(FilePath.java:2557)
	at hudson.remoting.UserRequest.perform(UserRequest.java:121)
	at hudson.remoting.UserRequest.perform(UserRequest.java:49)
	at hudson.remoting.Request$2.run(Request.java:324)
	at hudson.remoting.InterceptingExecutorService$1.call(InterceptingExecutorService.java:68)
	at java.util.concurrent.FutureTask.run(FutureTask.java:262)
	at java.util.concurrent.ThreadPoolExecutor.runWorker(ThreadPoolExecutor.java:1145)
	at java.util.concurrent.ThreadPoolExecutor$Worker.run(ThreadPoolExecutor.java:615)
	at java.lang.Thread.run(Thread.java:744)

Mime
View raw message