jclouds-notifications mailing list archives

Site index · List index
Message view « Date » · « Thread »
Top « Date » · « Thread »
From jenkins-no-re...@cloudbees.com
Subject Build failed in Jenkins: jclouds #2860
Date Fri, 28 Nov 2014 23:51:39 GMT
See <https://jclouds.ci.cloudbees.com/job/jclouds/2860/changes>

Changes:

[Adrian Cole] JCLOUDS-523 fix typo in implementation.

------------------------------------------
[...truncated 957 lines...]
	at org.testng.TestRunner.init(TestRunner.java:235)
	at org.testng.TestRunner.init(TestRunner.java:205)
	at org.testng.TestRunner.<init>(TestRunner.java:153)
	at org.testng.SuiteRunner$DefaultTestRunnerFactory.newTestRunner(SuiteRunner.java:536)
	at org.testng.SuiteRunner.init(SuiteRunner.java:159)
	at org.testng.SuiteRunner.<init>(SuiteRunner.java:113)
	at org.testng.TestNG.createSuiteRunner(TestNG.java:1299)
	at org.testng.TestNG.createSuiteRunners(TestNG.java:1286)
	at org.testng.TestNG.runSuitesLocally(TestNG.java:1140)
	at org.testng.TestNG.run(TestNG.java:1057)
	at org.apache.maven.surefire.testng.TestNGExecutor.run(TestNGExecutor.java:115)
	at org.apache.maven.surefire.testng.TestNGDirectoryTestSuite.executeMulti(TestNGDirectoryTestSuite.java:204)
	at org.apache.maven.surefire.testng.TestNGDirectoryTestSuite.execute(TestNGDirectoryTestSuite.java:107)
	at org.apache.maven.surefire.testng.TestNGProvider.invoke(TestNGProvider.java:112)
	at org.apache.maven.surefire.booter.ForkedBooter.invokeProviderInSameClassLoader(ForkedBooter.java:200)
	at org.apache.maven.surefire.booter.ForkedBooter.runSuitesInProcess(ForkedBooter.java:153)
	at org.apache.maven.surefire.booter.ForkedBooter.main(ForkedBooter.java:103)

	at org.apache.maven.lifecycle.internal.MojoExecutor.execute(MojoExecutor.java:225)
	at org.apache.maven.lifecycle.internal.MojoExecutor.execute(MojoExecutor.java:153)
	at org.apache.maven.lifecycle.internal.MojoExecutor.execute(MojoExecutor.java:145)
	at org.apache.maven.lifecycle.internal.LifecycleModuleBuilder.buildProject(LifecycleModuleBuilder.java:84)
	at org.apache.maven.lifecycle.internal.LifecycleModuleBuilder.buildProject(LifecycleModuleBuilder.java:59)
	at org.apache.maven.lifecycle.internal.LifecycleStarter.singleThreadedBuild(LifecycleStarter.java:183)
	at org.apache.maven.lifecycle.internal.LifecycleStarter.execute(LifecycleStarter.java:161)
	at org.apache.maven.DefaultMaven.doExecute(DefaultMaven.java:320)
	at org.apache.maven.DefaultMaven.execute(DefaultMaven.java:156)
	at org.jvnet.hudson.maven3.launcher.Maven3Launcher.main(Maven3Launcher.java:117)
	at sun.reflect.NativeMethodAccessorImpl.invoke0(Native Method)
	at sun.reflect.NativeMethodAccessorImpl.invoke(NativeMethodAccessorImpl.java:39)
	at sun.reflect.DelegatingMethodAccessorImpl.invoke(DelegatingMethodAccessorImpl.java:25)
	at java.lang.reflect.Method.invoke(Method.java:597)
	at org.codehaus.plexus.classworlds.launcher.Launcher.launchStandard(Launcher.java:329)
	at org.codehaus.plexus.classworlds.launcher.Launcher.launch(Launcher.java:239)
	at org.jvnet.hudson.maven3.agent.Maven3Main.launch(Maven3Main.java:178)
	at sun.reflect.NativeMethodAccessorImpl.invoke0(Native Method)
	at sun.reflect.NativeMethodAccessorImpl.invoke(NativeMethodAccessorImpl.java:39)
	at sun.reflect.DelegatingMethodAccessorImpl.invoke(DelegatingMethodAccessorImpl.java:25)
	at java.lang.reflect.Method.invoke(Method.java:597)
	at hudson.maven.Maven3Builder.call(Maven3Builder.java:134)
	at hudson.maven.Maven3Builder.call(Maven3Builder.java:69)
	at hudson.remoting.UserRequest.perform(UserRequest.java:121)
	at hudson.remoting.UserRequest.perform(UserRequest.java:49)
	at hudson.remoting.Request$2.run(Request.java:324)
	at hudson.remoting.InterceptingExecutorService$1.call(InterceptingExecutorService.java:68)
	at java.util.concurrent.FutureTask$Sync.innerRun(FutureTask.java:303)
	at java.util.concurrent.FutureTask.run(FutureTask.java:138)
	at java.util.concurrent.ThreadPoolExecutor$Worker.runTask(ThreadPoolExecutor.java:895)
	at java.util.concurrent.ThreadPoolExecutor$Worker.run(ThreadPoolExecutor.java:918)
	at java.lang.Thread.run(Thread.java:662)
Caused by: org.apache.maven.plugin.PluginExecutionException: Execution default-test of goal
org.apache.maven.plugins:maven-surefire-plugin:2.17:test failed: There was an error in the
forked process
java.lang.UnsupportedClassVersionError: com/squareup/okhttp/mockwebserver/MockResponse : Unsupported
major.minor version 51.0
	at java.lang.ClassLoader.defineClass1(Native Method)
	at java.lang.ClassLoader.defineClassCond(ClassLoader.java:631)
	at java.lang.ClassLoader.defineClass(ClassLoader.java:615)
	at java.security.SecureClassLoader.defineClass(SecureClassLoader.java:141)
	at java.net.URLClassLoader.defineClass(URLClassLoader.java:283)
	at java.net.URLClassLoader.access$000(URLClassLoader.java:58)
	at java.net.URLClassLoader$1.run(URLClassLoader.java:197)
	at java.security.AccessController.doPrivileged(Native Method)
	at java.net.URLClassLoader.findClass(URLClassLoader.java:190)
	at java.lang.ClassLoader.loadClass(ClassLoader.java:306)
	at sun.misc.Launcher$AppClassLoader.loadClass(Launcher.java:301)
	at java.lang.ClassLoader.loadClass(ClassLoader.java:247)
	at java.lang.Class.getDeclaredMethods0(Native Method)
	at java.lang.Class.privateGetDeclaredMethods(Class.java:2436)
	at java.lang.Class.getDeclaredMethods(Class.java:1793)
	at org.testng.internal.annotations.AnnotationHelper.findMethodsWithAnnotation(AnnotationHelper.java:214)
	at org.testng.internal.TestNGMethodFinder.getTestMethods(TestNGMethodFinder.java:48)
	at org.testng.TestClass.initMethods(TestClass.java:123)
	at org.testng.TestClass.init(TestClass.java:86)
	at org.testng.TestClass.<init>(TestClass.java:45)
	at org.testng.TestRunner.initMethods(TestRunner.java:427)
	at org.testng.TestRunner.init(TestRunner.java:235)
	at org.testng.TestRunner.init(TestRunner.java:205)
	at org.testng.TestRunner.<init>(TestRunner.java:153)
	at org.testng.SuiteRunner$DefaultTestRunnerFactory.newTestRunner(SuiteRunner.java:536)
	at org.testng.SuiteRunner.init(SuiteRunner.java:159)
	at org.testng.SuiteRunner.<init>(SuiteRunner.java:113)
	at org.testng.TestNG.createSuiteRunner(TestNG.java:1299)
	at org.testng.TestNG.createSuiteRunners(TestNG.java:1286)
	at org.testng.TestNG.runSuitesLocally(TestNG.java:1140)
	at org.testng.TestNG.run(TestNG.java:1057)
	at org.apache.maven.surefire.testng.TestNGExecutor.run(TestNGExecutor.java:115)
	at org.apache.maven.surefire.testng.TestNGDirectoryTestSuite.executeMulti(TestNGDirectoryTestSuite.java:204)
	at org.apache.maven.surefire.testng.TestNGDirectoryTestSuite.execute(TestNGDirectoryTestSuite.java:107)
	at org.apache.maven.surefire.testng.TestNGProvider.invoke(TestNGProvider.java:112)
	at org.apache.maven.surefire.booter.ForkedBooter.invokeProviderInSameClassLoader(ForkedBooter.java:200)
	at org.apache.maven.surefire.booter.ForkedBooter.runSuitesInProcess(ForkedBooter.java:153)
	at org.apache.maven.surefire.booter.ForkedBooter.main(ForkedBooter.java:103)

	at org.apache.maven.plugin.DefaultBuildPluginManager.executeMojo(DefaultBuildPluginManager.java:110)
	at org.apache.maven.lifecycle.internal.MojoExecutor.execute(MojoExecutor.java:209)
	... 31 more
Caused by: java.lang.RuntimeException: There was an error in the forked process
java.lang.UnsupportedClassVersionError: com/squareup/okhttp/mockwebserver/MockResponse : Unsupported
major.minor version 51.0
	at java.lang.ClassLoader.defineClass1(Native Method)
	at java.lang.ClassLoader.defineClassCond(ClassLoader.java:631)
	at java.lang.ClassLoader.defineClass(ClassLoader.java:615)
	at java.security.SecureClassLoader.defineClass(SecureClassLoader.java:141)
	at java.net.URLClassLoader.defineClass(URLClassLoader.java:283)
	at java.net.URLClassLoader.access$000(URLClassLoader.java:58)
	at java.net.URLClassLoader$1.run(URLClassLoader.java:197)
	at java.security.AccessController.doPrivileged(Native Method)
	at java.net.URLClassLoader.findClass(URLClassLoader.java:190)
	at java.lang.ClassLoader.loadClass(ClassLoader.java:306)
	at sun.misc.Launcher$AppClassLoader.loadClass(Launcher.java:301)
	at java.lang.ClassLoader.loadClass(ClassLoader.java:247)
	at java.lang.Class.getDeclaredMethods0(Native Method)
	at java.lang.Class.privateGetDeclaredMethods(Class.java:2436)
	at java.lang.Class.getDeclaredMethods(Class.java:1793)
	at org.testng.internal.annotations.AnnotationHelper.findMethodsWithAnnotation(AnnotationHelper.java:214)
	at org.testng.internal.TestNGMethodFinder.getTestMethods(TestNGMethodFinder.java:48)
	at org.testng.TestClass.initMethods(TestClass.java:123)
	at org.testng.TestClass.init(TestClass.java:86)
	at org.testng.TestClass.<init>(TestClass.java:45)
	at org.testng.TestRunner.initMethods(TestRunner.java:427)
	at org.testng.TestRunner.init(TestRunner.java:235)
	at org.testng.TestRunner.init(TestRunner.java:205)
	at org.testng.TestRunner.<init>(TestRunner.java:153)
	at org.testng.SuiteRunner$DefaultTestRunnerFactory.newTestRunner(SuiteRunner.java:536)
	at org.testng.SuiteRunner.init(SuiteRunner.java:159)
	at org.testng.SuiteRunner.<init>(SuiteRunner.java:113)
	at org.testng.TestNG.createSuiteRunner(TestNG.java:1299)
	at org.testng.TestNG.createSuiteRunners(TestNG.java:1286)
	at org.testng.TestNG.runSuitesLocally(TestNG.java:1140)
	at org.testng.TestNG.run(TestNG.java:1057)
	at org.apache.maven.surefire.testng.TestNGExecutor.run(TestNGExecutor.java:115)
	at org.apache.maven.surefire.testng.TestNGDirectoryTestSuite.executeMulti(TestNGDirectoryTestSuite.java:204)
	at org.apache.maven.surefire.testng.TestNGDirectoryTestSuite.execute(TestNGDirectoryTestSuite.java:107)
	at org.apache.maven.surefire.testng.TestNGProvider.invoke(TestNGProvider.java:112)
	at org.apache.maven.surefire.booter.ForkedBooter.invokeProviderInSameClassLoader(ForkedBooter.java:200)
	at org.apache.maven.surefire.booter.ForkedBooter.runSuitesInProcess(ForkedBooter.java:153)
	at org.apache.maven.surefire.booter.ForkedBooter.main(ForkedBooter.java:103)

	at org.apache.maven.plugin.surefire.booterclient.ForkStarter.fork(ForkStarter.java:479)
	at org.apache.maven.plugin.surefire.booterclient.ForkStarter.fork(ForkStarter.java:352)
	at org.apache.maven.plugin.surefire.booterclient.ForkStarter.run(ForkStarter.java:158)
	at org.apache.maven.plugin.surefire.AbstractSurefireMojo.executeProvider(AbstractSurefireMojo.java:967)
	at org.apache.maven.plugin.surefire.AbstractSurefireMojo.executeAfterPreconditionsChecked(AbstractSurefireMojo.java:831)
	at org.apache.maven.plugin.surefire.AbstractSurefireMojo.execute(AbstractSurefireMojo.java:729)
	at org.apache.maven.plugin.DefaultBuildPluginManager.executeMojo(DefaultBuildPluginManager.java:101)
	... 32 more
[ERROR] 
[ERROR] Re-run Maven using the -X switch to enable full debug logging.
[ERROR] 
[ERROR] For more information about the errors and possible solutions, please read the following
articles:
[ERROR] [Help 1] http://cwiki.apache.org/confluence/display/MAVEN/PluginExecutionException
[ERROR] 
[ERROR] After correcting the problems, you can resume the build with the command
[ERROR]   mvn <goals> -rf :jclouds-core
[JENKINS] Archiving <https://jclouds.ci.cloudbees.com/job/jclouds/ws/providers/aws-ec2/pom.xml>
to org.apache.jclouds.provider/aws-ec2/2.0.0-SNAPSHOT/aws-ec2-2.0.0-SNAPSHOT.pom
[JENKINS] Archiving <https://jclouds.ci.cloudbees.com/job/jclouds/ws/compute/pom.xml>
to org.apache.jclouds/jclouds-compute/2.0.0-SNAPSHOT/jclouds-compute-2.0.0-SNAPSHOT.pom
[JENKINS] Archiving <https://jclouds.ci.cloudbees.com/job/jclouds/ws/providers/serverlove-z1-man/pom.xml>
to org.apache.jclouds.provider/serverlove-z1-man/2.0.0-SNAPSHOT/serverlove-z1-man-2.0.0-SNAPSHOT.pom
[JENKINS] Archiving <https://jclouds.ci.cloudbees.com/job/jclouds/ws/drivers/gae/pom.xml>
to org.apache.jclouds.driver/jclouds-gae/2.0.0-SNAPSHOT/jclouds-gae-2.0.0-SNAPSHOT.pom
[JENKINS] Archiving <https://jclouds.ci.cloudbees.com/job/jclouds/ws/providers/cloudfiles-uk/pom.xml>
to org.apache.jclouds.provider/cloudfiles-uk/2.0.0-SNAPSHOT/cloudfiles-uk-2.0.0-SNAPSHOT.pom
[JENKINS] Archiving <https://jclouds.ci.cloudbees.com/job/jclouds/ws/apis/sqs/pom.xml>
to org.apache.jclouds.api/sqs/2.0.0-SNAPSHOT/sqs-2.0.0-SNAPSHOT.pom
[JENKINS] Archiving <https://jclouds.ci.cloudbees.com/job/jclouds/ws/apis/swift/pom.xml>
to org.apache.jclouds.api/swift/2.0.0-SNAPSHOT/swift-2.0.0-SNAPSHOT.pom
[JENKINS] Archiving <https://jclouds.ci.cloudbees.com/job/jclouds/ws/providers/azureblob/pom.xml>
to org.apache.jclouds.provider/azureblob/2.0.0-SNAPSHOT/azureblob-2.0.0-SNAPSHOT.pom
[JENKINS] Archiving <https://jclouds.ci.cloudbees.com/job/jclouds/ws/providers/elastichosts-lon-p/pom.xml>
to org.apache.jclouds.provider/elastichosts-lon-p/2.0.0-SNAPSHOT/elastichosts-lon-p-2.0.0-SNAPSHOT.pom
[JENKINS] Archiving <https://jclouds.ci.cloudbees.com/job/jclouds/ws/providers/cloudfiles-us/pom.xml>
to org.apache.jclouds.provider/cloudfiles-us/2.0.0-SNAPSHOT/cloudfiles-us-2.0.0-SNAPSHOT.pom
[JENKINS] Archiving <https://jclouds.ci.cloudbees.com/job/jclouds/ws/drivers/sshj/pom.xml>
to org.apache.jclouds.driver/jclouds-sshj/2.0.0-SNAPSHOT/jclouds-sshj-2.0.0-SNAPSHOT.pom
[JENKINS] Archiving <https://jclouds.ci.cloudbees.com/job/jclouds/ws/providers/elastichosts-sjc-c/pom.xml>
to org.apache.jclouds.provider/elastichosts-sjc-c/2.0.0-SNAPSHOT/elastichosts-sjc-c-2.0.0-SNAPSHOT.pom
[JENKINS] Archiving <https://jclouds.ci.cloudbees.com/job/jclouds/ws/apis/rackspace-cloudloadbalancers/pom.xml>
to org.apache.jclouds.api/rackspace-cloudloadbalancers/2.0.0-SNAPSHOT/rackspace-cloudloadbalancers-2.0.0-SNAPSHOT.pom
[JENKINS] Archiving <https://jclouds.ci.cloudbees.com/job/jclouds/ws/providers/elastichosts-lax-p/pom.xml>
to org.apache.jclouds.provider/elastichosts-lax-p/2.0.0-SNAPSHOT/elastichosts-lax-p-2.0.0-SNAPSHOT.pom
[JENKINS] Archiving <https://jclouds.ci.cloudbees.com/job/jclouds/ws/drivers/netty/pom.xml>
to org.apache.jclouds.driver/jclouds-netty/2.0.0-SNAPSHOT/jclouds-netty-2.0.0-SNAPSHOT.pom
[JENKINS] Archiving <https://jclouds.ci.cloudbees.com/job/jclouds/ws/all/pom.xml> to
org.apache.jclouds/jclouds-all/2.0.0-SNAPSHOT/jclouds-all-2.0.0-SNAPSHOT.pom
[JENKINS] Archiving <https://jclouds.ci.cloudbees.com/job/jclouds/ws/pom.xml> to org.apache.jclouds/jclouds/2.0.0-SNAPSHOT/jclouds-2.0.0-SNAPSHOT.pom
[JENKINS] Archiving <https://jclouds.ci.cloudbees.com/job/jclouds/ws/providers/gogrid/pom.xml>
to org.apache.jclouds.provider/gogrid/2.0.0-SNAPSHOT/gogrid-2.0.0-SNAPSHOT.pom
[JENKINS] Archiving <https://jclouds.ci.cloudbees.com/job/jclouds/ws/providers/skalicloud-sdg-my/pom.xml>
to org.apache.jclouds.provider/skalicloud-sdg-my/2.0.0-SNAPSHOT/skalicloud-sdg-my-2.0.0-SNAPSHOT.pom
[JENKINS] Archiving <https://jclouds.ci.cloudbees.com/job/jclouds/ws/providers/dynect/pom.xml>
to org.apache.jclouds.provider/dynect/2.0.0-SNAPSHOT/dynect-2.0.0-SNAPSHOT.pom
[JENKINS] Archiving <https://jclouds.ci.cloudbees.com/job/jclouds/ws/apis/sts/pom.xml>
to org.apache.jclouds.api/sts/2.0.0-SNAPSHOT/sts-2.0.0-SNAPSHOT.pom
[JENKINS] Archiving <https://jclouds.ci.cloudbees.com/job/jclouds/ws/apis/elasticstack/pom.xml>
to org.apache.jclouds.api/elasticstack/2.0.0-SNAPSHOT/elasticstack-2.0.0-SNAPSHOT.pom
[JENKINS] Archiving <https://jclouds.ci.cloudbees.com/job/jclouds/ws/providers/openhosting-east1/pom.xml>
to org.apache.jclouds.provider/openhosting-east1/2.0.0-SNAPSHOT/openhosting-east1-2.0.0-SNAPSHOT.pom
[JENKINS] Archiving <https://jclouds.ci.cloudbees.com/job/jclouds/ws/apis/ec2/pom.xml>
to org.apache.jclouds.api/ec2/2.0.0-SNAPSHOT/ec2-2.0.0-SNAPSHOT.pom
[JENKINS] Archiving <https://jclouds.ci.cloudbees.com/job/jclouds/ws/apis/openstack-nova/pom.xml>
to org.apache.jclouds.api/openstack-nova/2.0.0-SNAPSHOT/openstack-nova-2.0.0-SNAPSHOT.pom
[JENKINS] Archiving <https://jclouds.ci.cloudbees.com/job/jclouds/ws/skeletons/pom.xml>
to org.apache.jclouds/jclouds-skeletons-project/2.0.0-SNAPSHOT/jclouds-skeletons-project-2.0.0-SNAPSHOT.pom
[JENKINS] Archiving <https://jclouds.ci.cloudbees.com/job/jclouds/ws/apis/openstack-nova-ec2/pom.xml>
to org.apache.jclouds.api/openstack-nova-ec2/2.0.0-SNAPSHOT/openstack-nova-ec2-2.0.0-SNAPSHOT.pom
[JENKINS] Archiving <https://jclouds.ci.cloudbees.com/job/jclouds/ws/apis/openstack-swift/pom.xml>
to org.apache.jclouds.api/openstack-swift/2.0.0-SNAPSHOT/openstack-swift-2.0.0-SNAPSHOT.pom
[JENKINS] Archiving <https://jclouds.ci.cloudbees.com/job/jclouds/ws/apis/route53/pom.xml>
to org.apache.jclouds.api/route53/2.0.0-SNAPSHOT/route53-2.0.0-SNAPSHOT.pom
[JENKINS] Archiving <https://jclouds.ci.cloudbees.com/job/jclouds/ws/drivers/jsch/pom.xml>
to org.apache.jclouds.driver/jclouds-jsch/2.0.0-SNAPSHOT/jclouds-jsch-2.0.0-SNAPSHOT.pom
[JENKINS] Archiving <https://jclouds.ci.cloudbees.com/job/jclouds/ws/common/openstack/pom.xml>
to org.apache.jclouds.common/openstack-common/2.0.0-SNAPSHOT/openstack-common-2.0.0-SNAPSHOT.pom
[JENKINS] Archiving <https://jclouds.ci.cloudbees.com/job/jclouds/ws/skeletons/standalone-compute/pom.xml>
to org.apache.jclouds.api/servermanager/2.0.0-SNAPSHOT/servermanager-2.0.0-SNAPSHOT.pom
[JENKINS] Archiving <https://jclouds.ci.cloudbees.com/job/jclouds/ws/drivers/apachehc/pom.xml>
to org.apache.jclouds.driver/jclouds-apachehc/2.0.0-SNAPSHOT/jclouds-apachehc-2.0.0-SNAPSHOT.pom
[JENKINS] Archiving <https://jclouds.ci.cloudbees.com/job/jclouds/ws/apis/cloudwatch/pom.xml>
to org.apache.jclouds.api/cloudwatch/2.0.0-SNAPSHOT/cloudwatch-2.0.0-SNAPSHOT.pom
[JENKINS] Archiving <https://jclouds.ci.cloudbees.com/job/jclouds/ws/drivers/okhttp/pom.xml>
to org.apache.jclouds.driver/jclouds-okhttp/2.0.0-SNAPSHOT/jclouds-okhttp-2.0.0-SNAPSHOT.pom
[JENKINS] Archiving <https://jclouds.ci.cloudbees.com/job/jclouds/ws/apis/s3/pom.xml>
to org.apache.jclouds.api/s3/2.0.0-SNAPSHOT/s3-2.0.0-SNAPSHOT.pom
[JENKINS] Archiving <https://jclouds.ci.cloudbees.com/job/jclouds/ws/common/pom.xml>
to org.apache.jclouds.common/jclouds-commons-project/2.0.0-SNAPSHOT/jclouds-commons-project-2.0.0-SNAPSHOT.pom
[JENKINS] Archiving <https://jclouds.ci.cloudbees.com/job/jclouds/ws/loadbalancer/pom.xml>
to org.apache.jclouds/jclouds-loadbalancer/2.0.0-SNAPSHOT/jclouds-loadbalancer-2.0.0-SNAPSHOT.pom
[JENKINS] Archiving <https://jclouds.ci.cloudbees.com/job/jclouds/ws/drivers/enterprise/pom.xml>
to org.apache.jclouds.driver/jclouds-enterprise/2.0.0-SNAPSHOT/jclouds-enterprise-2.0.0-SNAPSHOT.pom
[JENKINS] Archiving <https://jclouds.ci.cloudbees.com/job/jclouds/ws/apis/pom.xml> to
org.apache.jclouds.api/jclouds-apis-project/2.0.0-SNAPSHOT/jclouds-apis-project-2.0.0-SNAPSHOT.pom
[JENKINS] Archiving <https://jclouds.ci.cloudbees.com/job/jclouds/ws/drivers/log4j/pom.xml>
to org.apache.jclouds.driver/jclouds-log4j/2.0.0-SNAPSHOT/jclouds-log4j-2.0.0-SNAPSHOT.pom
[JENKINS] Archiving <https://jclouds.ci.cloudbees.com/job/jclouds/ws/providers/elastichosts-lon-b/pom.xml>
to org.apache.jclouds.provider/elastichosts-lon-b/2.0.0-SNAPSHOT/elastichosts-lon-b-2.0.0-SNAPSHOT.pom
[JENKINS] Archiving <https://jclouds.ci.cloudbees.com/job/jclouds/ws/drivers/slf4j/pom.xml>
to org.apache.jclouds.driver/jclouds-slf4j/2.0.0-SNAPSHOT/jclouds-slf4j-2.0.0-SNAPSHOT.pom
[JENKINS] Archiving <https://jclouds.ci.cloudbees.com/job/jclouds/ws/providers/rackspace-cloudservers-uk/pom.xml>
to org.apache.jclouds.provider/rackspace-cloudservers-uk/2.0.0-SNAPSHOT/rackspace-cloudservers-uk-2.0.0-SNAPSHOT.pom
[JENKINS] Archiving <https://jclouds.ci.cloudbees.com/job/jclouds/ws/providers/hpcloud-blockstorage/pom.xml>
to org.apache.jclouds.provider/hpcloud-blockstorage/2.0.0-SNAPSHOT/hpcloud-blockstorage-2.0.0-SNAPSHOT.pom
[JENKINS] Archiving <https://jclouds.ci.cloudbees.com/job/jclouds/ws/allloadbalancer/pom.xml>
to org.apache.jclouds/jclouds-allloadbalancer/2.0.0-SNAPSHOT/jclouds-allloadbalancer-2.0.0-SNAPSHOT.pom
[JENKINS] Archiving <https://jclouds.ci.cloudbees.com/job/jclouds/ws/apis/byon/pom.xml>
to org.apache.jclouds.api/byon/2.0.0-SNAPSHOT/byon-2.0.0-SNAPSHOT.pom
[JENKINS] Archiving <https://jclouds.ci.cloudbees.com/job/jclouds/ws/allcompute/pom.xml>
to org.apache.jclouds/jclouds-allcompute/2.0.0-SNAPSHOT/jclouds-allcompute-2.0.0-SNAPSHOT.pom
[JENKINS] Archiving <https://jclouds.ci.cloudbees.com/job/jclouds/ws/providers/aws-sts/pom.xml>
to org.apache.jclouds.provider/aws-sts/2.0.0-SNAPSHOT/aws-sts-2.0.0-SNAPSHOT.pom
[JENKINS] Archiving <https://jclouds.ci.cloudbees.com/job/jclouds/ws/providers/rackspace-clouddns-uk/pom.xml>
to org.apache.jclouds.provider/rackspace-clouddns-uk/2.0.0-SNAPSHOT/rackspace-clouddns-uk-2.0.0-SNAPSHOT.pom
[JENKINS] Archiving <https://jclouds.ci.cloudbees.com/job/jclouds/ws/apis/openstack-keystone/pom.xml>
to org.apache.jclouds.api/openstack-keystone/2.0.0-SNAPSHOT/openstack-keystone-2.0.0-SNAPSHOT.pom
[JENKINS] Archiving <https://jclouds.ci.cloudbees.com/job/jclouds/ws/providers/aws-s3/pom.xml>
to org.apache.jclouds.provider/aws-s3/2.0.0-SNAPSHOT/aws-s3-2.0.0-SNAPSHOT.pom
[JENKINS] Archiving <https://jclouds.ci.cloudbees.com/job/jclouds/ws/providers/rackspace-clouddns-us/pom.xml>
to org.apache.jclouds.provider/rackspace-clouddns-us/2.0.0-SNAPSHOT/rackspace-clouddns-us-2.0.0-SNAPSHOT.pom
[JENKINS] Archiving <https://jclouds.ci.cloudbees.com/job/jclouds/ws/project/pom.xml>
to org.apache.jclouds/jclouds-project/2.0.0-SNAPSHOT/jclouds-project-2.0.0-SNAPSHOT.pom
[JENKINS] Archiving <https://jclouds.ci.cloudbees.com/job/jclouds/ws/project/target/jclouds-project-2.0.0-SNAPSHOT-tests.jar>
to org.apache.jclouds/jclouds-project/2.0.0-20141128.234940-148/jclouds-project-2.0.0-20141128.234940-148-tests.jar
[JENKINS] Archiving <https://jclouds.ci.cloudbees.com/job/jclouds/ws/resources/pom.xml>
to org.apache.jclouds/jclouds-resources/2.0.0-SNAPSHOT/jclouds-resources-2.0.0-SNAPSHOT.pom
[JENKINS] Archiving <https://jclouds.ci.cloudbees.com/job/jclouds/ws/resources/target/jclouds-resources-2.0.0-SNAPSHOT.jar>
to org.apache.jclouds/jclouds-resources/2.0.0-20141128.234956-145/jclouds-resources-2.0.0-20141128.234956-145.jar
[JENKINS] Archiving <https://jclouds.ci.cloudbees.com/job/jclouds/ws/resources/target/jclouds-resources-2.0.0-SNAPSHOT-tests.jar>
to org.apache.jclouds/jclouds-resources/2.0.0-20141128.234956-145/jclouds-resources-2.0.0-20141128.234956-145-tests.jar
[JENKINS] Archiving <https://jclouds.ci.cloudbees.com/job/jclouds/ws/drivers/bouncycastle/pom.xml>
to org.apache.jclouds.driver/jclouds-bouncycastle/2.0.0-SNAPSHOT/jclouds-bouncycastle-2.0.0-SNAPSHOT.pom
[JENKINS] Archiving <https://jclouds.ci.cloudbees.com/job/jclouds/ws/core/pom.xml> to
org.apache.jclouds/jclouds-core/2.0.0-SNAPSHOT/jclouds-core-2.0.0-SNAPSHOT.pom
[JENKINS] Archiving <https://jclouds.ci.cloudbees.com/job/jclouds/ws/providers/glesys/pom.xml>
to org.apache.jclouds.provider/glesys/2.0.0-SNAPSHOT/glesys-2.0.0-SNAPSHOT.pom
[JENKINS] Archiving <https://jclouds.ci.cloudbees.com/job/jclouds/ws/providers/rackspace-cloudloadbalancers-us/pom.xml>
to org.apache.jclouds.provider/rackspace-cloudloadbalancers-us/2.0.0-SNAPSHOT/rackspace-cloudloadbalancers-us-2.0.0-SNAPSHOT.pom
[JENKINS] Archiving <https://jclouds.ci.cloudbees.com/job/jclouds/ws/providers/elastichosts-syd-v/pom.xml>
to org.apache.jclouds.provider/elastichosts-syd-v/2.0.0-SNAPSHOT/elastichosts-syd-v-2.0.0-SNAPSHOT.pom
[JENKINS] Archiving <https://jclouds.ci.cloudbees.com/job/jclouds/ws/providers/aws-sqs/pom.xml>
to org.apache.jclouds.provider/aws-sqs/2.0.0-SNAPSHOT/aws-sqs-2.0.0-SNAPSHOT.pom
[JENKINS] Archiving <https://jclouds.ci.cloudbees.com/job/jclouds/ws/providers/rackspace-clouddatabases-uk/pom.xml>
to org.apache.jclouds.provider/rackspace-clouddatabases-uk/2.0.0-SNAPSHOT/rackspace-clouddatabases-uk-2.0.0-SNAPSHOT.pom
[JENKINS] Archiving <https://jclouds.ci.cloudbees.com/job/jclouds/ws/providers/softlayer/pom.xml>
to org.apache.jclouds.provider/softlayer/2.0.0-SNAPSHOT/softlayer-2.0.0-SNAPSHOT.pom
[JENKINS] Archiving <https://jclouds.ci.cloudbees.com/job/jclouds/ws/providers/rackspace-cloudloadbalancers-uk/pom.xml>
to org.apache.jclouds.provider/rackspace-cloudloadbalancers-uk/2.0.0-SNAPSHOT/rackspace-cloudloadbalancers-uk-2.0.0-SNAPSHOT.pom
[JENKINS] Archiving <https://jclouds.ci.cloudbees.com/job/jclouds/ws/providers/aws-route53/pom.xml>
to org.apache.jclouds.provider/aws-route53/2.0.0-SNAPSHOT/aws-route53-2.0.0-SNAPSHOT.pom
[JENKINS] Archiving <https://jclouds.ci.cloudbees.com/job/jclouds/ws/providers/elastichosts-ams-e/pom.xml>
to org.apache.jclouds.provider/elastichosts-ams-e/2.0.0-SNAPSHOT/elastichosts-ams-e-2.0.0-SNAPSHOT.pom
[JENKINS] Archiving <https://jclouds.ci.cloudbees.com/job/jclouds/ws/apis/openstack-trove/pom.xml>
to org.apache.jclouds.api/openstack-trove/2.0.0-SNAPSHOT/openstack-trove-2.0.0-SNAPSHOT.pom
[JENKINS] Archiving <https://jclouds.ci.cloudbees.com/job/jclouds/ws/providers/elastichosts-tor-p/pom.xml>
to org.apache.jclouds.provider/elastichosts-tor-p/2.0.0-SNAPSHOT/elastichosts-tor-p-2.0.0-SNAPSHOT.pom
[JENKINS] Archiving <https://jclouds.ci.cloudbees.com/job/jclouds/ws/providers/go2cloud-jhb1/pom.xml>
to org.apache.jclouds.provider/go2cloud-jhb1/2.0.0-SNAPSHOT/go2cloud-jhb1-2.0.0-SNAPSHOT.pom
[JENKINS] Archiving <https://jclouds.ci.cloudbees.com/job/jclouds/ws/providers/rackspace-clouddatabases-us/pom.xml>
to org.apache.jclouds.provider/rackspace-clouddatabases-us/2.0.0-SNAPSHOT/rackspace-clouddatabases-us-2.0.0-SNAPSHOT.pom
[JENKINS] Archiving <https://jclouds.ci.cloudbees.com/job/jclouds/ws/scriptbuilder/pom.xml>
to org.apache.jclouds/jclouds-scriptbuilder/2.0.0-SNAPSHOT/jclouds-scriptbuilder-2.0.0-SNAPSHOT.pom
[JENKINS] Archiving <https://jclouds.ci.cloudbees.com/job/jclouds/ws/providers/hpcloud-compute/pom.xml>
to org.apache.jclouds.provider/hpcloud-compute/2.0.0-SNAPSHOT/hpcloud-compute-2.0.0-SNAPSHOT.pom
[JENKINS] Archiving <https://jclouds.ci.cloudbees.com/job/jclouds/ws/providers/pom.xml>
to org.apache.jclouds.provider/jclouds-providers-project/2.0.0-SNAPSHOT/jclouds-providers-project-2.0.0-SNAPSHOT.pom
[JENKINS] Archiving <https://jclouds.ci.cloudbees.com/job/jclouds/ws/providers/ultradns-ws/pom.xml>
to org.apache.jclouds.provider/ultradns-ws/2.0.0-SNAPSHOT/ultradns-ws-2.0.0-SNAPSHOT.pom
[JENKINS] Archiving <https://jclouds.ci.cloudbees.com/job/jclouds/ws/apis/openstack-cinder/pom.xml>
to org.apache.jclouds.api/openstack-cinder/2.0.0-SNAPSHOT/openstack-cinder-2.0.0-SNAPSHOT.pom
[JENKINS] Archiving <https://jclouds.ci.cloudbees.com/job/jclouds/ws/providers/hpcloud-objectstorage/pom.xml>
to org.apache.jclouds.provider/hpcloud-objectstorage/2.0.0-SNAPSHOT/hpcloud-objectstorage-2.0.0-SNAPSHOT.pom
[JENKINS] Archiving <https://jclouds.ci.cloudbees.com/job/jclouds/ws/drivers/pom.xml>
to org.apache.jclouds/jclouds-drivers-project/2.0.0-SNAPSHOT/jclouds-drivers-project-2.0.0-SNAPSHOT.pom
[JENKINS] Archiving <https://jclouds.ci.cloudbees.com/job/jclouds/ws/apis/chef/pom.xml>
to org.apache.jclouds.api/chef/2.0.0-SNAPSHOT/chef-2.0.0-SNAPSHOT.pom
[JENKINS] Archiving <https://jclouds.ci.cloudbees.com/job/jclouds/ws/apis/cloudstack/pom.xml>
to org.apache.jclouds.api/cloudstack/2.0.0-SNAPSHOT/cloudstack-2.0.0-SNAPSHOT.pom
[JENKINS] Archiving <https://jclouds.ci.cloudbees.com/job/jclouds/ws/apis/atmos/pom.xml>
to org.apache.jclouds.api/atmos/2.0.0-SNAPSHOT/atmos-2.0.0-SNAPSHOT.pom
[JENKINS] Archiving <https://jclouds.ci.cloudbees.com/job/jclouds/ws/apis/rackspace-cloudidentity/pom.xml>
to org.apache.jclouds.api/rackspace-cloudidentity/2.0.0-SNAPSHOT/rackspace-cloudidentity-2.0.0-SNAPSHOT.pom
[JENKINS] Archiving <https://jclouds.ci.cloudbees.com/job/jclouds/ws/allblobstore/pom.xml>
to org.apache.jclouds/jclouds-allblobstore/2.0.0-SNAPSHOT/jclouds-allblobstore-2.0.0-SNAPSHOT.pom
[JENKINS] Archiving <https://jclouds.ci.cloudbees.com/job/jclouds/ws/providers/enterprisechef/pom.xml>
to org.apache.jclouds.provider/enterprisechef/2.0.0-SNAPSHOT/enterprisechef-2.0.0-SNAPSHOT.pom
[JENKINS] Archiving <https://jclouds.ci.cloudbees.com/job/jclouds/ws/drivers/joda/pom.xml>
to org.apache.jclouds.driver/jclouds-joda/2.0.0-SNAPSHOT/jclouds-joda-2.0.0-SNAPSHOT.pom
[JENKINS] Archiving <https://jclouds.ci.cloudbees.com/job/jclouds/ws/providers/aws-cloudwatch/pom.xml>
to org.apache.jclouds.provider/aws-cloudwatch/2.0.0-SNAPSHOT/aws-cloudwatch-2.0.0-SNAPSHOT.pom
[JENKINS] Archiving <https://jclouds.ci.cloudbees.com/job/jclouds/ws/providers/rackspace-cloudblockstorage-us/pom.xml>
to org.apache.jclouds.provider/rackspace-cloudblockstorage-us/2.0.0-SNAPSHOT/rackspace-cloudblockstorage-us-2.0.0-SNAPSHOT.pom
[JENKINS] Archiving <https://jclouds.ci.cloudbees.com/job/jclouds/ws/apis/rackspace-clouddns/pom.xml>
to org.apache.jclouds.api/rackspace-clouddns/2.0.0-SNAPSHOT/rackspace-clouddns-2.0.0-SNAPSHOT.pom
[JENKINS] Archiving <https://jclouds.ci.cloudbees.com/job/jclouds/ws/providers/elastichosts-hkg-e/pom.xml>
to org.apache.jclouds.provider/elastichosts-hkg-e/2.0.0-SNAPSHOT/elastichosts-hkg-e-2.0.0-SNAPSHOT.pom
[JENKINS] Archiving <https://jclouds.ci.cloudbees.com/job/jclouds/ws/blobstore/pom.xml>
to org.apache.jclouds/jclouds-blobstore/2.0.0-SNAPSHOT/jclouds-blobstore-2.0.0-SNAPSHOT.pom
[JENKINS] Archiving <https://jclouds.ci.cloudbees.com/job/jclouds/ws/providers/rackspace-cloudservers-us/pom.xml>
to org.apache.jclouds.provider/rackspace-cloudservers-us/2.0.0-SNAPSHOT/rackspace-cloudservers-us-2.0.0-SNAPSHOT.pom
[JENKINS] Archiving <https://jclouds.ci.cloudbees.com/job/jclouds/ws/providers/rackspace-cloudblockstorage-uk/pom.xml>
to org.apache.jclouds.provider/rackspace-cloudblockstorage-uk/2.0.0-SNAPSHOT/rackspace-cloudblockstorage-uk-2.0.0-SNAPSHOT.pom
[JENKINS] Archiving <https://jclouds.ci.cloudbees.com/job/jclouds/ws/apis/cloudfiles/pom.xml>
to org.apache.jclouds.api/cloudfiles/2.0.0-SNAPSHOT/cloudfiles-2.0.0-SNAPSHOT.pom
[JENKINS] Archiving <https://jclouds.ci.cloudbees.com/job/jclouds/ws/providers/elastichosts-sat-p/pom.xml>
to org.apache.jclouds.provider/elastichosts-sat-p/2.0.0-SNAPSHOT/elastichosts-sat-p-2.0.0-SNAPSHOT.pom
Sending e-mails to: notifications@jclouds.apache.org
channel stopped

Mime
View raw message