jclouds-notifications mailing list archives

Site index · List index
Message view « Date » · « Thread »
Top « Date » · « Thread »
From BuildHive <buildhive-git...@cloudbees.com>
Subject Build failed in Jenkins: jclouds » jclouds-labs-google #1605
Date Sat, 01 Nov 2014 19:44:41 GMT
See <https://buildhive.cloudbees.com/job/jclouds/job/jclouds-labs-google/1605/>

------------------------------------------
[...truncated 1144 lines...]
Test suite progress: tests succeeded: 230, failed: 0, skipped: 0.
Starting test testTagFilteringWorks(org.jclouds.googlecomputeengine.compute.functions.InstanceInZoneToNodeMetadataTest)
[pool-9-thread-2] Test testTagFilteringWorks(org.jclouds.googlecomputeengine.compute.functions.InstanceInZoneToNodeMetadataTest)
succeeded: 39ms
Test suite progress: tests succeeded: 231, failed: 0, skipped: 0.
Starting test testInstanceWithGroupNull(org.jclouds.googlecomputeengine.compute.functions.InstanceInZoneToNodeMetadataTest)
[pool-9-thread-1] Test testInstanceWithGroupNull(org.jclouds.googlecomputeengine.compute.functions.InstanceInZoneToNodeMetadataTest)
succeeded: 1ms
Test suite progress: tests succeeded: 232, failed: 0, skipped: 0.
Tests run: 232, Failures: 0, Errors: 0, Skipped: 0, Time elapsed: 141.675 sec - in TestSuite

Results :

Tests run: 232, Failures: 0, Errors: 0, Skipped: 0

[JENKINS] Recording test results
[INFO] 
[INFO] --- maven-jar-plugin:2.4:jar (default-jar) @ google-compute-engine ---
[INFO] Building jar: <https://buildhive.cloudbees.com/job/jclouds/job/jclouds-labs-google/ws/google-compute-engine/target/google-compute-engine-2.0.0-SNAPSHOT.jar>
[INFO] 
[INFO] --- maven-site-plugin:3.3:attach-descriptor (attach-descriptor) @ google-compute-engine
---
[INFO] 
[INFO] --- apache-rat-plugin:0.10:check (default) @ google-compute-engine ---
[INFO] 51 implicit excludes (use -debug for more details).
[INFO] Exclude: **/src/test/resources/**/*.sh
[INFO] Exclude: **/src/test/resources/**/*.bat
[INFO] Exclude: **/src/test/resources/**/*.cmd
[INFO] Exclude: **/src/test/resources/**/*.txt
[INFO] Exclude: **/src/test/resources/**/*.gz
[INFO] Exclude: **/src/test/resources/**/*.xml
[INFO] Exclude: **/services/*LoggingModule
[INFO] Exclude: **/services/*ApiMetadata
[INFO] Exclude: **/services/*ProviderMetadata
[INFO] Exclude: **/LICENSE.txt
[INFO] Exclude: **/header.txt
[INFO] Exclude: **/NOTICE.txt
[INFO] Exclude: **/DISCLAIMER
[INFO] Exclude: **/BUILD.txt
[INFO] Exclude: **/CHANGES.txt
[INFO] Exclude: **/README.md
[INFO] Exclude: **/README.txt
[INFO] Exclude: **/DEPENDENCIES
[INFO] Exclude: **/CONTRIBUTING.md
[INFO] Exclude: **/*json
[INFO] Exclude: **/*readme
[INFO] Exclude: **/test
[INFO] Exclude: **/test.pub
[INFO] Exclude: **/target/**
[INFO] Exclude: **/test-output/**
[INFO] Exclude: **/bin/**
[INFO] Exclude: **/.settings/**
[INFO] Exclude: **/.classpath
[INFO] Exclude: **/.dir-locals.el
[INFO] Exclude: **/.project
[INFO] Exclude: **/.idea/**
[INFO] Exclude: **/*.iml
[INFO] Exclude: **/*.eml
[INFO] Exclude: **/*.ipr
[INFO] Exclude: **/*.iws
[INFO] Exclude: **/*.DS_STORE
[INFO] Exclude: **/TAGS
[INFO] Exclude: **/.metadata/**
[INFO] Exclude: **/atlassian-ide-plugin.xml
[INFO] Exclude: **/.DS_Store
[INFO] Exclude: .mailmap
[INFO] Exclude: .git/**
[INFO] Exclude: **/.gitignore
[INFO] Exclude: **/.gitattributes
[INFO] Exclude: **/.java-version
[INFO] Exclude: **/modernizer_exclusions.txt
[INFO] Exclude: .repository/**
[INFO] Exclude: gc.log
[INFO] 224 resources included (use -debug for more details)
Warning:  org.apache.xerces.jaxp.SAXParserImpl$JAXPSAXParser: Property 'http://www.oracle.com/xml/jaxp/properties/entityExpansionLimit'
is not recognized.
Compiler warnings:
  WARNING:  'org.apache.xerces.jaxp.SAXParserImpl: Property 'http://javax.xml.XMLConstants/property/accessExternalDTD'
is not recognized.'
Warning:  org.apache.xerces.parsers.SAXParser: Feature 'http://javax.xml.XMLConstants/feature/secure-processing'
is not recognized.
Warning:  org.apache.xerces.parsers.SAXParser: Property 'http://javax.xml.XMLConstants/property/accessExternalDTD'
is not recognized.
Warning:  org.apache.xerces.parsers.SAXParser: Property 'http://www.oracle.com/xml/jaxp/properties/entityExpansionLimit'
is not recognized.
[INFO] Rat check: Summary of files. Unapproved: 0 unknown: 0 generated: 0 approved: 224 licence.
[INFO] 
[INFO] --- maven-jar-plugin:2.4:test-jar (default) @ google-compute-engine ---
[INFO] Building jar: <https://buildhive.cloudbees.com/job/jclouds/job/jclouds-labs-google/ws/google-compute-engine/target/google-compute-engine-2.0.0-SNAPSHOT-tests.jar>
[INFO] 
[INFO] --- maven-surefire-plugin:2.17:test (integration) @ google-compute-engine ---
[JENKINS] Recording test results
[INFO] 
[INFO] --- maven-duplicate-finder-plugin:1.0.5:check (default) @ google-compute-engine ---
[INFO] Checking compile classpath
[INFO] Checking runtime classpath
[INFO] Checking test classpath
[INFO] 
[INFO] --- maven-checkstyle-plugin:2.13:check (default) @ google-compute-engine ---
[INFO] 
[INFO] 
[INFO] >>> modernizer-maven-plugin:1.1.0:modernizer (modernizer) @ google-compute-engine
>>>
[INFO] 
[INFO] --- maven-enforcer-plugin:1.1.1:enforce (enforce-banned-dependencies) @ google-compute-engine
---
[INFO] 
[INFO] --- maven-enforcer-plugin:1.1.1:enforce (enforce-java) @ google-compute-engine ---
[INFO] 
[INFO] --- maven-remote-resources-plugin:1.5:process (default) @ google-compute-engine ---
[INFO] artifact net.schmizz:sshj: checking for updates from central
[INFO] artifact net.schmizz:sshj: checking for updates from jclouds-sona-snapshots-nexus
[INFO] 
[INFO] --- maven-resources-plugin:2.6:resources (default-resources) @ google-compute-engine
---
[INFO] Using 'UTF-8' encoding to copy filtered resources.
[INFO] skip non existing resourceDirectory <https://buildhive.cloudbees.com/job/jclouds/job/jclouds-labs-google/ws/google-compute-engine/src/main/clojure>
[INFO] Copying 1 resource
[INFO] Copying 1 resource
[INFO] Copying 3 resources
[INFO] Copying 3 resources
[INFO] 
[INFO] --- maven-compiler-plugin:3.1:compile (default-compile) @ google-compute-engine ---
[INFO] Nothing to compile - all classes are up to date
[INFO] 
[INFO] --- maven-resources-plugin:2.6:testResources (default-testResources) @ google-compute-engine
---
[INFO] Using 'UTF-8' encoding to copy filtered resources.
[INFO] skip non existing resourceDirectory <https://buildhive.cloudbees.com/job/jclouds/job/jclouds-labs-google/ws/google-compute-engine/src/test/clojure>
[INFO] Copying 82 resources
[INFO] Copying 3 resources
[INFO] Copying 3 resources
[INFO] 
[INFO] --- maven-compiler-plugin:3.1:testCompile (default-testCompile) @ google-compute-engine
---
[INFO] Nothing to compile - all classes are up to date
[WARNING] Failed to getClass for org.gaul.modernizer_maven_plugin.ModernizerMojo
[INFO] 
[INFO] <<< modernizer-maven-plugin:1.1.0:modernizer (modernizer) @ google-compute-engine
<<<
[INFO] 
[INFO] --- modernizer-maven-plugin:1.1.0:modernizer (modernizer) @ google-compute-engine ---
[INFO]                                                                         
[INFO] ------------------------------------------------------------------------
[INFO] Building jclouds Google Cloud Storage provider 2.0.0-SNAPSHOT
[INFO] ------------------------------------------------------------------------
[INFO] Downloading: https://repository.apache.org/content/repositories/snapshots/org/apache/jclouds/jclouds-blobstore/2.0.0-SNAPSHOT/maven-metadata.xml
[INFO] Downloading: http://repository.apache.org/snapshots/org/apache/jclouds/jclouds-blobstore/2.0.0-SNAPSHOT/maven-metadata.xml
[INFO] Downloaded: http://repository.apache.org/snapshots/org/apache/jclouds/jclouds-blobstore/2.0.0-SNAPSHOT/maven-metadata.xml
(1005 B at 2.6 KB/sec)
[INFO] Downloaded: https://repository.apache.org/content/repositories/snapshots/org/apache/jclouds/jclouds-blobstore/2.0.0-SNAPSHOT/maven-metadata.xml
(1005 B at 2.3 KB/sec)
[INFO] Downloading: https://oss.sonatype.org/content/repositories/snapshots/org/apache/jclouds/jclouds-scriptbuilder/2.0.0-SNAPSHOT/maven-metadata.xml
[INFO] 
[INFO] --- maven-clean-plugin:2.5:clean (default-clean) @ google-cloud-storage ---
[INFO] 
[INFO] --- maven-enforcer-plugin:1.1.1:enforce (enforce-banned-dependencies) @ google-cloud-storage
---
[INFO] 
[INFO] --- maven-enforcer-plugin:1.1.1:enforce (enforce-java) @ google-cloud-storage ---
[INFO] 
[INFO] --- maven-remote-resources-plugin:1.5:process (default) @ google-cloud-storage ---
[INFO] artifact net.schmizz:sshj: checking for updates from central
[INFO] artifact net.schmizz:sshj: checking for updates from jclouds-sona-snapshots-nexus
[INFO] 
[INFO] --- maven-resources-plugin:2.6:resources (default-resources) @ google-cloud-storage
---
[INFO] Using 'UTF-8' encoding to copy filtered resources.
[INFO] skip non existing resourceDirectory <https://buildhive.cloudbees.com/job/jclouds/job/jclouds-labs-google/ws/google-cloud-storage/src/main/clojure>
[INFO] skip non existing resourceDirectory <https://buildhive.cloudbees.com/job/jclouds/job/jclouds-labs-google/ws/google-cloud-storage/src/main/resources>
[INFO] skip non existing resourceDirectory <https://buildhive.cloudbees.com/job/jclouds/job/jclouds-labs-google/ws/google-cloud-storage/target/classes>
[INFO] Copying 3 resources
[INFO] 
[INFO] --- maven-compiler-plugin:3.1:compile (default-compile) @ google-cloud-storage ---
[INFO] Changes detected - recompiling the module!
[INFO] Compiling 58 source files to <https://buildhive.cloudbees.com/job/jclouds/job/jclouds-labs-google/ws/google-cloud-storage/target/classes>
[INFO] -------------------------------------------------------------
[WARNING] COMPILATION WARNING : 
[INFO] -------------------------------------------------------------
[WARNING] bootstrap class path not set in conjunction with -source 1.6
[WARNING] No processor claimed any of these annotations: com.google.inject.ImplementedBy,org.jclouds.rest.annotations.ResponseParser,org.jclouds.rest.annotations.RequestFilters,javax.inject.Qualifier,org.jclouds.json.SerializedNames,javax.ws.rs.PUT,javax.ws.rs.Path,javax.inject.Inject,javax.ws.rs.GET,org.jclouds.rest.annotations.PayloadParam,javax.inject.Named,com.google.inject.Provides,javax.annotation.Resource,javax.ws.rs.POST,javax.ws.rs.DefaultValue,javax.ws.rs.PathParam,org.jclouds.rest.annotations.Delegate,javax.ws.rs.QueryParam,javax.inject.Singleton,org.jclouds.oauth.v2.config.OAuthScopes,org.jclouds.rest.annotations.SkipEncoding,org.jclouds.location.Provider,org.jclouds.googlecloudstorage.config.UserProject,org.jclouds.rest.annotations.BinderParam,com.google.inject.Inject,org.jclouds.rest.annotations.QueryParams,com.google.common.annotations.Beta,javax.ws.rs.HeaderParam,org.jclouds.collect.Memoized,com.google.auto.value.AutoValue,org.jclouds.rest.annotations.MapBinder,org.jclouds.javax.annotation.Nullable,javax.ws.rs.Consumes,org.jclouds.rest.annotations.SelectJson,org.jclouds.rest.ConfiguresHttpApi,com.google.common.annotations.VisibleForTesting,org.jclouds.rest.annotations.PATCH,javax.ws.rs.Produces,org.jclouds.rest.annotations.Fallback,javax.ws.rs.DELETE
[WARNING] No processor claimed any of these annotations: org.jclouds.javax.annotation.Nullable,javax.annotation.Generated
[INFO] 3 warnings 
[INFO] -------------------------------------------------------------
[INFO] -------------------------------------------------------------
[ERROR] COMPILATION ERROR : 
[INFO] -------------------------------------------------------------
[ERROR] <https://buildhive.cloudbees.com/job/jclouds/job/jclouds-labs-google/ws/google-cloud-storage/src/main/java/org/jclouds/googlecloudstorage/domain/ListPage.java>:[40,4]
annotation type not applicable to this kind of declaration
[INFO] 1 error
[INFO] -------------------------------------------------------------
[INFO] ------------------------------------------------------------------------
[INFO] Reactor Summary:
[INFO] 
[INFO] Apache jclouds labs google ........................ SUCCESS [42.062s]
[INFO] jclouds OAuth core ................................ SUCCESS [47.271s]
[INFO] jclouds Google Compute Engine provider ............ SUCCESS [3:14.443s]
[INFO] jclouds Google Cloud Storage provider ............. FAILURE [11.924s]
[INFO] ------------------------------------------------------------------------
[INFO] BUILD FAILURE
[INFO] ------------------------------------------------------------------------
[INFO] Total time: 5:05.627s
[INFO] Finished at: Sat Nov 01 19:44:39 UTC 2014
[INFO] Final Memory: 44M/135M
[INFO] ------------------------------------------------------------------------
[ERROR] Failed to execute goal org.apache.maven.plugins:maven-compiler-plugin:3.1:compile
(default-compile) on project google-cloud-storage: Compilation failure
[ERROR] <https://buildhive.cloudbees.com/job/jclouds/job/jclouds-labs-google/ws/google-cloud-storage/src/main/java/org/jclouds/googlecloudstorage/domain/ListPage.java>:[40,4]
annotation type not applicable to this kind of declaration
[ERROR] -> [Help 1]
org.apache.maven.lifecycle.LifecycleExecutionException: Failed to execute goal org.apache.maven.plugins:maven-compiler-plugin:3.1:compile
(default-compile) on project google-cloud-storage: Compilation failure
<https://buildhive.cloudbees.com/job/jclouds/job/jclouds-labs-google/ws/google-cloud-storage/src/main/java/org/jclouds/googlecloudstorage/domain/ListPage.java>:[40,4]
annotation type not applicable to this kind of declaration

	at org.apache.maven.lifecycle.internal.MojoExecutor.execute(MojoExecutor.java:212)
	at org.apache.maven.lifecycle.internal.MojoExecutor.execute(MojoExecutor.java:153)
	at org.apache.maven.lifecycle.internal.MojoExecutor.execute(MojoExecutor.java:145)
	at org.apache.maven.lifecycle.internal.LifecycleModuleBuilder.buildProject(LifecycleModuleBuilder.java:84)
	at org.apache.maven.lifecycle.internal.LifecycleModuleBuilder.buildProject(LifecycleModuleBuilder.java:59)
	at org.apache.maven.lifecycle.internal.LifecycleStarter.singleThreadedBuild(LifecycleStarter.java:183)
	at org.apache.maven.lifecycle.internal.LifecycleStarter.execute(LifecycleStarter.java:161)
	at org.apache.maven.DefaultMaven.doExecute(DefaultMaven.java:317)
	at org.apache.maven.DefaultMaven.execute(DefaultMaven.java:152)
	at org.jvnet.hudson.maven3.launcher.Maven31Launcher.main(Maven31Launcher.java:132)
	at sun.reflect.NativeMethodAccessorImpl.invoke0(Native Method)
	at sun.reflect.NativeMethodAccessorImpl.invoke(NativeMethodAccessorImpl.java:57)
	at sun.reflect.DelegatingMethodAccessorImpl.invoke(DelegatingMethodAccessorImpl.java:43)
	at java.lang.reflect.Method.invoke(Method.java:606)
	at org.codehaus.plexus.classworlds.launcher.Launcher.launchStandard(Launcher.java:330)
	at org.codehaus.plexus.classworlds.launcher.Launcher.launch(Launcher.java:238)
	at jenkins.maven3.agent.Maven31Main.launch(Maven31Main.java:181)
	at sun.reflect.NativeMethodAccessorImpl.invoke0(Native Method)
	at sun.reflect.NativeMethodAccessorImpl.invoke(NativeMethodAccessorImpl.java:57)
	at sun.reflect.DelegatingMethodAccessorImpl.invoke(DelegatingMethodAccessorImpl.java:43)
	at java.lang.reflect.Method.invoke(Method.java:606)
	at hudson.maven.Maven3Builder.call(Maven3Builder.java:134)
	at hudson.maven.Maven3Builder.call(Maven3Builder.java:69)
	at hudson.remoting.UserRequest.perform(UserRequest.java:118)
	at hudson.remoting.UserRequest.perform(UserRequest.java:48)
	at hudson.remoting.Request$2.run(Request.java:328)
	at hudson.remoting.InterceptingExecutorService$1.call(InterceptingExecutorService.java:72)
	at java.util.concurrent.FutureTask.run(FutureTask.java:262)
	at java.util.concurrent.ThreadPoolExecutor.runWorker(ThreadPoolExecutor.java:1145)
	at java.util.concurrent.ThreadPoolExecutor$Worker.run(ThreadPoolExecutor.java:615)
	at java.lang.Thread.run(Thread.java:744)
Caused by: org.apache.maven.plugin.compiler.CompilationFailureException: Compilation failure
<https://buildhive.cloudbees.com/job/jclouds/job/jclouds-labs-google/ws/google-cloud-storage/src/main/java/org/jclouds/googlecloudstorage/domain/ListPage.java>:[40,4]
annotation type not applicable to this kind of declaration

	at org.apache.maven.plugin.compiler.AbstractCompilerMojo.execute(AbstractCompilerMojo.java:858)
	at org.apache.maven.plugin.compiler.CompilerMojo.execute(CompilerMojo.java:129)
	at org.apache.maven.plugin.DefaultBuildPluginManager.executeMojo(DefaultBuildPluginManager.java:106)
	at org.apache.maven.lifecycle.internal.MojoExecutor.execute(MojoExecutor.java:208)
	... 30 more
[ERROR] 
[ERROR] Re-run Maven using the -X switch to enable full debug logging.
[ERROR] 
[ERROR] For more information about the errors and possible solutions, please read the following
articles:
[ERROR] [Help 1] http://cwiki.apache.org/confluence/display/MAVEN/MojoFailureException
[ERROR] 
[ERROR] After correcting the problems, you can resume the build with the command
[JENKINS] Archiving <https://buildhive.cloudbees.com/job/jclouds/job/jclouds-labs-google/ws/pom.xml>
to org.apache.jclouds.labs/jclouds-labs-google/2.0.0-SNAPSHOT/jclouds-labs-google-2.0.0-SNAPSHOT.pom
[JENKINS] Archiving <https://buildhive.cloudbees.com/job/jclouds/job/jclouds-labs-google/ws/target/jclouds-labs-google-2.0.0-SNAPSHOT-tests.jar>
to org.apache.jclouds.labs/jclouds-labs-google/2.0.0-SNAPSHOT/jclouds-labs-google-2.0.0-SNAPSHOT-tests.jar
[ERROR]   mvn <goals> -rf :google-cloud-storage
[JENKINS] Archiving <https://buildhive.cloudbees.com/job/jclouds/job/jclouds-labs-google/ws/google-cloud-storage/pom.xml>
to org.apache.jclouds.labs/google-cloud-storage/2.0.0-SNAPSHOT/google-cloud-storage-2.0.0-SNAPSHOT.pom
[JENKINS] Archiving <https://buildhive.cloudbees.com/job/jclouds/job/jclouds-labs-google/ws/google-compute-engine/pom.xml>
to org.apache.jclouds.labs/google-compute-engine/2.0.0-SNAPSHOT/google-compute-engine-2.0.0-SNAPSHOT.pom
[JENKINS] Archiving <https://buildhive.cloudbees.com/job/jclouds/job/jclouds-labs-google/ws/google-compute-engine/target/google-compute-engine-2.0.0-SNAPSHOT.jar>
to org.apache.jclouds.labs/google-compute-engine/2.0.0-SNAPSHOT/google-compute-engine-2.0.0-SNAPSHOT.jar
[JENKINS] Archiving <https://buildhive.cloudbees.com/job/jclouds/job/jclouds-labs-google/ws/google-compute-engine/target/google-compute-engine-2.0.0-SNAPSHOT-tests.jar>
to org.apache.jclouds.labs/google-compute-engine/2.0.0-SNAPSHOT/google-compute-engine-2.0.0-SNAPSHOT-tests.jar
[JENKINS] Archiving <https://buildhive.cloudbees.com/job/jclouds/job/jclouds-labs-google/ws/oauth/pom.xml>
to org.apache.jclouds.labs/oauth/2.0.0-SNAPSHOT/oauth-2.0.0-SNAPSHOT.pom
[JENKINS] Archiving <https://buildhive.cloudbees.com/job/jclouds/job/jclouds-labs-google/ws/oauth/target/oauth-2.0.0-SNAPSHOT.jar>
to org.apache.jclouds.labs/oauth/2.0.0-SNAPSHOT/oauth-2.0.0-SNAPSHOT.jar
[JENKINS] Archiving <https://buildhive.cloudbees.com/job/jclouds/job/jclouds-labs-google/ws/oauth/target/oauth-2.0.0-SNAPSHOT-tests.jar>
to org.apache.jclouds.labs/oauth/2.0.0-SNAPSHOT/oauth-2.0.0-SNAPSHOT-tests.jar
channel stopped

Mime
View raw message