jclouds-notifications mailing list archives

Site index · List index
Message view « Date » · « Thread »
Top « Date » · « Thread »
From jenkins-no-re...@cloudbees.com
Subject Build failed in Jenkins: jclouds-labs-1.8.x-branch #93
Date Sat, 29 Nov 2014 00:50:48 GMT
See <https://jclouds.ci.cloudbees.com/job/jclouds-labs-1.8.x-branch/93/>

------------------------------------------
[...truncated 1828 lines...]
[Unloading class org.apache.velocity.runtime.parser.node.SetPropertyExecutor]
[Unloading class org.apache.velocity.runtime.directive.Define]
[Unloading class org.apache.velocity.runtime.parser.CharStream]
[Unloading class org.apache.velocity.util.StringUtils]
[Unloading class org.apache.velocity.runtime.directive.InputBase]
[Unloading class com.google.common.collect.Lists$StringAsImmutableList]
[Unloading class com.google.common.collect.AbstractMultimap]
[Unloading class com.google.auto.common.MoreElements]
[Unloading class org.apache.velocity.runtime.resource.loader.ResourceLoaderFactory]
[Unloading class com.google.common.base.Charsets]
[Unloading class org.apache.velocity.util.introspection.VelMethod]
[Unloading class org.apache.velocity.runtime.resource.ResourceCacheImpl]
[Unloading class com.google.common.collect.Sets$ImprovedAbstractSet]
[Unloading class com.google.common.collect.RegularImmutableAsList]
[Unloading class org.apache.velocity.util.introspection.ClassMap]
[Unloading class org.apache.velocity.runtime.parser.node.ASTWord]
[Unloading class com.google.common.collect.Sets]
[Unloading class org.apache.velocity.util.introspection.VelPropertySet]
[Unloading class org.apache.commons.collections.ExtendedProperties]
[Unloading class com.google.common.collect.Multimap]
[Unloading class org.apache.velocity.runtime.parser.node.ASTExpression]
[Unloading class org.apache.velocity.runtime.log.ServletLogChute]
[Unloading class org.apache.velocity.runtime.parser.node.ASTIdentifier]
[Unloading class org.apache.velocity.context.AbstractContext]
[Unloading class com.google.common.collect.Maps$KeySet]
[Unloading class com.google.common.collect.ImmutableCollection]
[Unloading class org.apache.velocity.runtime.directive.MacroParseException]
[Unloading class com.google.auto.value.processor.AutoValueProcessor$Property]
[Unloading class com.google.common.collect.Maps]
[Unloading class org.apache.commons.collections.OrderedMapIterator]
[Unloading class org.apache.velocity.runtime.parser.node.NodeUtils]
[Unloading class org.apache.velocity.app.event.EventHandlerUtil]
[Unloading class org.apache.velocity.runtime.parser.ParserTreeConstants]
[Unloading class org.apache.commons.collections.OrderedMap]
[Unloading class org.apache.velocity.runtime.log.AvalonLogChute]
[Unloading class com.google.common.collect.Iterators$7]
[Unloading class com.google.common.collect.UnmodifiableListIterator]
[Unloading class org.apache.velocity.runtime.parser.node.Node]
[Unloading class org.apache.velocity.runtime.directive.StopCommand]
[Unloading class com.google.auto.value.processor.AutoValueProcessor$1]
[Unloading class com.google.auto.common.MoreElements$4]
[Unloading class org.apache.velocity.runtime.parser.node.ASTprocess]
[Unloading class sun.reflect.GeneratedMethodAccessor40]
[Unloading class com.google.common.collect.UnmodifiableIterator]
[Unloading class com.google.auto.value.processor.EclipseHack]
[Unloading class com.google.common.collect.AbstractMapBasedMultimap$AsMap]
[Unloading class com.google.common.collect.ImmutableList$1]
[Unloading class com.google.common.collect.Iterables]
[Unloading class com.google.common.collect.Iterators$2]
[Unloading class org.apache.velocity.util.SimplePool]
[Unloading class com.google.common.collect.AbstractMapBasedMultimap$SortedKeySet]
[Unloading class com.google.common.collect.Lists$TransformingSequentialList]
[Unloading class org.apache.velocity.runtime.parser.node.ASTAndNode]
[Unloading class org.apache.velocity.runtime.resource.ResourceManagerImpl]
[Unloading class org.apache.commons.collections.OrderedIterator]
[Unloading class com.google.common.collect.UnmodifiableListIterator]
[Unloading class com.google.common.base.Equivalence]
[Unloading class com.google.common.collect.AbstractMapBasedMultimap$KeySet]
[Unloading class org.apache.velocity.app.event.EventHandlerMethodExecutor]
[Unloading class org.apache.velocity.util.introspection.Introspector]
[Unloading class com.google.auto.common.MoreElements$1]
[Unloading class org.apache.commons.collections.ExtendedProperties$PropertiesTokenizer]
[Unloading class com.google.common.collect.Iterators$1]
[Unloading class com.google.common.collect.ImmutableSet]
[Unloading class com.google.common.collect.Iterators$7]
[Unloading class com.google.auto.value.processor.TypeSimplifier$ReferencedClassTypeVisitor]
[Unloading class org.apache.velocity.util.introspection.UberspectLoggable]
[Unloading class org.apache.velocity.util.introspection.MethodMap]
[Unloading class org.apache.velocity.runtime.parser.ParserTokenManager$ParserState]
[Unloading class com.google.common.collect.Iterators$13]
[Unloading class org.apache.velocity.runtime.log.CommonsLogLogChute]
[Unloading class org.apache.velocity.runtime.VelocimacroManager$MacroEntry]
[Unloading class org.apache.velocity.runtime.parser.node.ASTBlock]
[Unloading class com.google.common.collect.SortedMapDifference]
[Unloading class org.apache.velocity.runtime.directive.Break]
[Unloading class com.google.common.collect.Iterators$12]
[Unloading class com.google.common.collect.SetMultimap]
[Unloading class com.google.auto.service.processor.AutoServiceProcessor]
[Unloading class org.apache.velocity.util.MapFactory]
[Unloading class sun.reflect.GeneratedMethodAccessor33]
[Unloading class org.apache.commons.collections.map.AbstractLinkedMap$LinkEntry]
[Unloading class com.google.auto.common.MoreTypes$1]
[Unloading class org.apache.velocity.runtime.resource.loader.FileResourceLoader]
[Unloading class com.google.auto.value.processor.AutoValueProcessor$ObjectMethodToOverride]
[Unloading class org.apache.velocity.exception.ExtendedParseException]
[Unloading class org.apache.velocity.runtime.resource.loader.ResourceLoader]
[Unloading class org.apache.velocity.util.introspection.IntrospectorBase]
[Unloading class com.google.common.base.Preconditions]
[Unloading class sun.reflect.GeneratedMethodAccessor39]
[Unloading class com.google.common.collect.Iterators$6]
[Unloading class com.google.common.base.Function]
[Unloading class com.google.common.collect.SingletonImmutableSet]
[INFO] Final Memory: 27M/118M
[INFO] ------------------------------------------------------------------------
Waiting for Jenkins to finish collecting data
[ERROR] Failed to execute goal org.apache.maven.plugins:maven-surefire-plugin:2.17:test (default-test)
on project azurecompute: Execution default-test of goal org.apache.maven.plugins:maven-surefire-plugin:2.17:test
failed: Unable to load the mojo 'test' in the plugin 'org.apache.maven.plugins:maven-surefire-plugin:2.17'.
A required class is missing: org/apache/maven/surefire/booter/KeyValueSource
[ERROR] -----------------------------------------------------
[ERROR] realm =    plugin>org.apache.maven.plugins:maven-surefire-plugin:2.17
[ERROR] strategy = org.codehaus.plexus.classworlds.strategy.SelfFirstStrategy
[ERROR] urls[0] = <https://jclouds.ci.cloudbees.com/job/jclouds-labs-1.8.x-branch/ws/.repository/org/apache/maven/plugins/maven-surefire-plugin/2.17/maven-surefire-plugin-2.17.jar>
[ERROR] urls[1] = <https://jclouds.ci.cloudbees.com/job/jclouds-labs-1.8.x-branch/ws/.repository/org/apache/maven/surefire/maven-surefire-common/2.17/maven-surefire-common-2.17.jar>
[ERROR] urls[2] = <https://jclouds.ci.cloudbees.com/job/jclouds-labs-1.8.x-branch/ws/.repository/org/apache/maven/surefire/surefire-api/2.17/surefire-api-2.17.jar>
[ERROR] urls[3] = <https://jclouds.ci.cloudbees.com/job/jclouds-labs-1.8.x-branch/ws/.repository/org/apache/maven/reporting/maven-reporting-api/2.0.9/maven-reporting-api-2.0.9.jar>
[ERROR] urls[4] = <https://jclouds.ci.cloudbees.com/job/jclouds-labs-1.8.x-branch/ws/.repository/org/codehaus/plexus/plexus-utils/1.5.1/plexus-utils-1.5.1.jar>
[ERROR] urls[5] = <https://jclouds.ci.cloudbees.com/job/jclouds-labs-1.8.x-branch/ws/.repository/org/apache/maven/plugin-tools/maven-plugin-annotations/3.2/maven-plugin-annotations-3.2.jar>
[ERROR] Number of foreign imports: 1
[ERROR] import: Entry[import  from realm ClassRealm[project>org.apache.jclouds.labs:jclouds-labs:1.8.2-SNAPSHOT,
parent: ClassRealm[maven.api, parent: null]]]
[ERROR] 
[ERROR] -----------------------------------------------------: org.apache.maven.surefire.booter.KeyValueSource
[ERROR] -> [Help 1]
org.apache.maven.lifecycle.LifecycleExecutionException: Failed to execute goal org.apache.maven.plugins:maven-surefire-plugin:2.17:test
(default-test) on project azurecompute: Execution default-test of goal org.apache.maven.plugins:maven-surefire-plugin:2.17:test
failed: Unable to load the mojo 'test' in the plugin 'org.apache.maven.plugins:maven-surefire-plugin:2.17'.
A required class is missing: org/apache/maven/surefire/booter/KeyValueSource
-----------------------------------------------------
realm =    plugin>org.apache.maven.plugins:maven-surefire-plugin:2.17
strategy = org.codehaus.plexus.classworlds.strategy.SelfFirstStrategy
urls[0] = <https://jclouds.ci.cloudbees.com/job/jclouds-labs-1.8.x-branch/ws/.repository/org/apache/maven/plugins/maven-surefire-plugin/2.17/maven-surefire-plugin-2.17.jar>
urls[1] = <https://jclouds.ci.cloudbees.com/job/jclouds-labs-1.8.x-branch/ws/.repository/org/apache/maven/surefire/maven-surefire-common/2.17/maven-surefire-common-2.17.jar>
urls[2] = <https://jclouds.ci.cloudbees.com/job/jclouds-labs-1.8.x-branch/ws/.repository/org/apache/maven/surefire/surefire-api/2.17/surefire-api-2.17.jar>
urls[3] = <https://jclouds.ci.cloudbees.com/job/jclouds-labs-1.8.x-branch/ws/.repository/org/apache/maven/reporting/maven-reporting-api/2.0.9/maven-reporting-api-2.0.9.jar>
urls[4] = <https://jclouds.ci.cloudbees.com/job/jclouds-labs-1.8.x-branch/ws/.repository/org/codehaus/plexus/plexus-utils/1.5.1/plexus-utils-1.5.1.jar>
urls[5] = <https://jclouds.ci.cloudbees.com/job/jclouds-labs-1.8.x-branch/ws/.repository/org/apache/maven/plugin-tools/maven-plugin-annotations/3.2/maven-plugin-annotations-3.2.jar>
Number of foreign imports: 1
import: Entry[import  from realm ClassRealm[project>org.apache.jclouds.labs:jclouds-labs:1.8.2-SNAPSHOT,
parent: ClassRealm[maven.api, parent: null]]]

-----------------------------------------------------

	at org.apache.maven.lifecycle.internal.MojoExecutor.execute(MojoExecutor.java:225)
	at org.apache.maven.lifecycle.internal.MojoExecutor.execute(MojoExecutor.java:153)
	at org.apache.maven.lifecycle.internal.MojoExecutor.execute(MojoExecutor.java:145)
	at org.apache.maven.lifecycle.internal.LifecycleModuleBuilder.buildProject(LifecycleModuleBuilder.java:84)
	at org.apache.maven.lifecycle.internal.LifecycleModuleBuilder.buildProject(LifecycleModuleBuilder.java:59)
	at org.apache.maven.lifecycle.internal.LifecycleStarter.singleThreadedBuild(LifecycleStarter.java:183)
	at org.apache.maven.lifecycle.internal.LifecycleStarter.execute(LifecycleStarter.java:161)
	at org.apache.maven.DefaultMaven.doExecute(DefaultMaven.java:319)
	at org.apache.maven.DefaultMaven.execute(DefaultMaven.java:156)
	at org.jvnet.hudson.maven3.launcher.Maven3Launcher.main(Maven3Launcher.java:117)
	at sun.reflect.NativeMethodAccessorImpl.invoke0(Native Method)
	at sun.reflect.NativeMethodAccessorImpl.invoke(NativeMethodAccessorImpl.java:39)
	at sun.reflect.DelegatingMethodAccessorImpl.invoke(DelegatingMethodAccessorImpl.java:25)
	at java.lang.reflect.Method.invoke(Method.java:597)
	at org.codehaus.plexus.classworlds.launcher.Launcher.launchStandard(Launcher.java:329)
	at org.codehaus.plexus.classworlds.launcher.Launcher.launch(Launcher.java:239)
	at org.jvnet.hudson.maven3.agent.Maven3Main.launch(Maven3Main.java:178)
	at sun.reflect.NativeMethodAccessorImpl.invoke0(Native Method)
	at sun.reflect.NativeMethodAccessorImpl.invoke(NativeMethodAccessorImpl.java:39)
	at sun.reflect.DelegatingMethodAccessorImpl.invoke(DelegatingMethodAccessorImpl.java:25)
	at java.lang.reflect.Method.invoke(Method.java:597)
	at hudson.maven.Maven3Builder.call(Maven3Builder.java:134)
	at hudson.maven.Maven3Builder.call(Maven3Builder.java:69)
	at hudson.remoting.UserRequest.perform(UserRequest.java:121)
	at hudson.remoting.UserRequest.perform(UserRequest.java:49)
	at hudson.remoting.Request$2.run(Request.java:324)
	at hudson.remoting.InterceptingExecutorService$1.call(InterceptingExecutorService.java:68)
	at java.util.concurrent.FutureTask$Sync.innerRun(FutureTask.java:303)
	at java.util.concurrent.FutureTask.run(FutureTask.java:138)
	at java.util.concurrent.ThreadPoolExecutor$Worker.runTask(ThreadPoolExecutor.java:895)
	at java.util.concurrent.ThreadPoolExecutor$Worker.run(ThreadPoolExecutor.java:918)
	at java.lang.Thread.run(Thread.java:662)
Caused by: org.apache.maven.plugin.PluginExecutionException: Execution default-test of goal
org.apache.maven.plugins:maven-surefire-plugin:2.17:test failed: Unable to load the mojo 'test'
in the plugin 'org.apache.maven.plugins:maven-surefire-plugin:2.17'. A required class is missing:
org/apache/maven/surefire/booter/KeyValueSource
-----------------------------------------------------
realm =    plugin>org.apache.maven.plugins:maven-surefire-plugin:2.17
strategy = org.codehaus.plexus.classworlds.strategy.SelfFirstStrategy
urls[0] = <https://jclouds.ci.cloudbees.com/job/jclouds-labs-1.8.x-branch/ws/.repository/org/apache/maven/plugins/maven-surefire-plugin/2.17/maven-surefire-plugin-2.17.jar>
urls[1] = <https://jclouds.ci.cloudbees.com/job/jclouds-labs-1.8.x-branch/ws/.repository/org/apache/maven/surefire/maven-surefire-common/2.17/maven-surefire-common-2.17.jar>
urls[2] = <https://jclouds.ci.cloudbees.com/job/jclouds-labs-1.8.x-branch/ws/.repository/org/apache/maven/surefire/surefire-api/2.17/surefire-api-2.17.jar>
urls[3] = <https://jclouds.ci.cloudbees.com/job/jclouds-labs-1.8.x-branch/ws/.repository/org/apache/maven/reporting/maven-reporting-api/2.0.9/maven-reporting-api-2.0.9.jar>
urls[4] = <https://jclouds.ci.cloudbees.com/job/jclouds-labs-1.8.x-branch/ws/.repository/org/codehaus/plexus/plexus-utils/1.5.1/plexus-utils-1.5.1.jar>
urls[5] = <https://jclouds.ci.cloudbees.com/job/jclouds-labs-1.8.x-branch/ws/.repository/org/apache/maven/plugin-tools/maven-plugin-annotations/3.2/maven-plugin-annotations-3.2.jar>
Number of foreign imports: 1
import: Entry[import  from realm ClassRealm[project>org.apache.jclouds.labs:jclouds-labs:1.8.2-SNAPSHOT,
parent: ClassRealm[maven.api, parent: null]]]

-----------------------------------------------------

	at org.apache.maven.plugin.DefaultBuildPluginManager.executeMojo(DefaultBuildPluginManager.java:115)
	at org.apache.maven.lifecycle.internal.MojoExecutor.execute(MojoExecutor.java:209)
	... 31 more
Caused by: org.apache.maven.plugin.PluginContainerException: Unable to load the mojo 'test'
in the plugin 'org.apache.maven.plugins:maven-surefire-plugin:2.17'. A required class is missing:
org/apache/maven/surefire/booter/KeyValueSource
-----------------------------------------------------
realm =    plugin>org.apache.maven.plugins:maven-surefire-plugin:2.17
strategy = org.codehaus.plexus.classworlds.strategy.SelfFirstStrategy
urls[0] = <https://jclouds.ci.cloudbees.com/job/jclouds-labs-1.8.x-branch/ws/.repository/org/apache/maven/plugins/maven-surefire-plugin/2.17/maven-surefire-plugin-2.17.jar>
urls[1] = <https://jclouds.ci.cloudbees.com/job/jclouds-labs-1.8.x-branch/ws/.repository/org/apache/maven/surefire/maven-surefire-common/2.17/maven-surefire-common-2.17.jar>
urls[2] = <https://jclouds.ci.cloudbees.com/job/jclouds-labs-1.8.x-branch/ws/.repository/org/apache/maven/surefire/surefire-api/2.17/surefire-api-2.17.jar>
urls[3] = <https://jclouds.ci.cloudbees.com/job/jclouds-labs-1.8.x-branch/ws/.repository/org/apache/maven/reporting/maven-reporting-api/2.0.9/maven-reporting-api-2.0.9.jar>
urls[4] = <https://jclouds.ci.cloudbees.com/job/jclouds-labs-1.8.x-branch/ws/.repository/org/codehaus/plexus/plexus-utils/1.5.1/plexus-utils-1.5.1.jar>
urls[5] = <https://jclouds.ci.cloudbees.com/job/jclouds-labs-1.8.x-branch/ws/.repository/org/apache/maven/plugin-tools/maven-plugin-annotations/3.2/maven-plugin-annotations-3.2.jar>
Number of foreign imports: 1
import: Entry[import  from realm ClassRealm[project>org.apache.jclouds.labs:jclouds-labs:1.8.2-SNAPSHOT,
parent: ClassRealm[maven.api, parent: null]]]

-----------------------------------------------------

	at org.apache.maven.plugin.internal.DefaultMavenPluginManager.getConfiguredMojo(DefaultMavenPluginManager.java:474)
	at org.apache.maven.plugin.DefaultBuildPluginManager.executeMojo(DefaultBuildPluginManager.java:92)
	... 32 more
Caused by: java.lang.NoClassDefFoundError: org/apache/maven/surefire/booter/KeyValueSource
	at java.lang.Class.getDeclaredConstructors0(Native Method)
	at java.lang.Class.privateGetDeclaredConstructors(Class.java:2398)
	at java.lang.Class.getDeclaredConstructors(Class.java:1838)
	at com.google.inject.spi.InjectionPoint.forConstructorOf(InjectionPoint.java:243)
	at com.google.inject.internal.ConstructorBindingImpl.create(ConstructorBindingImpl.java:96)
	at com.google.inject.internal.InjectorImpl.createUninitializedBinding(InjectorImpl.java:628)
	at com.google.inject.internal.InjectorImpl.createJustInTimeBinding(InjectorImpl.java:835)
	at com.google.inject.internal.InjectorImpl.createJustInTimeBindingRecursive(InjectorImpl.java:769)
	at com.google.inject.internal.InjectorImpl.getJustInTimeBinding(InjectorImpl.java:254)
	at com.google.inject.internal.InjectorImpl.getBindingOrThrow(InjectorImpl.java:205)
	at com.google.inject.internal.InjectorImpl.getInternalFactory(InjectorImpl.java:843)
	at com.google.inject.internal.InjectorImpl.getProviderOrThrow(InjectorImpl.java:957)
	at com.google.inject.internal.InjectorImpl.getProvider(InjectorImpl.java:990)
	at com.google.inject.internal.InjectorImpl.getProvider(InjectorImpl.java:951)
	at com.google.inject.internal.InjectorImpl.getInstance(InjectorImpl.java:1003)
	at org.sonatype.guice.bean.reflect.AbstractDeferredClass.get(AbstractDeferredClass.java:47)
	at com.google.inject.internal.InternalFactoryToProviderAdapter.get(InternalFactoryToProviderAdapter.java:40)
	at com.google.inject.internal.InjectorImpl$4$1.call(InjectorImpl.java:968)
	at com.google.inject.internal.InjectorImpl.callInContext(InjectorImpl.java:1014)
	at com.google.inject.internal.InjectorImpl$4.get(InjectorImpl.java:964)
	at com.google.inject.Scopes$1$1.get(Scopes.java:59)
	at org.sonatype.guice.bean.locators.LazyBeanEntry.getValue(LazyBeanEntry.java:79)
	at org.sonatype.guice.plexus.locators.LazyPlexusBean.getValue(LazyPlexusBean.java:53)
	at org.codehaus.plexus.DefaultPlexusContainer.lookup(DefaultPlexusContainer.java:243)
	at org.codehaus.plexus.DefaultPlexusContainer.lookup(DefaultPlexusContainer.java:235)
	at org.apache.maven.plugin.internal.DefaultMavenPluginManager.getConfiguredMojo(DefaultMavenPluginManager.java:455)
	... 33 more
Caused by: java.lang.ClassNotFoundException: org.apache.maven.surefire.booter.KeyValueSource
	at org.codehaus.plexus.classworlds.strategy.SelfFirstStrategy.loadClass(SelfFirstStrategy.java:50)
	at org.codehaus.plexus.classworlds.realm.ClassRealm.loadClass(ClassRealm.java:244)
	at org.codehaus.plexus.classworlds.realm.ClassRealm.loadClass(ClassRealm.java:230)
	... 59 more
[ERROR] 
[ERROR] Re-run Maven using the -X switch to enable full debug logging.
[ERROR] 
[ERROR] For more information about the errors and possible solutions, please read the following
articles:
[ERROR] [Help 1] http://cwiki.apache.org/confluence/display/MAVEN/PluginContainerException
[JENKINS] Archiving <https://jclouds.ci.cloudbees.com/job/jclouds-labs-1.8.x-branch/ws/cloudsigma2/pom.xml>
to org.apache.jclouds.labs/cloudsigma2/1.8.2-SNAPSHOT/cloudsigma2-1.8.2-SNAPSHOT.pom
[JENKINS] Archiving <https://jclouds.ci.cloudbees.com/job/jclouds-labs-1.8.x-branch/ws/joyent-cloudapi/pom.xml>
to org.apache.jclouds.labs/joyent-cloudapi/1.8.2-SNAPSHOT/joyent-cloudapi-1.8.2-SNAPSHOT.pom
[JENKINS] Archiving <https://jclouds.ci.cloudbees.com/job/jclouds-labs-1.8.x-branch/ws/cloudsigma2-zrh/pom.xml>
to org.apache.jclouds.labs/cloudsigma2-zrh/1.8.2-SNAPSHOT/cloudsigma2-zrh-1.8.2-SNAPSHOT.pom
[JENKINS] Archiving <https://jclouds.ci.cloudbees.com/job/jclouds-labs-1.8.x-branch/ws/pom.xml>
to org.apache.jclouds.labs/jclouds-labs/1.8.2-SNAPSHOT/jclouds-labs-1.8.2-SNAPSHOT.pom
[JENKINS] Archiving <https://jclouds.ci.cloudbees.com/job/jclouds-labs-1.8.x-branch/ws/docker/pom.xml>
to org.apache.jclouds.labs/docker/1.8.2-SNAPSHOT/docker-1.8.2-SNAPSHOT.pom
[JENKINS] Archiving <https://jclouds.ci.cloudbees.com/job/jclouds-labs-1.8.x-branch/ws/cloudsigma2-wdc/pom.xml>
to org.apache.jclouds.labs/cloudsigma2-wdc/1.8.2-SNAPSHOT/cloudsigma2-wdc-1.8.2-SNAPSHOT.pom
[JENKINS] Archiving <https://jclouds.ci.cloudbees.com/job/jclouds-labs-1.8.x-branch/ws/vcloud-director/pom.xml>
to org.apache.jclouds.labs/vcloud-director/1.8.2-SNAPSHOT/vcloud-director-1.8.2-SNAPSHOT.pom
[JENKINS] Archiving <https://jclouds.ci.cloudbees.com/job/jclouds-labs-1.8.x-branch/ws/dmtf/pom.xml>
to org.apache.jclouds.labs/dmtf/1.8.2-SNAPSHOT/dmtf-1.8.2-SNAPSHOT.pom
[JENKINS] Archiving <https://jclouds.ci.cloudbees.com/job/jclouds-labs-1.8.x-branch/ws/cloudsigma2-sjc/pom.xml>
to org.apache.jclouds.labs/cloudsigma2-sjc/1.8.2-SNAPSHOT/cloudsigma2-sjc-1.8.2-SNAPSHOT.pom
[JENKINS] Archiving <https://jclouds.ci.cloudbees.com/job/jclouds-labs-1.8.x-branch/ws/digitalocean/pom.xml>
to org.apache.jclouds.labs/digitalocean/1.8.2-SNAPSHOT/digitalocean-1.8.2-SNAPSHOT.pom
[JENKINS] Archiving <https://jclouds.ci.cloudbees.com/job/jclouds-labs-1.8.x-branch/ws/azurecompute/pom.xml>
to org.apache.jclouds.labs/azurecompute/1.8.2-SNAPSHOT/azurecompute-1.8.2-SNAPSHOT.pom
[JENKINS] Archiving <https://jclouds.ci.cloudbees.com/job/jclouds-labs-1.8.x-branch/ws/joyentcloud/pom.xml>
to org.apache.jclouds.labs/joyentcloud/1.8.2-SNAPSHOT/joyentcloud-1.8.2-SNAPSHOT.pom
[JENKINS] Archiving <https://jclouds.ci.cloudbees.com/job/jclouds-labs-1.8.x-branch/ws/cloudsigma2-lvs/pom.xml>
to org.apache.jclouds.labs/cloudsigma2-lvs/1.8.2-SNAPSHOT/cloudsigma2-lvs-1.8.2-SNAPSHOT.pom
[JENKINS] Archiving <https://jclouds.ci.cloudbees.com/job/jclouds-labs-1.8.x-branch/ws/abiquo/pom.xml>
to org.apache.jclouds.labs/abiquo/1.8.2-SNAPSHOT/abiquo-1.8.2-SNAPSHOT.pom
[JENKINS] Archiving <https://jclouds.ci.cloudbees.com/job/jclouds-labs-1.8.x-branch/ws/cloudsigma2-hnl/pom.xml>
to org.apache.jclouds.labs/cloudsigma2-hnl/1.8.2-SNAPSHOT/cloudsigma2-hnl-1.8.2-SNAPSHOT.pom
[JENKINS] Archiving <https://jclouds.ci.cloudbees.com/job/jclouds-labs-1.8.x-branch/ws/cdmi/pom.xml>
to org.apache.jclouds.labs/cdmi/1.8.2-SNAPSHOT/cdmi-1.8.2-SNAPSHOT.pom
Sending e-mails to: notifications@jclouds.apache.org
channel stopped

Mime
View raw message