jclouds-notifications mailing list archives

Site index · List index
Message view « Date » · « Thread »
Top « Date » · « Thread »
From jenkins-no-re...@cloudbees.com
Subject Build failed in Jenkins: jclouds-guava-17-18 » 17.0,OpenJDK 7 (latest) #56
Date Thu, 22 Jan 2015 19:53:00 GMT
See <https://jclouds.ci.cloudbees.com/job/jclouds-guava-17-18/GUAVA_VERSION=17.0,jdk=OpenJDK%207%20(latest)/56/changes>

Changes:

[Zack Shoylev] More robust line-ending detection for Bundles

------------------------------------------
[...truncated 10818 lines...]
*** allocated new container jenkins-blobstore-1802466242319654571...
[TestNG] Test deleteContainerIfEmptyWithContents(org.jclouds.blobstore.integration.TransientContainerIntegrationTest)
succeeded: 3ms
Test suite progress: tests succeeded: 34, failed: 1, skipped: 2.
Starting test deleteContainerIfEmptyWithoutContents(org.jclouds.blobstore.integration.TransientContainerIntegrationTest)
*** allocated new container jenkins-blobstore7491791500140806523...
[TestNG] Test deleteContainerIfEmptyWithoutContents(org.jclouds.blobstore.integration.TransientContainerIntegrationTest)
succeeded: 1ms
Test suite progress: tests succeeded: 35, failed: 1, skipped: 2.
Starting test deleteContainerWithContents(org.jclouds.blobstore.integration.TransientContainerIntegrationTest)
*** allocated new container jenkins-blobstore6718257187819617743...
[TestNG] Test deleteContainerWithContents(org.jclouds.blobstore.integration.TransientContainerIntegrationTest)
succeeded: 1ms
Test suite progress: tests succeeded: 36, failed: 1, skipped: 2.
Starting test deleteContainerWithoutContents(org.jclouds.blobstore.integration.TransientContainerIntegrationTest)
*** allocated new container jenkins-blobstore1034904875438401722...
[TestNG] Test deleteContainerWithoutContents(org.jclouds.blobstore.integration.TransientContainerIntegrationTest)
succeeded: 0ms
Test suite progress: tests succeeded: 37, failed: 1, skipped: 2.
Starting test testClearWhenContentsUnderPath(org.jclouds.blobstore.integration.TransientContainerIntegrationTest)
[TestNG] Test testClearWhenContentsUnderPath(org.jclouds.blobstore.integration.TransientContainerIntegrationTest)
succeeded: 12ms
Test suite progress: tests succeeded: 38, failed: 1, skipped: 2.
Starting test testDirectory(org.jclouds.blobstore.integration.TransientContainerIntegrationTest)
[TestNG] Test testDirectory(org.jclouds.blobstore.integration.TransientContainerIntegrationTest)
succeeded: 26ms
Test suite progress: tests succeeded: 39, failed: 1, skipped: 2.
Starting test testListContainer(org.jclouds.blobstore.integration.TransientContainerIntegrationTest)
[TestNG] Test testListContainer(org.jclouds.blobstore.integration.TransientContainerIntegrationTest)
succeeded: 10ms
Test suite progress: tests succeeded: 40, failed: 1, skipped: 2.
Starting test testListContainerGetBlobSize(org.jclouds.blobstore.integration.TransientContainerIntegrationTest)
[TestNG] Test testListContainerGetBlobSize(org.jclouds.blobstore.integration.TransientContainerIntegrationTest)
succeeded: 1ms
Test suite progress: tests succeeded: 41, failed: 1, skipped: 2.
Starting test testListContainerMarker(org.jclouds.blobstore.integration.TransientContainerIntegrationTest)
[TestNG] Test testListContainerMarker(org.jclouds.blobstore.integration.TransientContainerIntegrationTest)
succeeded: 19ms
Test suite progress: tests succeeded: 42, failed: 1, skipped: 2.
Starting test testListContainerMaxResults(org.jclouds.blobstore.integration.TransientContainerIntegrationTest)
[TestNG] Test testListContainerMaxResults(org.jclouds.blobstore.integration.TransientContainerIntegrationTest)
succeeded: 22ms
Test suite progress: tests succeeded: 43, failed: 1, skipped: 2.
Starting test testListContainerPrefix(org.jclouds.blobstore.integration.TransientContainerIntegrationTest)
[TestNG] Test testListContainerPrefix(org.jclouds.blobstore.integration.TransientContainerIntegrationTest)
succeeded: 19ms
Test suite progress: tests succeeded: 44, failed: 1, skipped: 2.
Starting test testListContainerWithZeroMaxResults(org.jclouds.blobstore.integration.TransientContainerIntegrationTest)
[TestNG] Test testListContainerWithZeroMaxResults(org.jclouds.blobstore.integration.TransientContainerIntegrationTest)
succeeded: 2ms
Test suite progress: tests succeeded: 45, failed: 1, skipped: 2.
Starting test testListMarkerAfterLastKey(org.jclouds.blobstore.integration.TransientContainerIntegrationTest)
[TestNG] Test testListMarkerAfterLastKey(org.jclouds.blobstore.integration.TransientContainerIntegrationTest)
succeeded: 1ms
Test suite progress: tests succeeded: 46, failed: 1, skipped: 2.
Starting test testListRootUsesDelimiter(org.jclouds.blobstore.integration.TransientContainerIntegrationTest)
[TestNG] Test testListRootUsesDelimiter(org.jclouds.blobstore.integration.TransientContainerIntegrationTest)
succeeded: 15ms
Test suite progress: tests succeeded: 47, failed: 1, skipped: 2.
Starting test testPutTwiceIsOkAndDoesntOverwrite(org.jclouds.blobstore.integration.TransientContainerIntegrationTest)
[TestNG] Test testPutTwiceIsOkAndDoesntOverwrite(org.jclouds.blobstore.integration.TransientContainerIntegrationTest)
succeeded: 1ms
Test suite progress: tests succeeded: 48, failed: 1, skipped: 2.
Starting test testWithDetails(org.jclouds.blobstore.integration.TransientContainerIntegrationTest)
[TestNG] Test testWithDetails(org.jclouds.blobstore.integration.TransientContainerIntegrationTest)
succeeded: 1ms
Test suite progress: tests succeeded: 49, failed: 1, skipped: 2.
Starting test containerDoesntExist(org.jclouds.blobstore.integration.TransientServiceIntegrationTest)
[TestNG] Test containerDoesntExist(org.jclouds.blobstore.integration.TransientServiceIntegrationTest)
succeeded: 1ms
Test suite progress: tests succeeded: 50, failed: 1, skipped: 2.
Starting test testAllLocations(org.jclouds.blobstore.integration.TransientServiceIntegrationTest)
*** allocated new container jenkins-blobstore2575014752091116734...
 >> creating container in location {scope=PROVIDER, id=transient, description=http://localhost}
 << call complete.. checking
*** allocated new container jenkins-blobstore166765042007756536...
[TestNG] Test testAllLocations(org.jclouds.blobstore.integration.TransientServiceIntegrationTest)
succeeded: 10ms
Test suite progress: tests succeeded: 51, failed: 1, skipped: 2.
Starting test testGetAssignableLocations(org.jclouds.blobstore.integration.TransientServiceIntegrationTest)
location {scope=PROVIDER, id=transient, description=http://localhost}
[TestNG] Test testGetAssignableLocations(org.jclouds.blobstore.integration.TransientServiceIntegrationTest)
succeeded: 1ms
Test suite progress: tests succeeded: 52, failed: 1, skipped: 2.
Starting test testDuplicateCreateContainer(org.jclouds.blobstore.integration.TransientContainerIntegrationTest)
[TestNG] Test testDuplicateCreateContainer(org.jclouds.blobstore.integration.TransientContainerIntegrationTest)
succeeded: 1ms
Test suite progress: tests succeeded: 53, failed: 1, skipped: 2.
Starting test testNotWithDetails(org.jclouds.blobstore.integration.TransientContainerIntegrationTest)
[TestNG] Test testNotWithDetails(org.jclouds.blobstore.integration.TransientContainerIntegrationTest)
succeeded: 3ms
Test suite progress: tests succeeded: 54, failed: 1, skipped: 2.
Tests run: 57, Failures: 1, Errors: 0, Skipped: 2, Time elapsed: 8.163 sec <<< FAILURE!
- in TestSuite
testFileGetParallel(org.jclouds.blobstore.integration.TransientBlobIntegrationTest)  Time
elapsed: 0.03 sec  <<< FAILURE!
java.util.concurrent.ExecutionException: java.lang.ArrayIndexOutOfBoundsException: 15
	at java.util.concurrent.FutureTask.report(FutureTask.java:122)
	at java.util.concurrent.FutureTask.get(FutureTask.java:188)
	at org.jclouds.concurrent.FutureIterables$1.run(FutureIterables.java:123)
	at java.util.concurrent.ThreadPoolExecutor.runWorker(ThreadPoolExecutor.java:1145)
	at java.util.concurrent.ThreadPoolExecutor$Worker.run(ThreadPoolExecutor.java:615)
	at java.lang.Thread.run(Thread.java:744)
Caused by: java.lang.ArrayIndexOutOfBoundsException: 15
	at java.util.ArrayDeque.addFirst(ArrayDeque.java:227)
	at com.google.common.io.Closer.register(Closer.java:126)
	at org.jclouds.io.payloads.ByteSourcePayload.openStream(ByteSourcePayload.java:39)
	at org.jclouds.blobstore.integration.internal.BaseBlobIntegrationTest$2.call(BaseBlobIntegrationTest.java:166)
	at org.jclouds.blobstore.integration.internal.BaseBlobIntegrationTest$2.call(BaseBlobIntegrationTest.java:161)
	at java.util.concurrent.FutureTask.run(FutureTask.java:262)
	at java.util.concurrent.ThreadPoolExecutor.runWorker(ThreadPoolExecutor.java:1145)
	at java.util.concurrent.ThreadPoolExecutor$Worker.run(ThreadPoolExecutor.java:615)
	at java.lang.Thread.run(Thread.java:744)


Results :

Failed tests: 
  TransientBlobIntegrationTest.testFileGetParallel » Execution java.lang.ArrayIn...

Tests run: 57, Failures: 1, Errors: 0, Skipped: 2

[INFO] ------------------------------------------------------------------------
[INFO] Reactor Summary:
[INFO] 
[INFO] Apache jclouds Project ............................ SUCCESS [10.041s]
[INFO] jclouds shared Maven resources .................... SUCCESS [4.330s]
[INFO] jclouds Components Core ........................... SUCCESS [1:29.405s]
[INFO] jclouds OpenStack Components Core ................. SUCCESS [21.124s]
[INFO] jclouds commons project ........................... SUCCESS [0.769s]
[INFO] jclouds script builder ............................ SUCCESS [5.928s]
[INFO] jclouds compute core .............................. SUCCESS [40.240s]
[INFO] jclouds Log4J Logging Module ...................... SUCCESS [2.515s]
[INFO] jclouds loadbalancer core ......................... SUCCESS [2.269s]
[INFO] jclouds sts api ................................... SUCCESS [7.098s]
[INFO] jclouds cloudwatch api ............................ SUCCESS [9.249s]
[INFO] jclouds SLF4J Logging Module ...................... SUCCESS [2.740s]
[INFO] jclouds bouncycastle EncryptionService Module ..... SUCCESS [4.496s]
[INFO] jclouds sshj ssh client ........................... SUCCESS [6.575s]
[INFO] jclouds cloudstack core ........................... SUCCESS [1:01.738s]
[INFO] jclouds blobstore core ............................ FAILURE [34.943s]
[INFO] jclouds filesystem core ........................... SKIPPED
[INFO] jclouds bring your own node provider .............. SKIPPED
[INFO] jclouds OkHttp Driver ............................. SKIPPED
[INFO] jclouds s3 api .................................... SKIPPED
[INFO] jclouds ec2 api ................................... SKIPPED
[INFO] jclouds sqs api ................................... SKIPPED
[INFO] jclouds elasticstack core ......................... SKIPPED
[INFO] jclouds atmos components .......................... SKIPPED
[INFO] jclouds openstack-keystone api .................... SKIPPED
[INFO] jclouds swift api ................................. SKIPPED
[INFO] jclouds openstack-cinder api ...................... SKIPPED
[INFO] Apache jclouds :: OpenStack :: Nova API ........... SKIPPED
[INFO] jclouds openstack-nova-ec2 api .................... SKIPPED
[INFO] jclouds openstack-swift api ....................... SKIPPED
[INFO] jclouds openstack-trove api ....................... SKIPPED
[INFO] jclouds cloudfiles api ............................ SKIPPED
[INFO] jclouds rackspace cloudidentity api ............... SKIPPED
[INFO] jclouds Rackspace Cloud Load Balancers API ........ SKIPPED
[INFO] jclouds Rackspace Next Generation Cloud Servers US provider  SKIPPED
[INFO] jclouds rackspace clouddns api .................... SKIPPED
[INFO] jclouds route53 api ............................... SKIPPED
[INFO] jclouds Chef api .................................. SKIPPED
[INFO] jclouds apis project .............................. SKIPPED
[INFO] jclouds GoGrid provider ........................... SKIPPED
[INFO] jclouds Azure Storage provider .................... SKIPPED
[INFO] jclouds Apache Http Components Client ............. SKIPPED
[INFO] jclouds joda DateService Module ................... SKIPPED
[INFO] jclouds netty payload module ...................... SKIPPED
[INFO] jclouds enterprise Module ......................... SKIPPED
[INFO] jclouds Amazon Simple Storage Service (S3) provider  SKIPPED
[INFO] jclouds Amazon Elastic Load Balancer provider ..... SKIPPED
[INFO] jclouds Amazon EC2 provider ....................... SKIPPED
[INFO] jclouds Amazon Simple Queue Service provider ...... SKIPPED
[INFO] jclouds ElasticHosts Peer1 London provider ........ SKIPPED
[INFO] jclouds ElasticHosts Peer1 San Antonio provider ... SKIPPED
[INFO] jclouds ElasticHosts BlueSquare London provider ... SKIPPED
[INFO] jclouds ElasticHosts Peer1 Toronto provider ....... SKIPPED
[INFO] jclouds ElasticHosts Peer1 Los Angeles provider ... SKIPPED
[INFO] jclouds ElasticHosts Amsterdam provider ........... SKIPPED
[INFO] jclouds ElasticHosts San Jose provider ............ SKIPPED
[INFO] jclouds ElasticHosts Hong Kong provider ........... SKIPPED
[INFO] jclouds ElasticHosts Sydney provider .............. SKIPPED
[INFO] jclouds Open Hosting East1 provider ............... SKIPPED
[INFO] jclouds Serverlove Manchester provider ............ SKIPPED
[INFO] jclouds SkaliCloud Malaysia provider .............. SKIPPED
[INFO] jclouds Go2Cloud Johannesburg1 provider ........... SKIPPED
[INFO] jclouds SoftLayer core ............................ SKIPPED
[INFO] jclouds HP Cloud Compute provider ................. SKIPPED
[INFO] jclouds HP Cloud Block Storage Provider ........... SKIPPED
[INFO] jclouds HP Cloud Object Storage ................... SKIPPED
[INFO] jclouds CloudFiles US provider .................... SKIPPED
[INFO] jclouds CloudFiles UK provider .................... SKIPPED
[INFO] jclouds Rackspace Next Generation Cloud DNS US provider  SKIPPED
[INFO] jclouds Rackspace Next Generation Cloud DNS UK provider  SKIPPED
[INFO] jclouds Rackspace Cloud Databases US provider ..... SKIPPED
[INFO] jclouds Rackspace Cloud Databases UK provider ..... SKIPPED
[INFO] jclouds Rackspace Cloud Load Balancers US provider  SKIPPED
[INFO] jclouds Rackspace Cloud Load Balancers UK provider  SKIPPED
[INFO] jclouds Rackspace Next Generation Cloud Servers provider  SKIPPED
[INFO] jclouds Rackspace Next Generation Cloud Block Storage US provider  SKIPPED
[INFO] jclouds Rackspace Next Generation Cloud Block Storage UK provider  SKIPPED
[INFO] jclouds GleSYS core ............................... SKIPPED
[INFO] jclouds Amazon Identity and Access Management (STS) provider  SKIPPED
[INFO] jclouds Amazon Route 53 provider .................. SKIPPED
[INFO] jclouds ultradns-ws provider ...................... SKIPPED
[INFO] jclouds dynect api ................................ SKIPPED
[INFO] jclouds Enterprise Chef provider .................. SKIPPED
[INFO] jclouds providers project ......................... SKIPPED
[INFO] jclouds jsch ssh client ........................... SKIPPED
[INFO] jclouds example components for a standalone compute provider  SKIPPED
[INFO] jclouds skeletons project ......................... SKIPPED
[INFO] jclouds Google App Engine Components .............. SKIPPED
[INFO] jclouds drivers project ........................... SKIPPED
[INFO] allcompute ........................................ SKIPPED
[INFO] allblobstore ...................................... SKIPPED
[INFO] allloadbalancer ................................... SKIPPED
[INFO] all ............................................... SKIPPED
[INFO] Apache jclouds .................................... SKIPPED
[INFO] ------------------------------------------------------------------------
[INFO] BUILD FAILURE
[INFO] ------------------------------------------------------------------------
[INFO] Total time: 5:07.828s
[INFO] Finished at: Thu Jan 22 14:52:58 EST 2015
[INFO] Final Memory: 80M/255M
[INFO] ------------------------------------------------------------------------
[ERROR] Failed to execute goal org.apache.maven.plugins:maven-surefire-plugin:2.17:test (integration)
on project jclouds-blobstore: There are test failures.
[ERROR] 
[ERROR] Please refer to <https://jclouds.ci.cloudbees.com/job/jclouds-guava-17-18/GUAVA_VERSION=17.0,jdk=OpenJDK%207%20(latest)/ws/blobstore/target/surefire-reports>
for the individual test results.
[ERROR] -> [Help 1]
org.apache.maven.lifecycle.LifecycleExecutionException: Failed to execute goal org.apache.maven.plugins:maven-surefire-plugin:2.17:test
(integration) on project jclouds-blobstore: There are test failures.

Please refer to <https://jclouds.ci.cloudbees.com/job/jclouds-guava-17-18/GUAVA_VERSION=17.0,jdk=OpenJDK%207%20(latest)/ws/blobstore/target/surefire-reports>
for the individual test results.
	at org.apache.maven.lifecycle.internal.MojoExecutor.execute(MojoExecutor.java:213)
	at org.apache.maven.lifecycle.internal.MojoExecutor.execute(MojoExecutor.java:153)
	at org.apache.maven.lifecycle.internal.MojoExecutor.execute(MojoExecutor.java:145)
	at org.apache.maven.lifecycle.internal.LifecycleModuleBuilder.buildProject(LifecycleModuleBuilder.java:84)
	at org.apache.maven.lifecycle.internal.LifecycleModuleBuilder.buildProject(LifecycleModuleBuilder.java:59)
	at org.apache.maven.lifecycle.internal.LifecycleStarter.singleThreadedBuild(LifecycleStarter.java:183)
	at org.apache.maven.lifecycle.internal.LifecycleStarter.execute(LifecycleStarter.java:161)
	at org.apache.maven.DefaultMaven.doExecute(DefaultMaven.java:320)
	at org.apache.maven.DefaultMaven.execute(DefaultMaven.java:156)
	at org.apache.maven.cli.MavenCli.execute(MavenCli.java:537)
	at org.apache.maven.cli.MavenCli.doMain(MavenCli.java:196)
	at org.apache.maven.cli.MavenCli.main(MavenCli.java:141)
	at sun.reflect.NativeMethodAccessorImpl.invoke0(Native Method)
	at sun.reflect.NativeMethodAccessorImpl.invoke(NativeMethodAccessorImpl.java:57)
	at sun.reflect.DelegatingMethodAccessorImpl.invoke(DelegatingMethodAccessorImpl.java:43)
	at java.lang.reflect.Method.invoke(Method.java:606)
	at org.codehaus.plexus.classworlds.launcher.Launcher.launchEnhanced(Launcher.java:290)
	at org.codehaus.plexus.classworlds.launcher.Launcher.launch(Launcher.java:230)
	at org.codehaus.plexus.classworlds.launcher.Launcher.mainWithExitCode(Launcher.java:409)
	at org.codehaus.plexus.classworlds.launcher.Launcher.main(Launcher.java:352)
Caused by: org.apache.maven.plugin.MojoFailureException: There are test failures.

Please refer to <https://jclouds.ci.cloudbees.com/job/jclouds-guava-17-18/GUAVA_VERSION=17.0,jdk=OpenJDK%207%20(latest)/ws/blobstore/target/surefire-reports>
for the individual test results.
	at org.apache.maven.plugin.surefire.SurefireHelper.reportExecution(SurefireHelper.java:82)
	at org.apache.maven.plugin.surefire.SurefirePlugin.handleSummary(SurefirePlugin.java:195)
	at org.apache.maven.plugin.surefire.AbstractSurefireMojo.executeAfterPreconditionsChecked(AbstractSurefireMojo.java:861)
	at org.apache.maven.plugin.surefire.AbstractSurefireMojo.execute(AbstractSurefireMojo.java:729)
	at org.apache.maven.plugin.DefaultBuildPluginManager.executeMojo(DefaultBuildPluginManager.java:101)
	at org.apache.maven.lifecycle.internal.MojoExecutor.execute(MojoExecutor.java:209)
	... 19 more
[ERROR] 
[ERROR] Re-run Maven using the -X switch to enable full debug logging.
[ERROR] 
[ERROR] For more information about the errors and possible solutions, please read the following
articles:
[ERROR] [Help 1] http://cwiki.apache.org/confluence/display/MAVEN/MojoFailureException
[ERROR] 
[ERROR] After correcting the problems, you can resume the build with the command
[ERROR]   mvn <goals> -rf :jclouds-blobstore
Build step 'Invoke top-level Maven targets' marked build as failure

Mime
View raw message