jclouds-notifications mailing list archives

Site index · List index
Message view « Date » · « Thread »
Top « Date » · « Thread »
From jenkins-no-re...@cloudbees.com
Subject Build failed in Jenkins: jclouds-labs-openstack #641
Date Wed, 04 Feb 2015 17:42:46 GMT
See <https://jclouds.ci.cloudbees.com/job/jclouds-labs-openstack/641/>

------------------------------------------
[...truncated 2636 lines...]
Downloading: https://repository-jclouds.forge.cloudbees.com/release/com/pyx4j/maven-plugin-log4j/1.0.1/maven-plugin-log4j-1.0.1.pom
Downloading: http://repo.cloudbees.com/content/repositories/central/com/pyx4j/maven-plugin-log4j/1.0.1/maven-plugin-log4j-1.0.1.pom
Downloaded: http://repo.cloudbees.com/content/repositories/central/com/pyx4j/maven-plugin-log4j/1.0.1/maven-plugin-log4j-1.0.1.pom
(2 KB at 73.0 KB/sec)
Downloading: https://repository-jclouds.forge.cloudbees.com/release/com/pyx4j/pyx4j-maven-plugins/1.0.1/pyx4j-maven-plugins-1.0.1.pom
Downloading: http://repo.cloudbees.com/content/repositories/central/com/pyx4j/pyx4j-maven-plugins/1.0.1/pyx4j-maven-plugins-1.0.1.pom
Downloaded: http://repo.cloudbees.com/content/repositories/central/com/pyx4j/pyx4j-maven-plugins/1.0.1/pyx4j-maven-plugins-1.0.1.pom
(2 KB at 120.1 KB/sec)
Downloading: https://repository-jclouds.forge.cloudbees.com/release/com/pyx4j/pyx4j/1.0.1/pyx4j-1.0.1.pom
Downloading: http://repo.cloudbees.com/content/repositories/central/com/pyx4j/pyx4j/1.0.1/pyx4j-1.0.1.pom
Downloaded: http://repo.cloudbees.com/content/repositories/central/com/pyx4j/pyx4j/1.0.1/pyx4j-1.0.1.pom
(14 KB at 880.0 KB/sec)
Downloading: https://repository-jclouds.forge.cloudbees.com/release/commons-codec/commons-codec/1.5/commons-codec-1.5.jar
Downloading: https://repository-jclouds.forge.cloudbees.com/release/log4j/log4j/1.2.16/log4j-1.2.16.jar
Downloading: https://repository-jclouds.forge.cloudbees.com/release/org/slf4j/slf4j-log4j12/1.6.1/slf4j-log4j12-1.6.1.jar
Downloading: https://repository-jclouds.forge.cloudbees.com/release/org/slf4j/slf4j-api/1.6.1/slf4j-api-1.6.1.jar
Downloading: https://repository-jclouds.forge.cloudbees.com/release/com/pyx4j/maven-plugin-log4j/1.0.1/maven-plugin-log4j-1.0.1.jar
Downloading: http://repo.cloudbees.com/content/repositories/central/commons-codec/commons-codec/1.5/commons-codec-1.5.jar
Downloading: http://repo.cloudbees.com/content/repositories/central/log4j/log4j/1.2.16/log4j-1.2.16.jar
Downloading: http://repo.cloudbees.com/content/repositories/central/org/slf4j/slf4j-log4j12/1.6.1/slf4j-log4j12-1.6.1.jar
Downloading: http://repo.cloudbees.com/content/repositories/central/org/slf4j/slf4j-api/1.6.1/slf4j-api-1.6.1.jar
Downloading: http://repo.cloudbees.com/content/repositories/central/com/pyx4j/maven-plugin-log4j/1.0.1/maven-plugin-log4j-1.0.1.jar
Downloaded: http://repo.cloudbees.com/content/repositories/central/org/slf4j/slf4j-log4j12/1.6.1/slf4j-log4j12-1.6.1.jar
(10 KB at 190.5 KB/sec)
Downloaded: http://repo.cloudbees.com/content/repositories/central/com/pyx4j/maven-plugin-log4j/1.0.1/maven-plugin-log4j-1.0.1.jar
(4 KB at 71.3 KB/sec)
Downloaded: http://repo.cloudbees.com/content/repositories/central/commons-codec/commons-codec/1.5/commons-codec-1.5.jar
(72 KB at 1321.9 KB/sec)
Downloaded: http://repo.cloudbees.com/content/repositories/central/org/slf4j/slf4j-api/1.6.1/slf4j-api-1.6.1.jar
(25 KB at 422.0 KB/sec)
Downloaded: http://repo.cloudbees.com/content/repositories/central/log4j/log4j/1.2.16/log4j-1.2.16.jar
(471 KB at 7234.6 KB/sec)
[INFO] Checking compile classpath
[INFO] Checking runtime classpath
[INFO] Checking test classpath
[INFO] 
[INFO] --- maven-checkstyle-plugin:2.13:check (default) @ openstack-glance ---
Downloading: https://repository-jclouds.forge.cloudbees.com/snapshot/org/apache/jclouds/jclouds-resources/2.0.0-SNAPSHOT/maven-metadata.xml
Downloading: http://repository.apache.org/snapshots/org/apache/jclouds/jclouds-resources/2.0.0-SNAPSHOT/maven-metadata.xml
Downloading: https://repository.apache.org/content/repositories/snapshots/org/apache/jclouds/jclouds-resources/2.0.0-SNAPSHOT/maven-metadata.xml
Downloaded: http://repository.apache.org/snapshots/org/apache/jclouds/jclouds-resources/2.0.0-SNAPSHOT/maven-metadata.xml
(1005 B at 3.6 KB/sec)
Downloaded: https://repository.apache.org/content/repositories/snapshots/org/apache/jclouds/jclouds-resources/2.0.0-SNAPSHOT/maven-metadata.xml
(1005 B at 2.8 KB/sec)
Downloading: https://repository-jclouds.forge.cloudbees.com/snapshot/org/apache/jclouds/jclouds-resources/2.0.0-SNAPSHOT/jclouds-resources-2.0.0-20150204.170645-234.pom
Downloading: https://repository.apache.org/content/repositories/snapshots/org/apache/jclouds/jclouds-resources/2.0.0-SNAPSHOT/jclouds-resources-2.0.0-20150204.170645-234.pom
Downloaded: https://repository.apache.org/content/repositories/snapshots/org/apache/jclouds/jclouds-resources/2.0.0-SNAPSHOT/jclouds-resources-2.0.0-20150204.170645-234.pom
(3 KB at 15.4 KB/sec)
Downloading: https://repository-jclouds.forge.cloudbees.com/release/org/apache/maven/reporting/maven-reporting-impl/2.3/maven-reporting-impl-2.3.pom
Downloading: http://repo.cloudbees.com/content/repositories/central/org/apache/maven/reporting/maven-reporting-impl/2.3/maven-reporting-impl-2.3.pom
Downloaded: http://repo.cloudbees.com/content/repositories/central/org/apache/maven/reporting/maven-reporting-impl/2.3/maven-reporting-impl-2.3.pom
(5 KB at 122.1 KB/sec)
Downloading: https://repository-jclouds.forge.cloudbees.com/release/org/apache/maven/shared/maven-shared-components/20/maven-shared-components-20.pom
Downloading: http://repo.cloudbees.com/content/repositories/central/org/apache/maven/shared/maven-shared-components/20/maven-shared-components-20.pom
Downloaded: http://repo.cloudbees.com/content/repositories/central/org/apache/maven/shared/maven-shared-components/20/maven-shared-components-20.pom
(5 KB at 332.4 KB/sec)
Downloading: https://repository-jclouds.forge.cloudbees.com/release/org/apache/maven/shared/maven-shared-utils/0.6/maven-shared-utils-0.6.pom
Downloading: http://repo.cloudbees.com/content/repositories/central/org/apache/maven/shared/maven-shared-utils/0.6/maven-shared-utils-0.6.pom
Downloaded: http://repo.cloudbees.com/content/repositories/central/org/apache/maven/shared/maven-shared-utils/0.6/maven-shared-utils-0.6.pom
(5 KB at 340.3 KB/sec)
Downloading: https://repository-jclouds.forge.cloudbees.com/release/org/apache/maven/doxia/doxia-integration-tools/1.6/doxia-integration-tools-1.6.pom
Downloading: http://repo.cloudbees.com/content/repositories/central/org/apache/maven/doxia/doxia-integration-tools/1.6/doxia-integration-tools-1.6.pom
Downloaded: http://repo.cloudbees.com/content/repositories/central/org/apache/maven/doxia/doxia-integration-tools/1.6/doxia-integration-tools-1.6.pom
(7 KB at 158.0 KB/sec)
Downloading: https://repository-jclouds.forge.cloudbees.com/release/org/apache/maven/doxia/doxia-tools/3/doxia-tools-3.pom
Downloading: http://repo.cloudbees.com/content/repositories/central/org/apache/maven/doxia/doxia-tools/3/doxia-tools-3.pom
Downloaded: http://repo.cloudbees.com/content/repositories/central/org/apache/maven/doxia/doxia-tools/3/doxia-tools-3.pom
(10 KB at 745.8 KB/sec)
Downloading: https://repository-jclouds.forge.cloudbees.com/release/org/apache/maven/doxia/doxia-logging-api/1.6/doxia-logging-api-1.6.pom
Downloading: http://repo.cloudbees.com/content/repositories/central/org/apache/maven/doxia/doxia-logging-api/1.6/doxia-logging-api-1.6.pom
Downloaded: http://repo.cloudbees.com/content/repositories/central/org/apache/maven/doxia/doxia-logging-api/1.6/doxia-logging-api-1.6.pom
(2 KB at 115.4 KB/sec)
Downloading: https://repository-jclouds.forge.cloudbees.com/release/org/apache/maven/doxia/doxia/1.6/doxia-1.6.pom
Downloading: http://repo.cloudbees.com/content/repositories/central/org/apache/maven/doxia/doxia/1.6/doxia-1.6.pom
Downloaded: http://repo.cloudbees.com/content/repositories/central/org/apache/maven/doxia/doxia/1.6/doxia-1.6.pom
(19 KB at 250.5 KB/sec)
Downloading: https://repository-jclouds.forge.cloudbees.com/release/org/apache/maven/doxia/doxia-decoration-model/1.6/doxia-decoration-model-1.6.pom
Downloading: http://repo.cloudbees.com/content/repositories/central/org/apache/maven/doxia/doxia-decoration-model/1.6/doxia-decoration-model-1.6.pom
Downloaded: http://repo.cloudbees.com/content/repositories/central/org/apache/maven/doxia/doxia-decoration-model/1.6/doxia-decoration-model-1.6.pom
(3 KB at 224.9 KB/sec)
Downloading: https://repository-jclouds.forge.cloudbees.com/release/org/apache/maven/doxia/doxia-sitetools/1.6/doxia-sitetools-1.6.pom
Downloading: http://repo.cloudbees.com/content/repositories/central/org/apache/maven/doxia/doxia-sitetools/1.6/doxia-sitetools-1.6.pom
Downloaded: http://repo.cloudbees.com/content/repositories/central/org/apache/maven/doxia/doxia-sitetools/1.6/doxia-sitetools-1.6.pom
(18 KB at 1247.7 KB/sec)
Downloading: https://repository-jclouds.forge.cloudbees.com/release/org/codehaus/plexus/plexus-utils/3.0.15/plexus-utils-3.0.15.pom
Downloading: http://repo.cloudbees.com/content/repositories/central/org/codehaus/plexus/plexus-utils/3.0.15/plexus-utils-3.0.15.pom
Downloaded: http://repo.cloudbees.com/content/repositories/central/org/codehaus/plexus/plexus-utils/3.0.15/plexus-utils-3.0.15.pom
(4 KB at 204.8 KB/sec)
Downloading: https://repository-jclouds.forge.cloudbees.com/release/org/codehaus/plexus/plexus-interpolation/1.19/plexus-interpolation-1.19.pom
Downloading: http://repo.cloudbees.com/content/repositories/central/org/codehaus/plexus/plexus-interpolation/1.19/plexus-interpolation-1.19.pom
Downloaded: http://repo.cloudbees.com/content/repositories/central/org/codehaus/plexus/plexus-interpolation/1.19/plexus-interpolation-1.19.pom
(2 KB at 71.8 KB/sec)
Downloading: https://repository-jclouds.forge.cloudbees.com/release/com/puppycrawl/tools/checkstyle/5.7/checkstyle-5.7.pom
Downloading: http://repo.cloudbees.com/content/repositories/central/com/puppycrawl/tools/checkstyle/5.7/checkstyle-5.7.pom
Downloaded: http://repo.cloudbees.com/content/repositories/central/com/puppycrawl/tools/checkstyle/5.7/checkstyle-5.7.pom
(24 KB at 1709.5 KB/sec)
Downloading: https://repository-jclouds.forge.cloudbees.com/release/antlr/antlr/2.7.7/antlr-2.7.7.pom
Downloading: http://repo.cloudbees.com/content/repositories/central/antlr/antlr/2.7.7/antlr-2.7.7.pom
Downloaded: http://repo.cloudbees.com/content/repositories/central/antlr/antlr/2.7.7/antlr-2.7.7.pom
(632 B at 28.1 KB/sec)
Downloading: https://repository-jclouds.forge.cloudbees.com/release/commons-beanutils/commons-beanutils-core/1.8.3/commons-beanutils-core-1.8.3.pom
Downloading: http://repo.cloudbees.com/content/repositories/central/commons-beanutils/commons-beanutils-core/1.8.3/commons-beanutils-core-1.8.3.pom
Downloaded: http://repo.cloudbees.com/content/repositories/central/commons-beanutils/commons-beanutils-core/1.8.3/commons-beanutils-core-1.8.3.pom
(2 KB at 114.3 KB/sec)
Downloading: https://repository-jclouds.forge.cloudbees.com/release/com/google/guava/guava-jdk5/14.0.1/guava-jdk5-14.0.1.pom
Downloading: http://repo.cloudbees.com/content/repositories/central/com/google/guava/guava-jdk5/14.0.1/guava-jdk5-14.0.1.pom
Downloaded: http://repo.cloudbees.com/content/repositories/central/com/google/guava/guava-jdk5/14.0.1/guava-jdk5-14.0.1.pom
(7 KB at 481.4 KB/sec)
Downloading: https://repository-jclouds.forge.cloudbees.com/release/com/google/guava/guava-parent-jdk5/14.0.1/guava-parent-jdk5-14.0.1.pom
Downloading: http://repo.cloudbees.com/content/repositories/central/com/google/guava/guava-parent-jdk5/14.0.1/guava-parent-jdk5-14.0.1.pom
Downloaded: http://repo.cloudbees.com/content/repositories/central/com/google/guava/guava-parent-jdk5/14.0.1/guava-parent-jdk5-14.0.1.pom
(3 KB at 226.5 KB/sec)
Downloading: https://repository.apache.org/content/repositories/snapshots/org/apache/jclouds/jclouds-resources/2.0.0-SNAPSHOT/jclouds-resources-2.0.0-20150204.170645-234.jar
Downloaded: https://repository.apache.org/content/repositories/snapshots/org/apache/jclouds/jclouds-resources/2.0.0-SNAPSHOT/jclouds-resources-2.0.0-20150204.170645-234.jar
(10 KB at 50.6 KB/sec)
Downloading: https://repository-jclouds.forge.cloudbees.com/release/org/apache/maven/reporting/maven-reporting-impl/2.3/maven-reporting-impl-2.3.jar
Downloading: https://repository-jclouds.forge.cloudbees.com/release/commons-digester/commons-digester/1.6/commons-digester-1.6.jar
Downloading: https://repository-jclouds.forge.cloudbees.com/release/commons-logging/commons-logging/1.0.4/commons-logging-1.0.4.jar
Downloading: https://repository-jclouds.forge.cloudbees.com/release/org/apache/maven/shared/maven-shared-utils/0.6/maven-shared-utils-0.6.jar
Downloading: https://repository-jclouds.forge.cloudbees.com/release/org/apache/maven/doxia/doxia-integration-tools/1.6/doxia-integration-tools-1.6.jar
Downloading: https://repository-jclouds.forge.cloudbees.com/release/org/codehaus/plexus/plexus-interpolation/1.19/plexus-interpolation-1.19.jar
Downloading: https://repository-jclouds.forge.cloudbees.com/release/com/puppycrawl/tools/checkstyle/5.7/checkstyle-5.7.jar
Downloading: https://repository-jclouds.forge.cloudbees.com/release/org/codehaus/plexus/plexus-utils/3.0.15/plexus-utils-3.0.15.jar
Downloading: https://repository-jclouds.forge.cloudbees.com/release/antlr/antlr/2.7.7/antlr-2.7.7.jar
Downloading: https://repository-jclouds.forge.cloudbees.com/release/commons-beanutils/commons-beanutils-core/1.8.3/commons-beanutils-core-1.8.3.jar
Downloading: https://repository-jclouds.forge.cloudbees.com/release/com/google/guava/guava-jdk5/14.0.1/guava-jdk5-14.0.1.jar
Downloading: http://repo.cloudbees.com/content/repositories/central/org/apache/maven/reporting/maven-reporting-impl/2.3/maven-reporting-impl-2.3.jar
Downloading: http://repo.cloudbees.com/content/repositories/central/org/apache/maven/shared/maven-shared-utils/0.6/maven-shared-utils-0.6.jar
Downloading: http://repo.cloudbees.com/content/repositories/central/commons-digester/commons-digester/1.6/commons-digester-1.6.jar
Downloading: http://repo.cloudbees.com/content/repositories/central/commons-logging/commons-logging/1.0.4/commons-logging-1.0.4.jar
Downloading: http://repo.cloudbees.com/content/repositories/central/org/apache/maven/doxia/doxia-integration-tools/1.6/doxia-integration-tools-1.6.jar
Downloaded: http://repo.cloudbees.com/content/repositories/central/org/apache/maven/reporting/maven-reporting-impl/2.3/maven-reporting-impl-2.3.jar
(18 KB at 877.8 KB/sec)
Downloading: http://repo.cloudbees.com/content/repositories/central/org/codehaus/plexus/plexus-utils/3.0.15/plexus-utils-3.0.15.jar
Downloaded: http://repo.cloudbees.com/content/repositories/central/commons-logging/commons-logging/1.0.4/commons-logging-1.0.4.jar
(38 KB at 1614.1 KB/sec)
Downloading: http://repo.cloudbees.com/content/repositories/central/org/codehaus/plexus/plexus-interpolation/1.19/plexus-interpolation-1.19.jar
Downloading: http://repo.cloudbees.com/content/repositories/central/com/puppycrawl/tools/checkstyle/5.7/checkstyle-5.7.jar
Downloaded: http://repo.cloudbees.com/content/repositories/central/org/apache/maven/doxia/doxia-integration-tools/1.6/doxia-integration-tools-1.6.jar
(44 KB at 1502.9 KB/sec)
Downloading: http://repo.cloudbees.com/content/repositories/central/antlr/antlr/2.7.7/antlr-2.7.7.jar
Downloaded: http://repo.cloudbees.com/content/repositories/central/org/apache/maven/shared/maven-shared-utils/0.6/maven-shared-utils-0.6.jar
(161 KB at 4019.4 KB/sec)
Downloading: http://repo.cloudbees.com/content/repositories/central/commons-beanutils/commons-beanutils-core/1.8.3/commons-beanutils-core-1.8.3.jar
Downloaded: http://repo.cloudbees.com/content/repositories/central/commons-digester/commons-digester/1.6/commons-digester-1.6.jar
(165 KB at 3576.0 KB/sec)
Downloading: http://repo.cloudbees.com/content/repositories/central/com/google/guava/guava-jdk5/14.0.1/guava-jdk5-14.0.1.jar
Downloaded: http://repo.cloudbees.com/content/repositories/central/org/codehaus/plexus/plexus-utils/3.0.15/plexus-utils-3.0.15.jar
(234 KB at 6306.8 KB/sec)
Downloaded: http://repo.cloudbees.com/content/repositories/central/com/puppycrawl/tools/checkstyle/5.7/checkstyle-5.7.jar
(645 KB at 16536.5 KB/sec)
Downloaded: http://repo.cloudbees.com/content/repositories/central/commons-beanutils/commons-beanutils-core/1.8.3/commons-beanutils-core-1.8.3.jar
(202 KB at 6511.8 KB/sec)
Downloaded: http://repo.cloudbees.com/content/repositories/central/antlr/antlr/2.7.7/antlr-2.7.7.jar
(435 KB at 9453.3 KB/sec)
Downloaded: http://repo.cloudbees.com/content/repositories/central/com/google/guava/guava-jdk5/14.0.1/guava-jdk5-14.0.1.jar
(1957 KB at 28769.3 KB/sec)
[WARNING] Failed to getClass for org.apache.maven.plugin.checkstyle.CheckstyleViolationCheckMojo
Started calculate disk usage of build
Finished Calculation of disk usage of build in 0 seconds
Started calculate disk usage of workspace
Finished Calculation of disk usage of workspace in 0 seconds
[INFO] ------------------------------------------------------------------------
[INFO] Reactor Summary:
[INFO] 
[INFO] jclouds openstack-glance api ...................... FAILURE [1:26.339s]
[INFO] Apache jclouds :: OpenStack :: Heat API ........... SKIPPED
[INFO] jclouds openstack-neutron api ..................... SKIPPED
[INFO] Apache jclouds :: OpenStack :: Poppy API .......... SKIPPED
[INFO] jclouds openstack-marconi api ..................... SKIPPED
[INFO] jclouds Rackspace Auto Scale API .................. SKIPPED
[INFO] jclouds Rackspace Auto Scale UK Provider .......... SKIPPED
[INFO] jclouds Rackspace Auto Scale US Provider .......... SKIPPED
[INFO] jclouds Rackspace Cloud Queues US provider ........ SKIPPED
[INFO] jclouds Rackspace Cloud Queues UK provider ........ SKIPPED
[INFO] jclouds rackspace-cloudbigdata api ................ SKIPPED
[INFO] jclouds rackspace-cloudbigdata api provider ....... SKIPPED
[INFO] jclouds rackspace-cloudfiles api .................. SKIPPED
[INFO] jclouds Rackspace Cloud Files UK provider ......... SKIPPED
[INFO] jclouds Rackspace Cloud Files US provider ......... SKIPPED
[INFO] jclouds Rackspace Cloud Networks UK provider ...... SKIPPED
[INFO] jclouds Rackspace Cloud Networks US provider ...... SKIPPED
[INFO] jclouds Rackspace CDN UK provider ................. SKIPPED
[INFO] jclouds Rackspace CDN US provider ................. SKIPPED
[INFO] Apache jclouds labs openstack ..................... SKIPPED
[INFO] ------------------------------------------------------------------------
[INFO] BUILD FAILURE
[INFO] ------------------------------------------------------------------------
[INFO] Total time: 1:32.170s
[INFO] Finished at: Wed Feb 04 12:42:34 EST 2015
[INFO] Final Memory: 38M/111M
[INFO] ------------------------------------------------------------------------
Waiting for Jenkins to finish collecting data[ERROR] Failed to execute goal org.apache.maven.plugins:maven-checkstyle-plugin:2.13:check
(default) on project openstack-glance: Execution default of goal org.apache.maven.plugins:maven-checkstyle-plugin:2.13:check
failed: Plugin org.apache.maven.plugins:maven-checkstyle-plugin:2.13 or one of its dependencies
could not be resolved: Could not transfer artifact org.codehaus.plexus:plexus-interpolation:jar:1.19
from/to central (http://repo.cloudbees.com/content/repositories/central): Failed to transfer
file: http://repo.cloudbees.com/content/repositories/central/org/codehaus/plexus/plexus-interpolation/1.19/plexus-interpolation-1.19.jar.
Return code is: 500 , ReasonPhrase:Internal Server Error. -> [Help 1]
org.apache.maven.lifecycle.LifecycleExecutionException: Failed to execute goal org.apache.maven.plugins:maven-checkstyle-plugin:2.13:check
(default) on project openstack-glance: Execution default of goal org.apache.maven.plugins:maven-checkstyle-plugin:2.13:check
failed: Plugin org.apache.maven.plugins:maven-checkstyle-plugin:2.13 or one of its dependencies
could not be resolved: Could not transfer artifact org.codehaus.plexus:plexus-interpolation:jar:1.19
from/to central (http://repo.cloudbees.com/content/repositories/central): Failed to transfer
file: http://repo.cloudbees.com/content/repositories/central/org/codehaus/plexus/plexus-interpolation/1.19/plexus-interpolation-1.19.jar.
Return code is: 500 , ReasonPhrase:Internal Server Error.
	at org.apache.maven.lifecycle.internal.MojoExecutor.execute(MojoExecutor.java:225)
	at org.apache.maven.lifecycle.internal.MojoExecutor.execute(MojoExecutor.java:153)
	at org.apache.maven.lifecycle.internal.MojoExecutor.execute(MojoExecutor.java:145)
	at org.apache.maven.lifecycle.internal.LifecycleModuleBuilder.buildProject(LifecycleModuleBuilder.java:84)
	at org.apache.maven.lifecycle.internal.LifecycleModuleBuilder.buildProject(LifecycleModuleBuilder.java:59)
	at org.apache.maven.lifecycle.internal.LifecycleStarter.singleThreadedBuild(LifecycleStarter.java:183)
	at org.apache.maven.lifecycle.internal.LifecycleStarter.execute(LifecycleStarter.java:161)
	at org.apache.maven.DefaultMaven.doExecute(DefaultMaven.java:320)
	at org.apache.maven.DefaultMaven.execute(DefaultMaven.java:156)
	at org.jvnet.hudson.maven3.launcher.Maven3Launcher.main(Maven3Launcher.java:117)
	at sun.reflect.NativeMethodAccessorImpl.invoke0(Native Method)
	at sun.reflect.NativeMethodAccessorImpl.invoke(NativeMethodAccessorImpl.java:57)
	at sun.reflect.DelegatingMethodAccessorImpl.invoke(DelegatingMethodAccessorImpl.java:43)
	at java.lang.reflect.Method.invoke(Method.java:606)
	at org.codehaus.plexus.classworlds.launcher.Launcher.launchStandard(Launcher.java:329)
	at org.codehaus.plexus.classworlds.launcher.Launcher.launch(Launcher.java:239)
	at org.jvnet.hudson.maven3.agent.Maven3Main.launch(Maven3Main.java:178)
	at sun.reflect.NativeMethodAccessorImpl.invoke0(Native Method)
	at sun.reflect.NativeMethodAccessorImpl.invoke(NativeMethodAccessorImpl.java:57)
	at sun.reflect.DelegatingMethodAccessorImpl.invoke(DelegatingMethodAccessorImpl.java:43)
	at java.lang.reflect.Method.invoke(Method.java:606)
	at hudson.maven.Maven3Builder.call(Maven3Builder.java:136)
	at hudson.maven.Maven3Builder.call(Maven3Builder.java:71)
	at hudson.remoting.UserRequest.perform(UserRequest.java:121)
	at hudson.remoting.UserRequest.perform(UserRequest.java:49)
	at hudson.remoting.Request$2.run(Request.java:324)
	at hudson.remoting.InterceptingExecutorService$1.call(InterceptingExecutorService.java:68)
	at java.util.concurrent.FutureTask.run(FutureTask.java:262)
	at java.util.concurrent.ThreadPoolExecutor.runWorker(ThreadPoolExecutor.java:1145)
	at java.util.concurrent.ThreadPoolExecutor$Worker.run(ThreadPoolExecutor.java:615)
	at java.lang.Thread.run(Thread.java:745)
Caused by: org.apache.maven.plugin.PluginExecutionException: Execution default of goal org.apache.maven.plugins:maven-checkstyle-plugin:2.13:check
failed: Plugin org.apache.maven.plugins:maven-checkstyle-plugin:2.13 or one of its dependencies
could not be resolved: Could not transfer artifact org.codehaus.plexus:plexus-interpolation:jar:1.19
from/to central (http://repo.cloudbees.com/content/repositories/central): Failed to transfer
file: http://repo.cloudbees.com/content/repositories/central/org/codehaus/plexus/plexus-interpolation/1.19/plexus-interpolation-1.19.jar.
Return code is: 500 , ReasonPhrase:Internal Server Error.
	at org.apache.maven.plugin.DefaultBuildPluginManager.executeMojo(DefaultBuildPluginManager.java:82)
	at org.apache.maven.lifecycle.internal.MojoExecutor.execute(MojoExecutor.java:209)
	... 30 more
Caused by: org.apache.maven.plugin.PluginResolutionException: Plugin org.apache.maven.plugins:maven-checkstyle-plugin:2.13
or one of its dependencies could not be resolved: Could not transfer artifact org.codehaus.plexus:plexus-interpolation:jar:1.19
from/to central (http://repo.cloudbees.com/content/repositories/central): Failed to transfer
file: http://repo.cloudbees.com/content/repositories/central/org/codehaus/plexus/plexus-interpolation/1.19/plexus-interpolation-1.19.jar.
Return code is: 500 , ReasonPhrase:Internal Server Error.
	at org.apache.maven.plugin.internal.DefaultPluginDependenciesResolver.resolve(DefaultPluginDependenciesResolver.java:215)
	at org.apache.maven.plugin.internal.DefaultMavenPluginManager.createPluginRealm(DefaultMavenPluginManager.java:353)
	at org.apache.maven.plugin.internal.DefaultMavenPluginManager.setupPluginRealm(DefaultMavenPluginManager.java:321)
	at org.apache.maven.plugin.DefaultBuildPluginManager.getPluginRealm(DefaultBuildPluginManager.java:175)
	at org.apache.maven.plugin.DefaultBuildPluginManager.executeMojo(DefaultBuildPluginManager.java:78)
	... 31 more
Caused by: org.sonatype.aether.resolution.ArtifactResolutionException: Could not transfer
artifact org.codehaus.plexus:plexus-interpolation:jar:1.19 from/to central (http://repo.cloudbees.com/content/repositories/central):
Failed to transfer file: http://repo.cloudbees.com/content/repositories/central/org/codehaus/plexus/plexus-interpolation/1.19/plexus-interpolation-1.19.jar.
Return code is: 500 , ReasonPhrase:Internal Server Error.
	at org.sonatype.aether.impl.internal.DefaultArtifactResolver.resolve(DefaultArtifactResolver.java:538)
	at org.sonatype.aether.impl.internal.DefaultArtifactResolver.resolveArtifacts(DefaultArtifactResolver.java:216)
	at org.sonatype.aether.impl.internal.DefaultRepositorySystem.resolveDependencies(DefaultRepositorySystem.java:358)
	at org.apache.maven.plugin.internal.DefaultPluginDependenciesResolver.resolve(DefaultPluginDependenciesResolver.java:207)
	... 35 more
Caused by: org.sonatype.aether.transfer.ArtifactTransferException: Could not transfer artifact
org.codehaus.plexus:plexus-interpolation:jar:1.19 from/to central (http://repo.cloudbees.com/content/repositories/central):
Failed to transfer file: http://repo.cloudbees.com/content/repositories/central/org/codehaus/plexus/plexus-interpolation/1.19/plexus-interpolation-1.19.jar.
Return code is: 500 , ReasonPhrase:Internal Server Error.
	at org.sonatype.aether.connector.wagon.WagonRepositoryConnector$4.wrap(WagonRepositoryConnector.java:951)
	at org.sonatype.aether.connector.wagon.WagonRepositoryConnector$4.wrap(WagonRepositoryConnector.java:941)
	at org.sonatype.aether.connector.wagon.WagonRepositoryConnector$GetTask.run(WagonRepositoryConnector.java:669)
	at org.sonatype.aether.util.concurrency.RunnableErrorForwarder$1.run(RunnableErrorForwarder.java:60)
	... 3 more
Caused by: org.apache.maven.wagon.TransferFailedException: Failed to transfer file: http://repo.cloudbees.com/content/repositories/central/org/codehaus/plexus/plexus-interpolation/1.19/plexus-interpolation-1.19.jar.
Return code is: 500 , ReasonPhrase:Internal Server Error.
	at org.apache.maven.wagon.shared.http4.AbstractHttpClientWagon.fillInputData(AbstractHttpClientWagon.java:945)
	at org.apache.maven.wagon.StreamWagon.getInputStream(StreamWagon.java:116)
	at org.apache.maven.wagon.StreamWagon.getIfNewer(StreamWagon.java:88)
	at org.apache.maven.wagon.StreamWagon.get(StreamWagon.java:61)
	at org.sonatype.aether.connector.wagon.WagonRepositoryConnector$GetTask.run(WagonRepositoryConnector.java:601)
	... 4 more
[ERROR] 
[ERROR] Re-run Maven using the -X switch to enable full debug logging.
[ERROR] 
[ERROR] For more information about the errors and possible solutions, please read the following
articles:
[ERROR] [Help 1] http://cwiki.apache.org/confluence/display/MAVEN/PluginResolutionException

[JENKINS] Archiving <https://jclouds.ci.cloudbees.com/job/jclouds-labs-openstack/ws/rackspace-cloudqueues-us/pom.xml>
to org.apache.jclouds.labs/rackspace-cloudqueues-us/2.0.0-SNAPSHOT/rackspace-cloudqueues-us-2.0.0-SNAPSHOT.pom
[JENKINS] Archiving <https://jclouds.ci.cloudbees.com/job/jclouds-labs-openstack/ws/openstack-heat/pom.xml>
to org.apache.jclouds.labs/openstack-heat/2.0.0-SNAPSHOT/openstack-heat-2.0.0-SNAPSHOT.pom
[JENKINS] Archiving <https://jclouds.ci.cloudbees.com/job/jclouds-labs-openstack/ws/rackspace-cdn-uk/pom.xml>
to org.apache.jclouds.labs/rackspace-cdn-uk/2.0.0-SNAPSHOT/rackspace-cdn-uk-2.0.0-SNAPSHOT.pom
[JENKINS] Archiving <https://jclouds.ci.cloudbees.com/job/jclouds-labs-openstack/ws/rackspace-autoscale-uk/pom.xml>
to org.apache.jclouds.labs/rackspace-autoscale-uk/2.0.0-SNAPSHOT/rackspace-autoscale-uk-2.0.0-SNAPSHOT.pom
[JENKINS] Archiving <https://jclouds.ci.cloudbees.com/job/jclouds-labs-openstack/ws/rackspace-cloudbigdata/pom.xml>
to org.apache.jclouds.labs/rackspace-cloudbigdata/2.0.0-SNAPSHOT/rackspace-cloudbigdata-2.0.0-SNAPSHOT.pom
[JENKINS] Archiving <https://jclouds.ci.cloudbees.com/job/jclouds-labs-openstack/ws/rackspace-cloudbigdata-us/pom.xml>
to org.apache.jclouds.labs/rackspace-cloudbigdata-us/2.0.0-SNAPSHOT/rackspace-cloudbigdata-us-2.0.0-SNAPSHOT.pom
[JENKINS] Archiving <https://jclouds.ci.cloudbees.com/job/jclouds-labs-openstack/ws/rackspace-cdn-us/pom.xml>
to org.apache.jclouds.labs/rackspace-cdn-us/2.0.0-SNAPSHOT/rackspace-cdn-us-2.0.0-SNAPSHOT.pom
[JENKINS] Archiving <https://jclouds.ci.cloudbees.com/job/jclouds-labs-openstack/ws/pom.xml>
to org.apache.jclouds.labs/jclouds-labs-openstack/2.0.0-SNAPSHOT/jclouds-labs-openstack-2.0.0-SNAPSHOT.pom
[JENKINS] Archiving <https://jclouds.ci.cloudbees.com/job/jclouds-labs-openstack/ws/rackspace-autoscale-us/pom.xml>
to org.apache.jclouds.labs/rackspace-autoscale-us/2.0.0-SNAPSHOT/rackspace-autoscale-us-2.0.0-SNAPSHOT.pom
[JENKINS] Archiving <https://jclouds.ci.cloudbees.com/job/jclouds-labs-openstack/ws/rackspace-autoscale/pom.xml>
to org.apache.jclouds.labs/rackspace-autoscale/2.0.0-SNAPSHOT/rackspace-autoscale-2.0.0-SNAPSHOT.pom
[JENKINS] Archiving <https://jclouds.ci.cloudbees.com/job/jclouds-labs-openstack/ws/rackspace-cloudnetworks-us/pom.xml>
to org.apache.jclouds.labs/rackspace-cloudnetworks-us/2.0.0-SNAPSHOT/rackspace-cloudnetworks-us-2.0.0-SNAPSHOT.pom
[JENKINS] Archiving <https://jclouds.ci.cloudbees.com/job/jclouds-labs-openstack/ws/openstack-neutron/pom.xml>
to org.apache.jclouds.labs/openstack-neutron/2.0.0-SNAPSHOT/openstack-neutron-2.0.0-SNAPSHOT.pom
[JENKINS] Archiving <https://jclouds.ci.cloudbees.com/job/jclouds-labs-openstack/ws/openstack-glance/pom.xml>
to org.apache.jclouds.labs/openstack-glance/2.0.0-SNAPSHOT/openstack-glance-2.0.0-SNAPSHOT.pom
[JENKINS] Archiving <https://jclouds.ci.cloudbees.com/job/jclouds-labs-openstack/ws/openstack-glance/target/openstack-glance-2.0.0-SNAPSHOT.jar>
to org.apache.jclouds.labs/openstack-glance/2.0.0-SNAPSHOT/openstack-glance-2.0.0-SNAPSHOT.jar
[JENKINS] Archiving <https://jclouds.ci.cloudbees.com/job/jclouds-labs-openstack/ws/openstack-glance/target/openstack-glance-2.0.0-SNAPSHOT-tests.jar>
to org.apache.jclouds.labs/openstack-glance/2.0.0-SNAPSHOT/openstack-glance-2.0.0-SNAPSHOT-tests.jar
[JENKINS] Archiving <https://jclouds.ci.cloudbees.com/job/jclouds-labs-openstack/ws/openstack-glance/target/openstack-glance-2.0.0-SNAPSHOT-javadoc.jar>
to org.apache.jclouds.labs/openstack-glance/2.0.0-SNAPSHOT/openstack-glance-2.0.0-SNAPSHOT-javadoc.jar
[JENKINS] Archiving <https://jclouds.ci.cloudbees.com/job/jclouds-labs-openstack/ws/openstack-glance/target/openstack-glance-2.0.0-SNAPSHOT-sources.jar>
to org.apache.jclouds.labs/openstack-glance/2.0.0-SNAPSHOT/openstack-glance-2.0.0-SNAPSHOT-sources.jar
[JENKINS] Archiving <https://jclouds.ci.cloudbees.com/job/jclouds-labs-openstack/ws/rackspace-cloudfiles-uk/pom.xml>
to org.apache.jclouds.labs/rackspace-cloudfiles-uk/2.0.0-SNAPSHOT/rackspace-cloudfiles-uk-2.0.0-SNAPSHOT.pom
[JENKINS] Archiving <https://jclouds.ci.cloudbees.com/job/jclouds-labs-openstack/ws/rackspace-cloudfiles/pom.xml>
to org.apache.jclouds.labs/rackspace-cloudfiles/2.0.0-SNAPSHOT/rackspace-cloudfiles-2.0.0-SNAPSHOT.pom
[JENKINS] Archiving <https://jclouds.ci.cloudbees.com/job/jclouds-labs-openstack/ws/openstack-marconi/pom.xml>
to org.apache.jclouds.labs/openstack-marconi/2.0.0-SNAPSHOT/openstack-marconi-2.0.0-SNAPSHOT.pom
[JENKINS] Archiving <https://jclouds.ci.cloudbees.com/job/jclouds-labs-openstack/ws/rackspace-cloudqueues-uk/pom.xml>
to org.apache.jclouds.labs/rackspace-cloudqueues-uk/2.0.0-SNAPSHOT/rackspace-cloudqueues-uk-2.0.0-SNAPSHOT.pom
[JENKINS] Archiving <https://jclouds.ci.cloudbees.com/job/jclouds-labs-openstack/ws/rackspace-cloudnetworks-uk/pom.xml>
to org.apache.jclouds.labs/rackspace-cloudnetworks-uk/2.0.0-SNAPSHOT/rackspace-cloudnetworks-uk-2.0.0-SNAPSHOT.pom
[JENKINS] Archiving <https://jclouds.ci.cloudbees.com/job/jclouds-labs-openstack/ws/openstack-poppy/pom.xml>
to org.apache.jclouds.labs/openstack-poppy/2.0.0-SNAPSHOT/openstack-poppy-2.0.0-SNAPSHOT.pom
[JENKINS] Archiving <https://jclouds.ci.cloudbees.com/job/jclouds-labs-openstack/ws/rackspace-cloudfiles-us/pom.xml>
to org.apache.jclouds.labs/rackspace-cloudfiles-us/2.0.0-SNAPSHOT/rackspace-cloudfiles-us-2.0.0-SNAPSHOT.pom
Sending e-mails to: notifications@jclouds.apache.org
channel stopped

Mime
View raw message