jclouds-notifications mailing list archives

Site index · List index
Message view « Date » · « Thread »
Top « Date » · « Thread »
From jenkins-no-re...@cloudbees.com
Subject Build failed in Jenkins: jclouds-guava-17-18 » 18.0,OpenJDK 7 (latest) #109
Date Sat, 07 Feb 2015 04:04:57 GMT
See <https://jclouds.ci.cloudbees.com/job/jclouds-guava-17-18/GUAVA_VERSION=18.0,jdk=OpenJDK%207%20(latest)/109/changes>

Changes:

[Zack Shoylev] Makes testSignPutUrlWithTime much slower but passes live testing

------------------------------------------
[...truncated 3328 lines...]
[pool-76-thread-2] Test testFirstRegion(org.jclouds.location.suppliers.implicit.FirstRegionTest)
succeeded: 4ms
Test suite progress: tests succeeded: 778, failed: 1, skipped: 0.
Starting test testDidntFindZoneThrowsNSEEWithReasonableMessage(org.jclouds.location.suppliers.implicit.OnlyLocationOrFirstZoneTest)
Starting test testFirstZone(org.jclouds.location.suppliers.implicit.OnlyLocationOrFirstZoneTest)
Starting test testNoZoneUsesProvider(org.jclouds.location.suppliers.implicit.OnlyLocationOrFirstZoneTest)
[pool-77-thread-1] Test testDidntFindZoneThrowsNSEEWithReasonableMessage(org.jclouds.location.suppliers.implicit.OnlyLocationOrFirstZoneTest)
succeeded: 3ms
Test suite progress: tests succeeded: 779, failed: 1, skipped: 0.
[pool-77-thread-3] Test testNoZoneUsesProvider(org.jclouds.location.suppliers.implicit.OnlyLocationOrFirstZoneTest)
succeeded: 52ms
Test suite progress: tests succeeded: 780, failed: 1, skipped: 0.
[pool-77-thread-2] Test testFirstZone(org.jclouds.location.suppliers.implicit.OnlyLocationOrFirstZoneTest)
succeeded: 0ms
Test suite progress: tests succeeded: 781, failed: 1, skipped: 0.
Starting test testDidntMatchRegionIdThrowsNSEEWithReasonableMessage(org.jclouds.location.suppliers.implicit.OnlyLocationOrFirstRegionOptionallyMatchingRegionIdTest)
Starting test testFindRegion(org.jclouds.location.suppliers.implicit.OnlyLocationOrFirstRegionOptionallyMatchingRegionIdTest)
[pool-78-thread-2] Test testFindRegion(org.jclouds.location.suppliers.implicit.OnlyLocationOrFirstRegionOptionallyMatchingRegionIdTest)
succeeded: 0ms
Test suite progress: tests succeeded: 782, failed: 1, skipped: 0.
[pool-78-thread-1] Test testDidntMatchRegionIdThrowsNSEEWithReasonableMessage(org.jclouds.location.suppliers.implicit.OnlyLocationOrFirstRegionOptionallyMatchingRegionIdTest)
succeeded: 6ms
Test suite progress: tests succeeded: 783, failed: 1, skipped: 0.
Starting test testFirstRegion(org.jclouds.location.suppliers.implicit.OnlyLocationOrFirstRegionOptionallyMatchingRegionIdTest)
[pool-78-thread-3] Test testFirstRegion(org.jclouds.location.suppliers.implicit.OnlyLocationOrFirstRegionOptionallyMatchingRegionIdTest)
succeeded: 1ms
Test suite progress: tests succeeded: 784, failed: 1, skipped: 0.
Starting test testNoRegionUsesProvider(org.jclouds.location.suppliers.implicit.OnlyLocationOrFirstRegionOptionallyMatchingRegionIdTest)
[pool-78-thread-4] Test testNoRegionUsesProvider(org.jclouds.location.suppliers.implicit.OnlyLocationOrFirstRegionOptionallyMatchingRegionIdTest)
succeeded: 1ms
Test suite progress: tests succeeded: 785, failed: 1, skipped: 0.
Starting test testDidntFindNetworkThrowsNSEEWithReasonableMessage(org.jclouds.location.suppliers.implicit.FirstNetworkTest)
Starting test testFirstNetwork(org.jclouds.location.suppliers.implicit.FirstNetworkTest)
[pool-79-thread-2] Test testFirstNetwork(org.jclouds.location.suppliers.implicit.FirstNetworkTest)
succeeded: 1ms
Test suite progress: tests succeeded: 786, failed: 1, skipped: 0.
[pool-79-thread-1] Test testDidntFindNetworkThrowsNSEEWithReasonableMessage(org.jclouds.location.suppliers.implicit.FirstNetworkTest)
succeeded: 3ms
Test suite progress: tests succeeded: 787, failed: 1, skipped: 0.
Starting test testCorrect(org.jclouds.location.functions.RegionToEndpointTest)
[pool-80-thread-1] Test testCorrect(org.jclouds.location.functions.RegionToEndpointTest) succeeded:
2ms
Test suite progress: tests succeeded: 788, failed: 1, skipped: 0.
Starting test testMustHaveEndpoints(org.jclouds.location.functions.RegionToEndpointTest)
[pool-80-thread-2] Test testMustHaveEndpoints(org.jclouds.location.functions.RegionToEndpointTest)
succeeded: 1ms
Test suite progress: tests succeeded: 789, failed: 1, skipped: 0.
Starting test testCorrect(org.jclouds.location.functions.ZoneToEndpointTest)
Starting test testMustBeString(org.jclouds.location.functions.ZoneToEndpointTest)
Starting test testMustHaveEndpoints(org.jclouds.location.functions.ZoneToEndpointTest)
[pool-81-thread-3] Test testMustHaveEndpoints(org.jclouds.location.functions.ZoneToEndpointTest)
succeeded: 1ms
Test suite progress: tests succeeded: 790, failed: 1, skipped: 0.
[pool-81-thread-2] Test testMustBeString(org.jclouds.location.functions.ZoneToEndpointTest)
succeeded: 2ms
Test suite progress: tests succeeded: 791, failed: 1, skipped: 0.
Starting test testNullIsIllegal(org.jclouds.location.functions.ZoneToEndpointTest)
[pool-81-thread-4] Test testNullIsIllegal(org.jclouds.location.functions.ZoneToEndpointTest)
succeeded: 0ms
Test suite progress: tests succeeded: 792, failed: 1, skipped: 0.
[pool-81-thread-1] Test testCorrect(org.jclouds.location.functions.ZoneToEndpointTest) succeeded:
121ms
Test suite progress: tests succeeded: 793, failed: 1, skipped: 0.
Starting test testMustBeInRegionMapIfSpecified(org.jclouds.location.functions.RegionToEndpointOrProviderIfNullTest)
Starting test testMustBeString(org.jclouds.location.functions.RegionToEndpointOrProviderIfNullTest)
[pool-82-thread-1] Test testMustBeInRegionMapIfSpecified(org.jclouds.location.functions.RegionToEndpointOrProviderIfNullTest)
succeeded: 2ms
Test suite progress: tests succeeded: 794, failed: 1, skipped: 0.
[pool-82-thread-2] Test testMustBeString(org.jclouds.location.functions.RegionToEndpointOrProviderIfNullTest)
succeeded: 2ms
Test suite progress: tests succeeded: 795, failed: 1, skipped: 0.
Starting test testNullReturnsProvider(org.jclouds.location.functions.RegionToEndpointOrProviderIfNullTest)
[pool-82-thread-3] Test testNullReturnsProvider(org.jclouds.location.functions.RegionToEndpointOrProviderIfNullTest)
succeeded: 0ms
Test suite progress: tests succeeded: 796, failed: 1, skipped: 0.
Starting test testOkIfNoRegionMappings(org.jclouds.location.functions.RegionToEndpointOrProviderIfNullTest)
[pool-82-thread-4] Test testOkIfNoRegionMappings(org.jclouds.location.functions.RegionToEndpointOrProviderIfNullTest)
succeeded: 0ms
Test suite progress: tests succeeded: 797, failed: 1, skipped: 0.
Starting test testWhenRegionNameIsSameAsProviderName(org.jclouds.location.functions.RegionToEndpointOrProviderIfNullTest)
[pool-82-thread-4] Test testWhenRegionNameIsSameAsProviderName(org.jclouds.location.functions.RegionToEndpointOrProviderIfNullTest)
succeeded: 2ms
Test suite progress: tests succeeded: 798, failed: 1, skipped: 0.
Starting test testWhenFindsRegion(org.jclouds.location.functions.RegionToEndpointOrProviderIfNullTest)
[pool-82-thread-5] Test testWhenFindsRegion(org.jclouds.location.functions.RegionToEndpointOrProviderIfNullTest)
succeeded: 1ms
Test suite progress: tests succeeded: 799, failed: 1, skipped: 0.
Starting test testEmptyWhenNoLocationsBound(org.jclouds.location.config.ProvideIso3166CodesByLocationIdViaPropertiesTest)
Starting test testEmptyWhenRegionsAndZonesBoundButNoIsoCodes(org.jclouds.location.config.ProvideIso3166CodesByLocationIdViaPropertiesTest)
Starting test testIsoCodesWhenRegionsAndZonesBoundWithIsoCodes(org.jclouds.location.config.ProvideIso3166CodesByLocationIdViaPropertiesTest)
[pool-83-thread-2] Test testEmptyWhenRegionsAndZonesBoundButNoIsoCodes(org.jclouds.location.config.ProvideIso3166CodesByLocationIdViaPropertiesTest)
succeeded: 6ms
Test suite progress: tests succeeded: 800, failed: 1, skipped: 0.
[pool-83-thread-1] Test testEmptyWhenNoLocationsBound(org.jclouds.location.config.ProvideIso3166CodesByLocationIdViaPropertiesTest)
succeeded: 12ms
Test suite progress: tests succeeded: 801, failed: 1, skipped: 0.
[pool-83-thread-3] Test testIsoCodesWhenRegionsAndZonesBoundWithIsoCodes(org.jclouds.location.config.ProvideIso3166CodesByLocationIdViaPropertiesTest)
succeeded: 9ms
Test suite progress: tests succeeded: 802, failed: 1, skipped: 0.
Starting test howTo(org.jclouds.functions.CacheLearningTest)
[pool-84-thread-1] Test howTo(org.jclouds.functions.CacheLearningTest) succeeded: 3ms
Test suite progress: tests succeeded: 803, failed: 1, skipped: 0.
Starting test testExpand(org.jclouds.config.BindPropertiesToExpandedValuesTest)
[pool-85-thread-1] Test testExpand(org.jclouds.config.BindPropertiesToExpandedValuesTest)
succeeded: 84ms
Test suite progress: tests succeeded: 804, failed: 1, skipped: 0.
Starting test testRandomByteSource(org.jclouds.utils.TestUtilsTest)
[pool-86-thread-1] Test testRandomByteSource(org.jclouds.utils.TestUtilsTest) succeeded: 389ms
Test suite progress: tests succeeded: 805, failed: 1, skipped: 0.
Tests run: 806, Failures: 1, Errors: 0, Skipped: 0, Time elapsed: 75.272 sec <<<
FAILURE! - in TestSuite
testCacheIsFasterWhenNoAnnotationPresent(org.jclouds.rest.functions.PresentWhenApiVersionLexicographicallyAtOrAfterSinceApiVersionTest)
 Time elapsed: 0.001 sec  <<< FAILURE!
java.lang.AssertionError: cached [184] should be less than initial [98] expected [true] but
found [false]
	at org.testng.Assert.fail(Assert.java:94)
	at org.testng.Assert.failNotEquals(Assert.java:494)
	at org.testng.Assert.assertTrue(Assert.java:42)
	at org.jclouds.rest.functions.PresentWhenApiVersionLexicographicallyAtOrAfterSinceApiVersionTest.testCacheIsFasterWhenNoAnnotationPresent(PresentWhenApiVersionLexicographicallyAtOrAfterSinceApiVersionTest.java:130)


Results :

Failed tests: 
  PresentWhenApiVersionLexicographicallyAtOrAfterSinceApiVersionTest.testCacheIsFasterWhenNoAnnotationPresent:130
cached [184] should be less than initial [98] expected [true] but found [false]

Tests run: 806, Failures: 1, Errors: 0, Skipped: 0

[INFO] ------------------------------------------------------------------------
[INFO] Reactor Summary:
[INFO] 
[INFO] Apache jclouds Project ............................ SUCCESS [1:35.534s]
[INFO] jclouds shared Maven resources .................... SUCCESS [36.654s]
[INFO] jclouds Components Core ........................... FAILURE [2:25.815s]
[INFO] jclouds OpenStack Components Core ................. SKIPPED
[INFO] jclouds commons project ........................... SKIPPED
[INFO] jclouds script builder ............................ SKIPPED
[INFO] jclouds compute core .............................. SKIPPED
[INFO] jclouds Log4J Logging Module ...................... SKIPPED
[INFO] jclouds loadbalancer core ......................... SKIPPED
[INFO] jclouds sts api ................................... SKIPPED
[INFO] jclouds cloudwatch api ............................ SKIPPED
[INFO] jclouds SLF4J Logging Module ...................... SKIPPED
[INFO] jclouds bouncycastle EncryptionService Module ..... SKIPPED
[INFO] jclouds sshj ssh client ........................... SKIPPED
[INFO] jclouds cloudstack core ........................... SKIPPED
[INFO] jclouds blobstore core ............................ SKIPPED
[INFO] jclouds filesystem core ........................... SKIPPED
[INFO] jclouds bring your own node provider .............. SKIPPED
[INFO] jclouds OkHttp Driver ............................. SKIPPED
[INFO] jclouds s3 api .................................... SKIPPED
[INFO] jclouds ec2 api ................................... SKIPPED
[INFO] jclouds sqs api ................................... SKIPPED
[INFO] jclouds elasticstack core ......................... SKIPPED
[INFO] jclouds atmos components .......................... SKIPPED
[INFO] jclouds openstack-keystone api .................... SKIPPED
[INFO] jclouds swift api ................................. SKIPPED
[INFO] jclouds openstack-cinder api ...................... SKIPPED
[INFO] Apache jclouds :: OpenStack :: Nova API ........... SKIPPED
[INFO] jclouds openstack-nova-ec2 api .................... SKIPPED
[INFO] jclouds openstack-swift api ....................... SKIPPED
[INFO] jclouds openstack-trove api ....................... SKIPPED
[INFO] jclouds cloudfiles api ............................ SKIPPED
[INFO] jclouds rackspace cloudidentity api ............... SKIPPED
[INFO] jclouds Rackspace Cloud Load Balancers API ........ SKIPPED
[INFO] jclouds Rackspace Next Generation Cloud Servers US provider  SKIPPED
[INFO] jclouds rackspace clouddns api .................... SKIPPED
[INFO] jclouds route53 api ............................... SKIPPED
[INFO] jclouds Chef api .................................. SKIPPED
[INFO] jclouds apis project .............................. SKIPPED
[INFO] jclouds GoGrid provider ........................... SKIPPED
[INFO] jclouds Azure Storage provider .................... SKIPPED
[INFO] jclouds Apache Http Components Client ............. SKIPPED
[INFO] jclouds joda DateService Module ................... SKIPPED
[INFO] jclouds netty payload module ...................... SKIPPED
[INFO] jclouds enterprise Module ......................... SKIPPED
[INFO] jclouds Amazon Simple Storage Service (S3) provider  SKIPPED
[INFO] jclouds Amazon Elastic Load Balancer provider ..... SKIPPED
[INFO] jclouds Amazon EC2 provider ....................... SKIPPED
[INFO] jclouds Amazon Simple Queue Service provider ...... SKIPPED
[INFO] jclouds ElasticHosts Peer1 London provider ........ SKIPPED
[INFO] jclouds ElasticHosts Peer1 San Antonio provider ... SKIPPED
[INFO] jclouds ElasticHosts BlueSquare London provider ... SKIPPED
[INFO] jclouds ElasticHosts Peer1 Toronto provider ....... SKIPPED
[INFO] jclouds ElasticHosts Peer1 Los Angeles provider ... SKIPPED
[INFO] jclouds ElasticHosts Amsterdam provider ........... SKIPPED
[INFO] jclouds ElasticHosts San Jose provider ............ SKIPPED
[INFO] jclouds ElasticHosts Hong Kong provider ........... SKIPPED
[INFO] jclouds ElasticHosts Sydney provider .............. SKIPPED
[INFO] jclouds Open Hosting East1 provider ............... SKIPPED
[INFO] jclouds Serverlove Manchester provider ............ SKIPPED
[INFO] jclouds SkaliCloud Malaysia provider .............. SKIPPED
[INFO] jclouds Go2Cloud Johannesburg1 provider ........... SKIPPED
[INFO] jclouds SoftLayer core ............................ SKIPPED
[INFO] jclouds HP Cloud Compute provider ................. SKIPPED
[INFO] jclouds HP Cloud Block Storage Provider ........... SKIPPED
[INFO] jclouds HP Cloud Object Storage ................... SKIPPED
[INFO] jclouds CloudFiles US provider .................... SKIPPED
[INFO] jclouds CloudFiles UK provider .................... SKIPPED
[INFO] jclouds Rackspace Next Generation Cloud DNS US provider  SKIPPED
[INFO] jclouds Rackspace Next Generation Cloud DNS UK provider  SKIPPED
[INFO] jclouds Rackspace Cloud Databases US provider ..... SKIPPED
[INFO] jclouds Rackspace Cloud Databases UK provider ..... SKIPPED
[INFO] jclouds Rackspace Cloud Load Balancers US provider  SKIPPED
[INFO] jclouds Rackspace Cloud Load Balancers UK provider  SKIPPED
[INFO] jclouds Rackspace Next Generation Cloud Servers provider  SKIPPED
[INFO] jclouds Rackspace Next Generation Cloud Block Storage US provider  SKIPPED
[INFO] jclouds Rackspace Next Generation Cloud Block Storage UK provider  SKIPPED
[INFO] jclouds GleSYS core ............................... SKIPPED
[INFO] jclouds Amazon Identity and Access Management (STS) provider  SKIPPED
[INFO] jclouds Amazon Route 53 provider .................. SKIPPED
[INFO] jclouds ultradns-ws provider ...................... SKIPPED
[INFO] jclouds dynect api ................................ SKIPPED
[INFO] jclouds Enterprise Chef provider .................. SKIPPED
[INFO] jclouds providers project ......................... SKIPPED
[INFO] jclouds jsch ssh client ........................... SKIPPED
[INFO] jclouds example components for a standalone compute provider  SKIPPED
[INFO] jclouds skeletons project ......................... SKIPPED
[INFO] jclouds Google App Engine Components .............. SKIPPED
[INFO] jclouds drivers project ........................... SKIPPED
[INFO] allcompute ........................................ SKIPPED
[INFO] allblobstore ...................................... SKIPPED
[INFO] allloadbalancer ................................... SKIPPED
[INFO] all ............................................... SKIPPED
[INFO] Apache jclouds .................................... SKIPPED
[INFO] ------------------------------------------------------------------------
[INFO] BUILD FAILURE
[INFO] ------------------------------------------------------------------------
[INFO] Total time: 4:53.297s
[INFO] Finished at: Fri Feb 06 23:04:55 EST 2015
[INFO] Final Memory: 53M/248M
[INFO] ------------------------------------------------------------------------
[ERROR] Failed to execute goal org.apache.maven.plugins:maven-surefire-plugin:2.17:test (default-test)
on project jclouds-core: There are test failures.
[ERROR] 
[ERROR] Please refer to <https://jclouds.ci.cloudbees.com/job/jclouds-guava-17-18/GUAVA_VERSION=18.0,jdk=OpenJDK%207%20(latest)/ws/core/target/surefire-reports>
for the individual test results.
[ERROR] -> [Help 1]
org.apache.maven.lifecycle.LifecycleExecutionException: Failed to execute goal org.apache.maven.plugins:maven-surefire-plugin:2.17:test
(default-test) on project jclouds-core: There are test failures.

Please refer to <https://jclouds.ci.cloudbees.com/job/jclouds-guava-17-18/GUAVA_VERSION=18.0,jdk=OpenJDK%207%20(latest)/ws/core/target/surefire-reports>
for the individual test results.
	at org.apache.maven.lifecycle.internal.MojoExecutor.execute(MojoExecutor.java:213)
	at org.apache.maven.lifecycle.internal.MojoExecutor.execute(MojoExecutor.java:153)
	at org.apache.maven.lifecycle.internal.MojoExecutor.execute(MojoExecutor.java:145)
	at org.apache.maven.lifecycle.internal.LifecycleModuleBuilder.buildProject(LifecycleModuleBuilder.java:84)
	at org.apache.maven.lifecycle.internal.LifecycleModuleBuilder.buildProject(LifecycleModuleBuilder.java:59)
	at org.apache.maven.lifecycle.internal.LifecycleStarter.singleThreadedBuild(LifecycleStarter.java:183)
	at org.apache.maven.lifecycle.internal.LifecycleStarter.execute(LifecycleStarter.java:161)
	at org.apache.maven.DefaultMaven.doExecute(DefaultMaven.java:320)
	at org.apache.maven.DefaultMaven.execute(DefaultMaven.java:156)
	at org.apache.maven.cli.MavenCli.execute(MavenCli.java:537)
	at org.apache.maven.cli.MavenCli.doMain(MavenCli.java:196)
	at org.apache.maven.cli.MavenCli.main(MavenCli.java:141)
	at sun.reflect.NativeMethodAccessorImpl.invoke0(Native Method)
	at sun.reflect.NativeMethodAccessorImpl.invoke(NativeMethodAccessorImpl.java:57)
	at sun.reflect.DelegatingMethodAccessorImpl.invoke(DelegatingMethodAccessorImpl.java:43)
	at java.lang.reflect.Method.invoke(Method.java:606)
	at org.codehaus.plexus.classworlds.launcher.Launcher.launchEnhanced(Launcher.java:290)
	at org.codehaus.plexus.classworlds.launcher.Launcher.launch(Launcher.java:230)
	at org.codehaus.plexus.classworlds.launcher.Launcher.mainWithExitCode(Launcher.java:409)
	at org.codehaus.plexus.classworlds.launcher.Launcher.main(Launcher.java:352)
Caused by: org.apache.maven.plugin.MojoFailureException: There are test failures.

Please refer to <https://jclouds.ci.cloudbees.com/job/jclouds-guava-17-18/GUAVA_VERSION=18.0,jdk=OpenJDK%207%20(latest)/ws/core/target/surefire-reports>
for the individual test results.
	at org.apache.maven.plugin.surefire.SurefireHelper.reportExecution(SurefireHelper.java:82)
	at org.apache.maven.plugin.surefire.SurefirePlugin.handleSummary(SurefirePlugin.java:195)
	at org.apache.maven.plugin.surefire.AbstractSurefireMojo.executeAfterPreconditionsChecked(AbstractSurefireMojo.java:861)
	at org.apache.maven.plugin.surefire.AbstractSurefireMojo.execute(AbstractSurefireMojo.java:729)
	at org.apache.maven.plugin.DefaultBuildPluginManager.executeMojo(DefaultBuildPluginManager.java:101)
	at org.apache.maven.lifecycle.internal.MojoExecutor.execute(MojoExecutor.java:209)
	... 19 more
[ERROR] 
[ERROR] Re-run Maven using the -X switch to enable full debug logging.
[ERROR] 
[ERROR] For more information about the errors and possible solutions, please read the following
articles:
[ERROR] [Help 1] http://cwiki.apache.org/confluence/display/MAVEN/MojoFailureException
[ERROR] 
[ERROR] After correcting the problems, you can resume the build with the command
[ERROR]   mvn <goals> -rf :jclouds-core
Build step 'Invoke top-level Maven targets' marked build as failure

Mime
View raw message