jclouds-notifications mailing list archives

Site index · List index
Message view « Date » · « Thread »
Top « Date » · « Thread »
From jenkins-no-re...@cloudbees.com
Subject Build failed in Jenkins: jclouds-guava-17-18 » 18.0,OpenJDK 7 (latest) #164
Date Thu, 02 Apr 2015 09:34:46 GMT
See <https://jclouds.ci.cloudbees.com/job/jclouds-guava-17-18/GUAVA_VERSION=18.0,jdk=OpenJDK%207%20(latest)/164/>

------------------------------------------
[...truncated 37160 lines...]
Tests run: 9, Failures: 0, Errors: 0, Skipped: 0

[INFO] 
[INFO] --- animal-sniffer-maven-plugin:1.11:check (default) @ openstack-nova-ec2 ---
[INFO] Checking unresolved references to org.codehaus.mojo.signature:java16:1.1
[INFO] 
[INFO] --- maven-bundle-plugin:2.3.7:bundle (default-bundle) @ openstack-nova-ec2 ---
[INFO] 
[INFO] --- maven-site-plugin:3.3:attach-descriptor (attach-descriptor) @ openstack-nova-ec2
---
[INFO] 
[INFO] --- apache-rat-plugin:0.10:check (default) @ openstack-nova-ec2 ---
[INFO] 51 implicit excludes (use -debug for more details).
[INFO] Exclude: **/src/test/resources/**/*.sh
[INFO] Exclude: **/src/test/resources/**/*.bat
[INFO] Exclude: **/src/test/resources/**/*.cmd
[INFO] Exclude: **/src/test/resources/**/*.txt
[INFO] Exclude: **/src/test/resources/**/*.gz
[INFO] Exclude: **/src/test/resources/**/*.xml
[INFO] Exclude: **/src/test/resources/**/*.crt
[INFO] Exclude: **/services/*LoggingModule
[INFO] Exclude: **/services/*ApiMetadata
[INFO] Exclude: **/services/*ProviderMetadata
[INFO] Exclude: **/LICENSE.txt
[INFO] Exclude: **/header.txt
[INFO] Exclude: **/NOTICE.txt
[INFO] Exclude: **/DISCLAIMER
[INFO] Exclude: **/BUILD.txt
[INFO] Exclude: **/CHANGES.txt
[INFO] Exclude: **/README.md
[INFO] Exclude: **/README.txt
[INFO] Exclude: **/DEPENDENCIES
[INFO] Exclude: **/CONTRIBUTING.md
[INFO] Exclude: **/*json
[INFO] Exclude: **/*readme
[INFO] Exclude: **/test
[INFO] Exclude: **/test.pub
[INFO] Exclude: **/target/**
[INFO] Exclude: **/test-output/**
[INFO] Exclude: **/bin/**
[INFO] Exclude: **/.settings/**
[INFO] Exclude: **/.classpath
[INFO] Exclude: **/.dir-locals.el
[INFO] Exclude: **/.project
[INFO] Exclude: **/.idea/**
[INFO] Exclude: **/*.iml
[INFO] Exclude: **/*.eml
[INFO] Exclude: **/*.ipr
[INFO] Exclude: **/*.iws
[INFO] Exclude: **/*.DS_STORE
[INFO] Exclude: **/TAGS
[INFO] Exclude: **/.metadata/**
[INFO] Exclude: **/atlassian-ide-plugin.xml
[INFO] Exclude: **/.DS_Store
[INFO] Exclude: .mailmap
[INFO] Exclude: .git/**
[INFO] Exclude: **/.gitignore
[INFO] Exclude: **/.gitattributes
[INFO] Exclude: **/.java-version
[INFO] Exclude: **/modernizer_exclusions.txt
[INFO] Exclude: .repository/**
[INFO] Exclude: gc.log
[INFO] 29 resources included (use -debug for more details)
Warning:  org.apache.xerces.jaxp.SAXParserImpl$JAXPSAXParser: Property 'http://www.oracle.com/xml/jaxp/properties/entityExpansionLimit'
is not recognized.
Compiler warnings:
  WARNING:  'org.apache.xerces.jaxp.SAXParserImpl: Property 'http://javax.xml.XMLConstants/property/accessExternalDTD'
is not recognized.'
Warning:  org.apache.xerces.parsers.SAXParser: Feature 'http://javax.xml.XMLConstants/feature/secure-processing'
is not recognized.
Warning:  org.apache.xerces.parsers.SAXParser: Property 'http://javax.xml.XMLConstants/property/accessExternalDTD'
is not recognized.
Warning:  org.apache.xerces.parsers.SAXParser: Property 'http://www.oracle.com/xml/jaxp/properties/entityExpansionLimit'
is not recognized.
[INFO] Rat check: Summary of files. Unapproved: 0 unknown: 0 generated: 0 approved: 29 licence.
[INFO] 
[INFO] --- maven-jar-plugin:2.4:test-jar (default) @ openstack-nova-ec2 ---
[INFO] Building jar: <https://jclouds.ci.cloudbees.com/job/jclouds-guava-17-18/GUAVA_VERSION=18.0,jdk=OpenJDK%207%20(latest)/ws/apis/openstack-nova-ec2/target/openstack-nova-ec2-2.0.0-SNAPSHOT-tests.jar>
[INFO] 
[INFO] --- maven-surefire-plugin:2.17:test (integration) @ openstack-nova-ec2 ---
[INFO] 
[INFO] --- duplicate-finder-maven-plugin:1.1.1:check (default) @ openstack-nova-ec2 ---
[WARNING] <ignoreResources> has been deprecated and replaced with <ignoreResourcePatterns>.
It will go away in version 1.2.0. Please update your POM accordingly!
[INFO] Checking compile classpath
[INFO] Checking runtime classpath
[INFO] Checking test classpath
[INFO] 
[INFO] --- maven-checkstyle-plugin:2.15:check (default) @ openstack-nova-ec2 ---
[INFO] 
[INFO] --- modernizer-maven-plugin:1.3.0:modernizer (modernizer) @ openstack-nova-ec2 ---
[INFO]                                                                         
[INFO] ------------------------------------------------------------------------
[INFO] Building jclouds openstack-swift api 2.0.0-SNAPSHOT
[INFO] ------------------------------------------------------------------------
Downloading: http://repo.cloudbees.com/content/repositories/central/org/jboss/shrinkwrap/shrinkwrap-depchain/1.2.0/shrinkwrap-depchain-1.2.0.pom
           
Downloading: https://repository-jclouds.forge.cloudbees.com/release/org/jboss/shrinkwrap/shrinkwrap-depchain/1.2.0/shrinkwrap-depchain-1.2.0.pom
           
[WARNING] The POM for org.jboss.shrinkwrap:shrinkwrap-depchain:pom:1.2.0 is missing, no dependency
information available
[INFO] ------------------------------------------------------------------------
[INFO] Reactor Summary:
[INFO] 
[INFO] Apache jclouds Project ............................ SUCCESS [34.253s]
[INFO] jclouds shared Maven resources .................... SUCCESS [4.134s]
[INFO] jclouds Components Core ........................... SUCCESS [1:45.459s]
[INFO] jclouds OpenStack Components Core ................. SUCCESS [19.796s]
[INFO] jclouds commons project ........................... SUCCESS [0.641s]
[INFO] jclouds script builder ............................ SUCCESS [6.188s]
[INFO] jclouds compute core .............................. SUCCESS [44.427s]
[INFO] jclouds Log4J Logging Module ...................... SUCCESS [7.620s]
[INFO] jclouds loadbalancer core ......................... SUCCESS [2.007s]
[INFO] jclouds sts api ................................... SUCCESS [5.408s]
[INFO] jclouds cloudwatch api ............................ SUCCESS [7.133s]
[INFO] jclouds SLF4J Logging Module ...................... SUCCESS [8.522s]
[INFO] jclouds bouncycastle EncryptionService Module ..... SUCCESS [10.091s]
[INFO] jclouds sshj ssh client ........................... SUCCESS [21.074s]
[INFO] jclouds cloudstack core ........................... SUCCESS [53.402s]
[INFO] jclouds blobstore core ............................ SUCCESS [35.257s]
[INFO] jclouds filesystem core ........................... SUCCESS [31.722s]
[INFO] jclouds bring your own node provider .............. SUCCESS [9.007s]
[INFO] jclouds OkHttp Driver ............................. SUCCESS [10.466s]
[INFO] jclouds s3 api .................................... SUCCESS [15.825s]
[INFO] jclouds ec2 api ................................... SUCCESS [23.953s]
[INFO] jclouds sqs api ................................... SUCCESS [7.384s]
[INFO] jclouds elasticstack core ......................... SUCCESS [6.859s]
[INFO] jclouds atmos components .......................... SUCCESS [5.495s]
[INFO] jclouds openstack-keystone api .................... SUCCESS [58.291s]
[INFO] jclouds swift api ................................. SUCCESS [10.286s]
[INFO] jclouds openstack-cinder api ...................... SUCCESS [21.909s]
[INFO] Apache jclouds :: OpenStack :: Nova API ........... SUCCESS [2:02.089s]
[INFO] jclouds openstack-nova-ec2 api .................... SUCCESS [5.814s]
[INFO] jclouds openstack-swift api ....................... FAILURE [0.509s]
[INFO] jclouds openstack-trove api ....................... SKIPPED
[INFO] jclouds cloudfiles api ............................ SKIPPED
[INFO] jclouds rackspace cloudidentity api ............... SKIPPED
[INFO] jclouds Rackspace Cloud Load Balancers API ........ SKIPPED
[INFO] jclouds Rackspace Next Generation Cloud Block Storage US provider  SKIPPED
[INFO] jclouds Rackspace Next Generation Cloud Servers US provider  SKIPPED
[INFO] jclouds rackspace clouddns api .................... SKIPPED
[INFO] jclouds route53 api ............................... SKIPPED
[INFO] jclouds Chef api .................................. SKIPPED
[INFO] jclouds apis project .............................. SKIPPED
[INFO] jclouds GoGrid provider ........................... SKIPPED
[INFO] jclouds Azure Storage provider .................... SKIPPED
[INFO] jclouds Apache Http Components Client ............. SKIPPED
[INFO] jclouds joda DateService Module ................... SKIPPED
[INFO] jclouds netty payload module ...................... SKIPPED
[INFO] jclouds enterprise Module ......................... SKIPPED
[INFO] jclouds Amazon Simple Storage Service (S3) provider  SKIPPED
[INFO] jclouds Amazon Elastic Load Balancer provider ..... SKIPPED
[INFO] jclouds Amazon EC2 provider ....................... SKIPPED
[INFO] jclouds Amazon Simple Queue Service provider ...... SKIPPED
[INFO] jclouds ElasticHosts Peer1 London provider ........ SKIPPED
[INFO] jclouds ElasticHosts Peer1 San Antonio provider ... SKIPPED
[INFO] jclouds ElasticHosts BlueSquare London provider ... SKIPPED
[INFO] jclouds ElasticHosts Peer1 Toronto provider ....... SKIPPED
[INFO] jclouds ElasticHosts Peer1 Los Angeles provider ... SKIPPED
[INFO] jclouds ElasticHosts Amsterdam provider ........... SKIPPED
[INFO] jclouds ElasticHosts San Jose provider ............ SKIPPED
[INFO] jclouds ElasticHosts Hong Kong provider ........... SKIPPED
[INFO] jclouds ElasticHosts Sydney provider .............. SKIPPED
[INFO] jclouds Open Hosting East1 provider ............... SKIPPED
[INFO] jclouds Serverlove Manchester provider ............ SKIPPED
[INFO] jclouds SkaliCloud Malaysia provider .............. SKIPPED
[INFO] jclouds Go2Cloud Johannesburg1 provider ........... SKIPPED
[INFO] jclouds SoftLayer core ............................ SKIPPED
[INFO] jclouds HP Cloud Compute provider ................. SKIPPED
[INFO] jclouds HP Cloud Block Storage Provider ........... SKIPPED
[INFO] jclouds HP Cloud Object Storage ................... SKIPPED
[INFO] jclouds CloudFiles US provider .................... SKIPPED
[INFO] jclouds CloudFiles UK provider .................... SKIPPED
[INFO] jclouds Rackspace Next Generation Cloud DNS US provider  SKIPPED
[INFO] jclouds Rackspace Next Generation Cloud DNS UK provider  SKIPPED
[INFO] jclouds Rackspace Cloud Databases US provider ..... SKIPPED
[INFO] jclouds Rackspace Cloud Databases UK provider ..... SKIPPED
[INFO] jclouds Rackspace Cloud Load Balancers US provider  SKIPPED
[INFO] jclouds Rackspace Cloud Load Balancers UK provider  SKIPPED
[INFO] jclouds Rackspace Next Generation Cloud Block Storage UK provider  SKIPPED
[INFO] jclouds Rackspace Next Generation Cloud Servers provider  SKIPPED
[INFO] jclouds GleSYS core ............................... SKIPPED
[INFO] jclouds Amazon Identity and Access Management (STS) provider  SKIPPED
[INFO] jclouds Amazon Route 53 provider .................. SKIPPED
[INFO] jclouds ultradns-ws provider ...................... SKIPPED
[INFO] jclouds dynect api ................................ SKIPPED
[INFO] jclouds Enterprise Chef provider .................. SKIPPED
[INFO] jclouds providers project ......................... SKIPPED
[INFO] jclouds jsch ssh client ........................... SKIPPED
[INFO] jclouds example components for a standalone compute provider  SKIPPED
[INFO] jclouds skeletons project ......................... SKIPPED
[INFO] jclouds Google App Engine Components .............. SKIPPED
[INFO] jclouds drivers project ........................... SKIPPED
[INFO] allcompute ........................................ SKIPPED
[INFO] allblobstore ...................................... SKIPPED
[INFO] allloadbalancer ................................... SKIPPED
[INFO] all ............................................... SKIPPED
[INFO] Apache jclouds .................................... SKIPPED
[INFO] ------------------------------------------------------------------------
[INFO] BUILD FAILURE
[INFO] ------------------------------------------------------------------------
[INFO] Total time: 11:39.684s
[INFO] Finished at: Thu Apr 02 05:34:43 EDT 2015
[INFO] Final Memory: 123M/401M
[INFO] ------------------------------------------------------------------------
[ERROR] Failed to execute goal on project openstack-swift: Could not resolve dependencies
for project org.apache.jclouds.api:openstack-swift:bundle:2.0.0-SNAPSHOT: Failure to find
org.jboss.shrinkwrap:shrinkwrap-depchain:pom:1.2.0 in http://repo.cloudbees.com/content/repositories/central
was cached in the local repository, resolution will not be reattempted until the update interval
of central has elapsed or updates are forced -> [Help 1]
org.apache.maven.lifecycle.LifecycleExecutionException: Failed to execute goal on project
openstack-swift: Could not resolve dependencies for project org.apache.jclouds.api:openstack-swift:bundle:2.0.0-SNAPSHOT:
Failure to find org.jboss.shrinkwrap:shrinkwrap-depchain:pom:1.2.0 in http://repo.cloudbees.com/content/repositories/central
was cached in the local repository, resolution will not be reattempted until the update interval
of central has elapsed or updates are forced
	at org.apache.maven.lifecycle.internal.LifecycleDependencyResolver.getDependencies(LifecycleDependencyResolver.java:210)
	at org.apache.maven.lifecycle.internal.LifecycleDependencyResolver.resolveProjectDependencies(LifecycleDependencyResolver.java:117)
	at org.apache.maven.lifecycle.internal.MojoExecutor.ensureDependenciesAreResolved(MojoExecutor.java:258)
	at org.apache.maven.lifecycle.internal.MojoExecutor.execute(MojoExecutor.java:201)
	at org.apache.maven.lifecycle.internal.MojoExecutor.execute(MojoExecutor.java:153)
	at org.apache.maven.lifecycle.internal.MojoExecutor.execute(MojoExecutor.java:145)
	at org.apache.maven.lifecycle.internal.LifecycleModuleBuilder.buildProject(LifecycleModuleBuilder.java:84)
	at org.apache.maven.lifecycle.internal.LifecycleModuleBuilder.buildProject(LifecycleModuleBuilder.java:59)
	at org.apache.maven.lifecycle.internal.LifecycleStarter.singleThreadedBuild(LifecycleStarter.java:183)
	at org.apache.maven.lifecycle.internal.LifecycleStarter.execute(LifecycleStarter.java:161)
	at org.apache.maven.DefaultMaven.doExecute(DefaultMaven.java:320)
	at org.apache.maven.DefaultMaven.execute(DefaultMaven.java:156)
	at org.apache.maven.cli.MavenCli.execute(MavenCli.java:537)
	at org.apache.maven.cli.MavenCli.doMain(MavenCli.java:196)
	at org.apache.maven.cli.MavenCli.main(MavenCli.java:141)
	at sun.reflect.NativeMethodAccessorImpl.invoke0(Native Method)
	at sun.reflect.NativeMethodAccessorImpl.invoke(NativeMethodAccessorImpl.java:57)
	at sun.reflect.DelegatingMethodAccessorImpl.invoke(DelegatingMethodAccessorImpl.java:43)
	at java.lang.reflect.Method.invoke(Method.java:606)
	at org.codehaus.plexus.classworlds.launcher.Launcher.launchEnhanced(Launcher.java:290)
	at org.codehaus.plexus.classworlds.launcher.Launcher.launch(Launcher.java:230)
	at org.codehaus.plexus.classworlds.launcher.Launcher.mainWithExitCode(Launcher.java:409)
	at org.codehaus.plexus.classworlds.launcher.Launcher.main(Launcher.java:352)
Caused by: org.apache.maven.project.DependencyResolutionException: Could not resolve dependencies
for project org.apache.jclouds.api:openstack-swift:bundle:2.0.0-SNAPSHOT: Failure to find
org.jboss.shrinkwrap:shrinkwrap-depchain:pom:1.2.0 in http://repo.cloudbees.com/content/repositories/central
was cached in the local repository, resolution will not be reattempted until the update interval
of central has elapsed or updates are forced
	at org.apache.maven.project.DefaultProjectDependenciesResolver.resolve(DefaultProjectDependenciesResolver.java:189)
	at org.apache.maven.lifecycle.internal.LifecycleDependencyResolver.getDependencies(LifecycleDependencyResolver.java:185)
	... 22 more
Caused by: org.sonatype.aether.resolution.DependencyResolutionException: Failure to find org.jboss.shrinkwrap:shrinkwrap-depchain:pom:1.2.0
in http://repo.cloudbees.com/content/repositories/central was cached in the local repository,
resolution will not be reattempted until the update interval of central has elapsed or updates
are forced
	at org.sonatype.aether.impl.internal.DefaultRepositorySystem.resolveDependencies(DefaultRepositorySystem.java:375)
	at org.apache.maven.project.DefaultProjectDependenciesResolver.resolve(DefaultProjectDependenciesResolver.java:183)
	... 23 more
Caused by: org.sonatype.aether.resolution.ArtifactResolutionException: Failure to find org.jboss.shrinkwrap:shrinkwrap-depchain:pom:1.2.0
in http://repo.cloudbees.com/content/repositories/central was cached in the local repository,
resolution will not be reattempted until the update interval of central has elapsed or updates
are forced
	at org.sonatype.aether.impl.internal.DefaultArtifactResolver.resolve(DefaultArtifactResolver.java:538)
	at org.sonatype.aether.impl.internal.DefaultArtifactResolver.resolveArtifacts(DefaultArtifactResolver.java:216)
	at org.sonatype.aether.impl.internal.DefaultRepositorySystem.resolveDependencies(DefaultRepositorySystem.java:358)
	... 24 more
Caused by: org.sonatype.aether.transfer.ArtifactNotFoundException: Failure to find org.jboss.shrinkwrap:shrinkwrap-depchain:pom:1.2.0
in http://repo.cloudbees.com/content/repositories/central was cached in the local repository,
resolution will not be reattempted until the update interval of central has elapsed or updates
are forced
	at org.sonatype.aether.impl.internal.DefaultUpdateCheckManager.newException(DefaultUpdateCheckManager.java:230)
	at org.sonatype.aether.impl.internal.DefaultUpdateCheckManager.checkArtifact(DefaultUpdateCheckManager.java:176)
	at org.sonatype.aether.impl.internal.DefaultArtifactResolver.resolve(DefaultArtifactResolver.java:427)
	... 26 more
[ERROR] 
[ERROR] Re-run Maven using the -X switch to enable full debug logging.
[ERROR] 
[ERROR] For more information about the errors and possible solutions, please read the following
articles:
[ERROR] [Help 1] http://cwiki.apache.org/confluence/display/MAVEN/DependencyResolutionException
[ERROR] 
[ERROR] After correcting the problems, you can resume the build with the command
[ERROR]   mvn <goals> -rf :openstack-swift
Build step 'Invoke top-level Maven targets' marked build as failure

Mime
View raw message