jclouds-notifications mailing list archives

Site index · List index
Message view « Date » · « Thread »
Top « Date » · « Thread »
From jenkins-no-re...@cloudbees.com
Subject Build failed in Jenkins: jclouds-karaf #1080
Date Sat, 04 Apr 2015 01:53:49 GMT
See <https://jclouds.ci.cloudbees.com/job/jclouds-karaf/1080/>

------------------------------------------
[...truncated 1656 lines...]
Downloaded: http://repo.cloudbees.com/content/repositories/central/org/osgi/org.osgi.core/4.3.0/org.osgi.core-4.3.0.pom
(2 KB at 24.5 KB/sec)
Downloading: http://repo.cloudbees.com/content/repositories/central/org/osgi/org.osgi.compendium/4.3.0/org.osgi.compendium-4.3.0.pom
Downloaded: http://repo.cloudbees.com/content/repositories/central/org/osgi/org.osgi.compendium/4.3.0/org.osgi.compendium-4.3.0.pom
(2 KB at 19.3 KB/sec)
Downloading: http://repo.cloudbees.com/content/repositories/central/com/google/inject/guice/3.0/guice-3.0.pom
Downloaded: http://repo.cloudbees.com/content/repositories/central/com/google/inject/guice/3.0/guice-3.0.pom
(8 KB at 69.7 KB/sec)
Downloading: http://repo.cloudbees.com/content/repositories/central/com/google/inject/guice-parent/3.0/guice-parent-3.0.pom
Downloaded: http://repo.cloudbees.com/content/repositories/central/com/google/inject/guice-parent/3.0/guice-parent-3.0.pom
(13 KB at 1.9 KB/sec)
Downloading: http://repo.cloudbees.com/content/repositories/central/com/google/google/5/google-5.pom
Downloaded: http://repo.cloudbees.com/content/repositories/central/com/google/google/5/google-5.pom
(3 KB at 20.0 KB/sec)
Downloading: http://repo.cloudbees.com/content/repositories/central/javax/inject/javax.inject/1/javax.inject-1.pom
Downloaded: http://repo.cloudbees.com/content/repositories/central/javax/inject/javax.inject/1/javax.inject-1.pom
(612 B at 16.2 KB/sec)
Downloading: http://repo.cloudbees.com/content/repositories/central/aopalliance/aopalliance/1.0/aopalliance-1.0.pom
Downloaded: http://repo.cloudbees.com/content/repositories/central/aopalliance/aopalliance/1.0/aopalliance-1.0.pom
(363 B at 7.5 KB/sec)
Downloading: http://repo.cloudbees.com/content/repositories/central/com/google/guava/guava/16.0.1/guava-16.0.1.pom
Downloaded: http://repo.cloudbees.com/content/repositories/central/com/google/guava/guava/16.0.1/guava-16.0.1.pom
(6 KB at 141.9 KB/sec)
Downloading: http://repo.cloudbees.com/content/repositories/central/com/google/guava/guava-parent/16.0.1/guava-parent-16.0.1.pom
Downloaded: http://repo.cloudbees.com/content/repositories/central/com/google/guava/guava-parent/16.0.1/guava-parent-16.0.1.pom
(8 KB at 93.0 KB/sec)
Downloading: http://repo.cloudbees.com/content/repositories/central/org/sonatype/oss/oss-parent/7/oss-parent-7.pom
Downloaded: http://repo.cloudbees.com/content/repositories/central/org/sonatype/oss/oss-parent/7/oss-parent-7.pom
(5 KB at 130.9 KB/sec)
Downloading: https://repository-jclouds.forge.cloudbees.com/snapshot/org/apache/jclouds/jclouds-core/2.0.0-SNAPSHOT/maven-metadata.xml
Downloading: https://repository.apache.org/content/repositories/snapshots/org/apache/jclouds/jclouds-core/2.0.0-SNAPSHOT/maven-metadata.xml
Downloading: http://download.java.net/maven/2/org/apache/jclouds/jclouds-core/2.0.0-SNAPSHOT/maven-metadata.xml
Downloading: https://oss.sonatype.org/content/repositories/releases/org/apache/jclouds/jclouds-core/2.0.0-SNAPSHOT/maven-metadata.xml
Downloading: http://repository.apache.org/snapshots/org/apache/jclouds/jclouds-core/2.0.0-SNAPSHOT/maven-metadata.xml
Downloaded: http://repository.apache.org/snapshots/org/apache/jclouds/jclouds-core/2.0.0-SNAPSHOT/maven-metadata.xml
(1000 B at 3.6 KB/sec)
Downloaded: https://repository.apache.org/content/repositories/snapshots/org/apache/jclouds/jclouds-core/2.0.0-SNAPSHOT/maven-metadata.xml
(1000 B at 2.8 KB/sec)
Downloading: https://repository-jclouds.forge.cloudbees.com/snapshot/org/apache/jclouds/jclouds-core/2.0.0-SNAPSHOT/jclouds-core-2.0.0-20150404.011002-284.pom
Downloading: https://repository.apache.org/content/repositories/snapshots/org/apache/jclouds/jclouds-core/2.0.0-SNAPSHOT/jclouds-core-2.0.0-20150404.011002-284.pom
Downloaded: https://repository.apache.org/content/repositories/snapshots/org/apache/jclouds/jclouds-core/2.0.0-SNAPSHOT/jclouds-core-2.0.0-20150404.011002-284.pom
(6 KB at 31.1 KB/sec)
Downloading: https://repository-jclouds.forge.cloudbees.com/snapshot/org/apache/jclouds/jclouds-project/2.0.0-SNAPSHOT/maven-metadata.xml
Downloading: https://repository.apache.org/content/repositories/snapshots/org/apache/jclouds/jclouds-project/2.0.0-SNAPSHOT/maven-metadata.xml
Downloading: https://oss.sonatype.org/content/repositories/releases/org/apache/jclouds/jclouds-project/2.0.0-SNAPSHOT/maven-metadata.xml
Downloading: http://download.java.net/maven/2/org/apache/jclouds/jclouds-project/2.0.0-SNAPSHOT/maven-metadata.xml
Downloading: http://repository.apache.org/snapshots/org/apache/jclouds/jclouds-project/2.0.0-SNAPSHOT/maven-metadata.xml
Downloaded: https://repository.apache.org/content/repositories/snapshots/org/apache/jclouds/jclouds-project/2.0.0-SNAPSHOT/maven-metadata.xml
(828 B at 4.4 KB/sec)
Downloaded: http://repository.apache.org/snapshots/org/apache/jclouds/jclouds-project/2.0.0-SNAPSHOT/maven-metadata.xml
(828 B at 4.3 KB/sec)
Downloading: https://repository.apache.org/content/repositories/snapshots/org/apache/jclouds/jclouds-project/2.0.0-SNAPSHOT/jclouds-project-2.0.0-20150404.010723-309.pom
Downloaded: https://repository.apache.org/content/repositories/snapshots/org/apache/jclouds/jclouds-project/2.0.0-SNAPSHOT/jclouds-project-2.0.0-20150404.010723-309.pom
(45 KB at 124.2 KB/sec)
Downloading: http://repo.cloudbees.com/content/repositories/central/javax/ws/rs/jsr311-api/1.1.1/jsr311-api-1.1.1.pom
Downloaded: http://repo.cloudbees.com/content/repositories/central/javax/ws/rs/jsr311-api/1.1.1/jsr311-api-1.1.1.pom
(6 KB at 5.6 KB/sec)
Downloading: http://repo.cloudbees.com/content/repositories/central/com/google/inject/extensions/guice-assistedinject/3.0/guice-assistedinject-3.0.pom
Downloaded: http://repo.cloudbees.com/content/repositories/central/com/google/inject/extensions/guice-assistedinject/3.0/guice-assistedinject-3.0.pom
(549 B at 18.5 KB/sec)
Downloading: http://repo.cloudbees.com/content/repositories/central/com/google/inject/extensions/extensions-parent/3.0/extensions-parent-3.0.pom
Downloaded: http://repo.cloudbees.com/content/repositories/central/com/google/inject/extensions/extensions-parent/3.0/extensions-parent-3.0.pom
(4 KB at 92.6 KB/sec)
Downloading: http://repo.cloudbees.com/content/repositories/central/org/99soft/guice/rocoto/6.2/rocoto-6.2.pom
Downloaded: http://repo.cloudbees.com/content/repositories/central/org/99soft/guice/rocoto/6.2/rocoto-6.2.pom
(5 KB at 211.5 KB/sec)
Downloading: http://repo.cloudbees.com/content/repositories/central/org/99soft/oss-parent/9/oss-parent-9.pom
Downloaded: http://repo.cloudbees.com/content/repositories/central/org/99soft/oss-parent/9/oss-parent-9.pom
(21 KB at 875.1 KB/sec)
Downloading: http://repo.cloudbees.com/content/repositories/central/javax/annotation/jsr250-api/1.0/jsr250-api-1.0.pom
Downloaded: http://repo.cloudbees.com/content/repositories/central/javax/annotation/jsr250-api/1.0/jsr250-api-1.0.pom
(1023 B at 50.0 KB/sec)
Downloading: http://repo.cloudbees.com/content/repositories/central/com/google/code/gson/gson/2.3/gson-2.3.pom
Downloaded: http://repo.cloudbees.com/content/repositories/central/com/google/code/gson/gson/2.3/gson-2.3.pom
(9 KB at 438.2 KB/sec)
Downloading: http://repo.cloudbees.com/content/repositories/central/org/sonatype/oss/oss-parent/9/oss-parent-9.pom
Downloaded: http://repo.cloudbees.com/content/repositories/central/org/sonatype/oss/oss-parent/9/oss-parent-9.pom
(7 KB at 278.9 KB/sec)
Downloading: https://repository-jclouds.forge.cloudbees.com/snapshot/org/apache/jclouds/jclouds-compute/2.0.0-SNAPSHOT/maven-metadata.xml
Downloading: https://repository.apache.org/content/repositories/snapshots/org/apache/jclouds/jclouds-compute/2.0.0-SNAPSHOT/maven-metadata.xml
Downloading: http://download.java.net/maven/2/org/apache/jclouds/jclouds-compute/2.0.0-SNAPSHOT/maven-metadata.xml
Downloading: https://oss.sonatype.org/content/repositories/releases/org/apache/jclouds/jclouds-compute/2.0.0-SNAPSHOT/maven-metadata.xml
Downloading: http://repository.apache.org/snapshots/org/apache/jclouds/jclouds-compute/2.0.0-SNAPSHOT/maven-metadata.xml
Downloaded: https://repository.apache.org/content/repositories/snapshots/org/apache/jclouds/jclouds-compute/2.0.0-SNAPSHOT/maven-metadata.xml
(1003 B at 4.8 KB/sec)
Downloaded: http://repository.apache.org/snapshots/org/apache/jclouds/jclouds-compute/2.0.0-SNAPSHOT/maven-metadata.xml
(1003 B at 5.1 KB/sec)
Downloading: https://repository-jclouds.forge.cloudbees.com/snapshot/org/apache/jclouds/jclouds-compute/2.0.0-SNAPSHOT/jclouds-compute-2.0.0-20150404.011201-283.pom
Downloading: https://repository.apache.org/content/repositories/snapshots/org/apache/jclouds/jclouds-compute/2.0.0-SNAPSHOT/jclouds-compute-2.0.0-20150404.011201-283.pom
Downloaded: https://repository.apache.org/content/repositories/snapshots/org/apache/jclouds/jclouds-compute/2.0.0-SNAPSHOT/jclouds-compute-2.0.0-20150404.011201-283.pom
(3 KB at 15.0 KB/sec)
Downloading: https://repository-jclouds.forge.cloudbees.com/snapshot/org/apache/jclouds/jclouds-scriptbuilder/2.0.0-SNAPSHOT/maven-metadata.xml
Downloading: https://repository.apache.org/content/repositories/snapshots/org/apache/jclouds/jclouds-scriptbuilder/2.0.0-SNAPSHOT/maven-metadata.xml
Downloading: http://download.java.net/maven/2/org/apache/jclouds/jclouds-scriptbuilder/2.0.0-SNAPSHOT/maven-metadata.xml
Downloading: https://oss.sonatype.org/content/repositories/releases/org/apache/jclouds/jclouds-scriptbuilder/2.0.0-SNAPSHOT/maven-metadata.xml
Downloading: http://repository.apache.org/snapshots/org/apache/jclouds/jclouds-scriptbuilder/2.0.0-SNAPSHOT/maven-metadata.xml
Downloaded: https://repository.apache.org/content/repositories/snapshots/org/apache/jclouds/jclouds-scriptbuilder/2.0.0-SNAPSHOT/maven-metadata.xml
(1009 B at 5.0 KB/sec)
Downloaded: http://repository.apache.org/snapshots/org/apache/jclouds/jclouds-scriptbuilder/2.0.0-SNAPSHOT/maven-metadata.xml
(1009 B at 5.2 KB/sec)
Downloading: https://repository-jclouds.forge.cloudbees.com/snapshot/org/apache/jclouds/jclouds-scriptbuilder/2.0.0-SNAPSHOT/jclouds-scriptbuilder-2.0.0-20150404.011101-284.pom
Downloading: https://repository.apache.org/content/repositories/snapshots/org/apache/jclouds/jclouds-scriptbuilder/2.0.0-SNAPSHOT/jclouds-scriptbuilder-2.0.0-20150404.011101-284.pom
Downloaded: https://repository.apache.org/content/repositories/snapshots/org/apache/jclouds/jclouds-scriptbuilder/2.0.0-SNAPSHOT/jclouds-scriptbuilder-2.0.0-20150404.011101-284.pom
(4 KB at 15.2 KB/sec)
Downloading: https://repository.apache.org/content/repositories/snapshots/org/apache/jclouds/jclouds-blobstore/2.0.0-SNAPSHOT/maven-metadata.xml
Downloading: http://download.java.net/maven/2/org/apache/jclouds/jclouds-blobstore/2.0.0-SNAPSHOT/maven-metadata.xml
Downloading: https://oss.sonatype.org/content/repositories/releases/org/apache/jclouds/jclouds-blobstore/2.0.0-SNAPSHOT/maven-metadata.xml
Downloading: https://repository-jclouds.forge.cloudbees.com/snapshot/org/apache/jclouds/jclouds-blobstore/2.0.0-SNAPSHOT/maven-metadata.xml
Downloading: http://repository.apache.org/snapshots/org/apache/jclouds/jclouds-blobstore/2.0.0-SNAPSHOT/maven-metadata.xml
Downloaded: https://repository.apache.org/content/repositories/snapshots/org/apache/jclouds/jclouds-blobstore/2.0.0-SNAPSHOT/maven-metadata.xml
(1005 B at 5.4 KB/sec)
Downloaded: http://repository.apache.org/snapshots/org/apache/jclouds/jclouds-blobstore/2.0.0-SNAPSHOT/maven-metadata.xml
(1005 B at 5.1 KB/sec)
Downloading: https://repository-jclouds.forge.cloudbees.com/snapshot/org/apache/jclouds/jclouds-blobstore/2.0.0-SNAPSHOT/jclouds-blobstore-2.0.0-20150404.011545-283.pom
Downloading: https://repository.apache.org/content/repositories/snapshots/org/apache/jclouds/jclouds-blobstore/2.0.0-SNAPSHOT/jclouds-blobstore-2.0.0-20150404.011545-283.pom
Downloaded: https://repository.apache.org/content/repositories/snapshots/org/apache/jclouds/jclouds-blobstore/2.0.0-SNAPSHOT/jclouds-blobstore-2.0.0-20150404.011545-283.pom
(4 KB at 21.3 KB/sec)
Downloading: http://repo.cloudbees.com/content/repositories/central/org/slf4j/slf4j-api/1.5.8/slf4j-api-1.5.8.pom
Downloaded: http://repo.cloudbees.com/content/repositories/central/org/slf4j/slf4j-api/1.5.8/slf4j-api-1.5.8.pom
(3 KB at 1.1 KB/sec)
Downloading: http://repo.cloudbees.com/content/repositories/central/org/slf4j/slf4j-parent/1.5.8/slf4j-parent-1.5.8.pom
Downloaded: http://repo.cloudbees.com/content/repositories/central/org/slf4j/slf4j-parent/1.5.8/slf4j-parent-1.5.8.pom
(8 KB at 95.2 KB/sec)
Downloading: http://repo.cloudbees.com/content/repositories/central/org/osgi/org.osgi.core/4.3.0/org.osgi.core-4.3.0.jar
Downloading: http://repo.cloudbees.com/content/repositories/central/org/osgi/org.osgi.compendium/4.3.0/org.osgi.compendium-4.3.0.jar
Downloading: http://repo.cloudbees.com/content/repositories/central/com/google/inject/guice/3.0/guice-3.0.jar
Downloading: http://repo.cloudbees.com/content/repositories/central/javax/inject/javax.inject/1/javax.inject-1.jar
Downloading: http://repo.cloudbees.com/content/repositories/central/aopalliance/aopalliance/1.0/aopalliance-1.0.jar
Downloaded: http://repo.cloudbees.com/content/repositories/central/aopalliance/aopalliance/1.0/aopalliance-1.0.jar
(5 KB at 198.3 KB/sec)
Downloading: http://repo.cloudbees.com/content/repositories/central/com/google/guava/guava/16.0.1/guava-16.0.1.jar
Downloaded: http://repo.cloudbees.com/content/repositories/central/javax/inject/javax.inject/1/javax.inject-1.jar
(3 KB at 97.5 KB/sec)
Downloading: http://repo.cloudbees.com/content/repositories/central/javax/ws/rs/jsr311-api/1.1.1/jsr311-api-1.1.1.jar
Downloaded: http://repo.cloudbees.com/content/repositories/central/javax/ws/rs/jsr311-api/1.1.1/jsr311-api-1.1.1.jar
(46 KB at 1561.4 KB/sec)
Downloading: http://repo.cloudbees.com/content/repositories/central/com/google/inject/extensions/guice-assistedinject/3.0/guice-assistedinject-3.0.jar
Downloaded: http://repo.cloudbees.com/content/repositories/central/com/google/inject/guice/3.0/guice-3.0.jar
(694 KB at 11962.8 KB/sec)
Downloading: http://repo.cloudbees.com/content/repositories/central/org/99soft/guice/rocoto/6.2/rocoto-6.2.jar
Downloaded: http://repo.cloudbees.com/content/repositories/central/org/99soft/guice/rocoto/6.2/rocoto-6.2.jar
(48 KB at 2352.4 KB/sec)
Downloading: http://repo.cloudbees.com/content/repositories/central/javax/annotation/jsr250-api/1.0/jsr250-api-1.0.jar
Downloaded: http://repo.cloudbees.com/content/repositories/central/com/google/inject/extensions/guice-assistedinject/3.0/guice-assistedinject-3.0.jar
(37 KB at 1094.9 KB/sec)
Downloading: http://repo.cloudbees.com/content/repositories/central/com/google/code/gson/gson/2.3/gson-2.3.jar
Downloaded: http://repo.cloudbees.com/content/repositories/central/javax/annotation/jsr250-api/1.0/jsr250-api-1.0.jar
(6 KB at 168.0 KB/sec)
Downloading: http://repo.cloudbees.com/content/repositories/central/org/slf4j/slf4j-api/1.5.8/slf4j-api-1.5.8.jar
Downloaded: http://repo.cloudbees.com/content/repositories/central/org/osgi/org.osgi.compendium/4.3.0/org.osgi.compendium-4.3.0.jar
(751 KB at 6305.3 KB/sec)
Downloaded: http://repo.cloudbees.com/content/repositories/central/org/osgi/org.osgi.core/4.3.0/org.osgi.core-4.3.0.jar
(339 KB at 2796.8 KB/sec)
Downloaded: http://repo.cloudbees.com/content/repositories/central/com/google/code/gson/gson/2.3/gson-2.3.jar
(203 KB at 4489.0 KB/sec)
Downloaded: http://repo.cloudbees.com/content/repositories/central/com/google/guava/guava/16.0.1/guava-16.0.1.jar
(2176 KB at 18596.5 KB/sec)
Downloaded: http://repo.cloudbees.com/content/repositories/central/org/slf4j/slf4j-api/1.5.8/slf4j-api-1.5.8.jar
(23 KB at 363.4 KB/sec)
Downloading: https://repository.apache.org/content/repositories/snapshots/org/apache/jclouds/jclouds-core/2.0.0-SNAPSHOT/jclouds-core-2.0.0-20150404.011002-284.jar
Downloading: https://repository.apache.org/content/repositories/snapshots/org/apache/jclouds/jclouds-compute/2.0.0-SNAPSHOT/jclouds-compute-2.0.0-20150404.011201-283.jar
Downloading: https://repository.apache.org/content/repositories/snapshots/org/apache/jclouds/jclouds-blobstore/2.0.0-SNAPSHOT/jclouds-blobstore-2.0.0-20150404.011545-283.jar
Downloading: https://repository.apache.org/content/repositories/snapshots/org/apache/jclouds/jclouds-scriptbuilder/2.0.0-SNAPSHOT/jclouds-scriptbuilder-2.0.0-20150404.011101-284.jar
Downloaded: https://repository.apache.org/content/repositories/snapshots/org/apache/jclouds/jclouds-scriptbuilder/2.0.0-SNAPSHOT/jclouds-scriptbuilder-2.0.0-20150404.011101-284.jar
(170 KB at 202.2 KB/sec)
Downloaded: https://repository.apache.org/content/repositories/snapshots/org/apache/jclouds/jclouds-blobstore/2.0.0-SNAPSHOT/jclouds-blobstore-2.0.0-20150404.011545-283.jar
(172 KB at 176.6 KB/sec)
Downloaded: https://repository.apache.org/content/repositories/snapshots/org/apache/jclouds/jclouds-compute/2.0.0-SNAPSHOT/jclouds-compute-2.0.0-20150404.011201-283.jar
(501 KB at 471.4 KB/sec)
Downloaded: https://repository.apache.org/content/repositories/snapshots/org/apache/jclouds/jclouds-core/2.0.0-SNAPSHOT/jclouds-core-2.0.0-20150404.011002-284.jar
(712 KB at 493.9 KB/sec)
[INFO] 
[INFO] --- maven-clean-plugin:2.5:clean (default-clean) @ core ---
[INFO] 
[INFO] --- maven-remote-resources-plugin:1.5:process (default) @ core ---
[INFO] 
[INFO] --- maven-resources-plugin:2.6:resources (default-resources) @ core ---
Downloading: https://repository-jclouds.forge.cloudbees.com/release/org/apache/maven/reporting/maven-reporting-api/2.0.6/maven-reporting-api-2.0.6.jar
Downloading: https://repository-jclouds.forge.cloudbees.com/release/org/apache/maven/doxia/doxia-sink-api/1.0-alpha-7/doxia-sink-api-1.0-alpha-7.jar
Downloading: https://repository-jclouds.forge.cloudbees.com/release/commons-cli/commons-cli/1.0/commons-cli-1.0.jar
Downloading: https://repository-jclouds.forge.cloudbees.com/release/org/codehaus/plexus/plexus-utils/2.0.5/plexus-utils-2.0.5.jar
Downloading: https://repository-jclouds.forge.cloudbees.com/release/org/codehaus/plexus/plexus-interpolation/1.13/plexus-interpolation-1.13.jar
Downloading: http://repo.cloudbees.com/content/repositories/central/org/apache/maven/reporting/maven-reporting-api/2.0.6/maven-reporting-api-2.0.6.jar
Downloading: http://repo.cloudbees.com/content/repositories/central/org/apache/maven/doxia/doxia-sink-api/1.0-alpha-7/doxia-sink-api-1.0-alpha-7.jar
Downloading: http://repo.cloudbees.com/content/repositories/central/org/codehaus/plexus/plexus-utils/2.0.5/plexus-utils-2.0.5.jar
Downloading: http://repo.cloudbees.com/content/repositories/central/org/codehaus/plexus/plexus-interpolation/1.13/plexus-interpolation-1.13.jar
Downloading: http://repo.cloudbees.com/content/repositories/central/commons-cli/commons-cli/1.0/commons-cli-1.0.jar
Downloaded: http://repo.cloudbees.com/content/repositories/central/org/codehaus/plexus/plexus-interpolation/1.13/plexus-interpolation-1.13.jar
(60 KB at 67.7 KB/sec)
Downloaded: http://repo.cloudbees.com/content/repositories/central/org/apache/maven/reporting/maven-reporting-api/2.0.6/maven-reporting-api-2.0.6.jar
(10 KB at 10.6 KB/sec)
[WARNING] Failed to getClass for org.apache.maven.plugin.resources.ResourcesMojo
Started calculate disk usage of build
Finished Calculation of disk usage of build in 0 seconds
Started calculate disk usage of workspace
Finished Calculation of disk usage of workspace in 0 seconds
[INFO] ------------------------------------------------------------------------
[INFO] Reactor Summary:
[INFO] 
[INFO] Apache jclouds :: Karaf ........................... SUCCESS [7:59.419s]
[INFO] jclouds :: Karaf :: Core .......................... FAILURE [37.736s]
[INFO] jclouds :: Karaf :: Utils ......................... SKIPPED
[INFO] jclouds :: Karaf :: Recipe ........................ SKIPPED
[INFO] jclouds :: Karaf :: Cache ......................... SKIPPED
[INFO] jclouds :: Karaf :: Services ...................... SKIPPED
[INFO] jclouds :: Karaf :: Commands ...................... SKIPPED
[INFO] jclouds :: Karaf :: URL Handler ................... SKIPPED
[INFO] jclouds :: Karaf :: Chef .......................... SKIPPED
[INFO] jclouds :: Karaf :: Chef :: Core .................. SKIPPED
[INFO] jclouds :: Karaf :: Chef :: Services .............. SKIPPED
[INFO] jclouds :: Karaf :: Chef :: Commands .............. SKIPPED
[INFO] jclouds :: Karaf :: Chef :: Cache ................. SKIPPED
[INFO] jclouds :: Karaf :: Feature ....................... SKIPPED
[INFO] jclouds :: Karaf :: Integration Tests ............. SKIPPED
[INFO] ------------------------------------------------------------------------
[INFO] BUILD FAILURE
[INFO] ------------------------------------------------------------------------
[INFO] Total time: 10:24.740s
[INFO] Finished at: Fri Apr 03 21:53:42 EDT 2015
[INFO] Final Memory: 20M/133M
[INFO] ------------------------------------------------------------------------
Waiting for Jenkins to finish collecting data
[ERROR] Failed to execute goal org.apache.maven.plugins:maven-resources-plugin:2.6:resources
(default-resources) on project core: Execution default-resources of goal org.apache.maven.plugins:maven-resources-plugin:2.6:resources
failed: Plugin org.apache.maven.plugins:maven-resources-plugin:2.6 or one of its dependencies
could not be resolved: The following artifacts could not be resolved: org.apache.maven.doxia:doxia-sink-api:jar:1.0-alpha-7,
commons-cli:commons-cli:jar:1.0, org.codehaus.plexus:plexus-utils:jar:2.0.5: Could not find
artifact org.apache.maven.doxia:doxia-sink-api:jar:1.0-alpha-7 in cloudbees-private-release-repository
(https://repository-jclouds.forge.cloudbees.com/release) -> [Help 1]
org.apache.maven.lifecycle.LifecycleExecutionException: Failed to execute goal org.apache.maven.plugins:maven-resources-plugin:2.6:resources
(default-resources) on project core: Execution default-resources of goal org.apache.maven.plugins:maven-resources-plugin:2.6:resources
failed: Plugin org.apache.maven.plugins:maven-resources-plugin:2.6 or one of its dependencies
could not be resolved: The following artifacts could not be resolved: org.apache.maven.doxia:doxia-sink-api:jar:1.0-alpha-7,
commons-cli:commons-cli:jar:1.0, org.codehaus.plexus:plexus-utils:jar:2.0.5: Could not find
artifact org.apache.maven.doxia:doxia-sink-api:jar:1.0-alpha-7 in cloudbees-private-release-repository
(https://repository-jclouds.forge.cloudbees.com/release)
	at org.apache.maven.lifecycle.internal.MojoExecutor.execute(MojoExecutor.java:225)
	at org.apache.maven.lifecycle.internal.MojoExecutor.execute(MojoExecutor.java:153)
	at org.apache.maven.lifecycle.internal.MojoExecutor.execute(MojoExecutor.java:145)
	at org.apache.maven.lifecycle.internal.LifecycleModuleBuilder.buildProject(LifecycleModuleBuilder.java:84)
	at org.apache.maven.lifecycle.internal.LifecycleModuleBuilder.buildProject(LifecycleModuleBuilder.java:59)
	at org.apache.maven.lifecycle.internal.LifecycleStarter.singleThreadedBuild(LifecycleStarter.java:183)
	at org.apache.maven.lifecycle.internal.LifecycleStarter.execute(LifecycleStarter.java:161)
	at org.apache.maven.DefaultMaven.doExecute(DefaultMaven.java:320)
	at org.apache.maven.DefaultMaven.execute(DefaultMaven.java:156)
	at org.jvnet.hudson.maven3.launcher.Maven3Launcher.main(Maven3Launcher.java:117)
	at sun.reflect.NativeMethodAccessorImpl.invoke0(Native Method)
	at sun.reflect.NativeMethodAccessorImpl.invoke(NativeMethodAccessorImpl.java:57)
	at sun.reflect.DelegatingMethodAccessorImpl.invoke(DelegatingMethodAccessorImpl.java:43)
	at java.lang.reflect.Method.invoke(Method.java:606)
	at org.codehaus.plexus.classworlds.launcher.Launcher.launchStandard(Launcher.java:329)
	at org.codehaus.plexus.classworlds.launcher.Launcher.launch(Launcher.java:239)
	at org.jvnet.hudson.maven3.agent.Maven3Main.launch(Maven3Main.java:178)
	at sun.reflect.NativeMethodAccessorImpl.invoke0(Native Method)
	at sun.reflect.NativeMethodAccessorImpl.invoke(NativeMethodAccessorImpl.java:57)
	at sun.reflect.DelegatingMethodAccessorImpl.invoke(DelegatingMethodAccessorImpl.java:43)
	at java.lang.reflect.Method.invoke(Method.java:606)
	at hudson.maven.Maven3Builder.call(Maven3Builder.java:136)
	at hudson.maven.Maven3Builder.call(Maven3Builder.java:71)
	at hudson.remoting.UserRequest.perform(UserRequest.java:121)
	at hudson.remoting.UserRequest.perform(UserRequest.java:49)
	at hudson.remoting.Request$2.run(Request.java:324)
	at hudson.remoting.InterceptingExecutorService$1.call(InterceptingExecutorService.java:68)
	at java.util.concurrent.FutureTask.run(FutureTask.java:262)
	at java.util.concurrent.ThreadPoolExecutor.runWorker(ThreadPoolExecutor.java:1145)
	at java.util.concurrent.ThreadPoolExecutor$Worker.run(ThreadPoolExecutor.java:615)
	at java.lang.Thread.run(Thread.java:745)
Caused by: org.apache.maven.plugin.PluginExecutionException: Execution default-resources of
goal org.apache.maven.plugins:maven-resources-plugin:2.6:resources failed: Plugin org.apache.maven.plugins:maven-resources-plugin:2.6
or one of its dependencies could not be resolved: The following artifacts could not be resolved:
org.apache.maven.doxia:doxia-sink-api:jar:1.0-alpha-7, commons-cli:commons-cli:jar:1.0, org.codehaus.plexus:plexus-utils:jar:2.0.5:
Could not find artifact org.apache.maven.doxia:doxia-sink-api:jar:1.0-alpha-7 in cloudbees-private-release-repository
(https://repository-jclouds.forge.cloudbees.com/release)
	at org.apache.maven.plugin.DefaultBuildPluginManager.executeMojo(DefaultBuildPluginManager.java:82)
	at org.apache.maven.lifecycle.internal.MojoExecutor.execute(MojoExecutor.java:209)
	... 30 more
Caused by: org.apache.maven.plugin.PluginResolutionException: Plugin org.apache.maven.plugins:maven-resources-plugin:2.6
or one of its dependencies could not be resolved: The following artifacts could not be resolved:
org.apache.maven.doxia:doxia-sink-api:jar:1.0-alpha-7, commons-cli:commons-cli:jar:1.0, org.codehaus.plexus:plexus-utils:jar:2.0.5:
Could not find artifact org.apache.maven.doxia:doxia-sink-api:jar:1.0-alpha-7 in cloudbees-private-release-repository
(https://repository-jclouds.forge.cloudbees.com/release)
	at org.apache.maven.plugin.internal.DefaultPluginDependenciesResolver.resolve(DefaultPluginDependenciesResolver.java:215)
	at org.apache.maven.plugin.internal.DefaultMavenPluginManager.createPluginRealm(DefaultMavenPluginManager.java:353)
	at org.apache.maven.plugin.internal.DefaultMavenPluginManager.setupPluginRealm(DefaultMavenPluginManager.java:321)
	at org.apache.maven.plugin.DefaultBuildPluginManager.getPluginRealm(DefaultBuildPluginManager.java:175)
	at org.apache.maven.plugin.DefaultBuildPluginManager.executeMojo(DefaultBuildPluginManager.java:78)
	... 31 more
Caused by: org.sonatype.aether.resolution.ArtifactResolutionException: The following artifacts
could not be resolved: org.apache.maven.doxia:doxia-sink-api:jar:1.0-alpha-7, commons-cli:commons-cli:jar:1.0,
org.codehaus.plexus:plexus-utils:jar:2.0.5: Could not find artifact org.apache.maven.doxia:doxia-sink-api:jar:1.0-alpha-7
in cloudbees-private-release-repository (https://repository-jclouds.forge.cloudbees.com/release)
	at org.sonatype.aether.impl.internal.DefaultArtifactResolver.resolve(DefaultArtifactResolver.java:538)
	at org.sonatype.aether.impl.internal.DefaultArtifactResolver.resolveArtifacts(DefaultArtifactResolver.java:216)
	at org.sonatype.aether.impl.internal.DefaultRepositorySystem.resolveDependencies(DefaultRepositorySystem.java:358)
	at org.apache.maven.plugin.internal.DefaultPluginDependenciesResolver.resolve(DefaultPluginDependenciesResolver.java:207)
	... 35 more
Caused by: org.sonatype.aether.transfer.ArtifactNotFoundException: Could not find artifact
org.apache.maven.doxia:doxia-sink-api:jar:1.0-alpha-7 in cloudbees-private-release-repository
(https://repository-jclouds.forge.cloudbees.com/release)
	at org.sonatype.aether.connector.wagon.WagonRepositoryConnector$4.wrap(WagonRepositoryConnector.java:947)
	at org.sonatype.aether.connector.wagon.WagonRepositoryConnector$4.wrap(WagonRepositoryConnector.java:941)
	at org.sonatype.aether.connector.wagon.WagonRepositoryConnector$GetTask.run(WagonRepositoryConnector.java:669)
	at org.sonatype.aether.util.concurrency.RunnableErrorForwarder$1.run(RunnableErrorForwarder.java:60)
	... 3 more
[ERROR] 
[ERROR] Re-run Maven using the -X switch to enable full debug logging.
[ERROR] 
[ERROR] For more information about the errors and possible solutions, please read the following
articles:
[ERROR] [Help 1] http://cwiki.apache.org/confluence/display/MAVEN/PluginResolutionException
[ERROR] 
[ERROR] After correcting the problems, you can resume the build with the command
[ERROR]   mvn <goals> -rf :core
[JENKINS] Archiving <https://jclouds.ci.cloudbees.com/job/jclouds-karaf/ws/chef/commands/pom.xml>
to org.apache.jclouds.karaf.chef/commands/2.0.0-SNAPSHOT/commands-2.0.0-SNAPSHOT.pom
[JENKINS] Archiving <https://jclouds.ci.cloudbees.com/job/jclouds-karaf/ws/chef/cache/pom.xml>
to org.apache.jclouds.karaf.chef/cache/2.0.0-SNAPSHOT/cache-2.0.0-SNAPSHOT.pom
[JENKINS] Archiving <https://jclouds.ci.cloudbees.com/job/jclouds-karaf/ws/commands/pom.xml>
to org.apache.jclouds.karaf/commands/2.0.0-SNAPSHOT/commands-2.0.0-SNAPSHOT.pom
[JENKINS] Archiving <https://jclouds.ci.cloudbees.com/job/jclouds-karaf/ws/utils/pom.xml>
to org.apache.jclouds.karaf/utils/2.0.0-SNAPSHOT/utils-2.0.0-SNAPSHOT.pom
[JENKINS] Archiving <https://jclouds.ci.cloudbees.com/job/jclouds-karaf/ws/feature/pom.xml>
to org.apache.jclouds.karaf/jclouds-karaf/2.0.0-SNAPSHOT/jclouds-karaf-2.0.0-SNAPSHOT.pom
[JENKINS] Archiving <https://jclouds.ci.cloudbees.com/job/jclouds-karaf/ws/itests/pom.xml>
to org.apache.jclouds.karaf/itests/2.0.0-SNAPSHOT/itests-2.0.0-SNAPSHOT.pom
[JENKINS] Archiving <https://jclouds.ci.cloudbees.com/job/jclouds-karaf/ws/chef/core/pom.xml>
to org.apache.jclouds.karaf.chef/core/2.0.0-SNAPSHOT/core-2.0.0-SNAPSHOT.pom
[JENKINS] Archiving <https://jclouds.ci.cloudbees.com/job/jclouds-karaf/ws/urlhandler/pom.xml>
to org.apache.jclouds.karaf/urlhandler/2.0.0-SNAPSHOT/urlhandler-2.0.0-SNAPSHOT.pom
[JENKINS] Archiving <https://jclouds.ci.cloudbees.com/job/jclouds-karaf/ws/services/pom.xml>
to org.apache.jclouds.karaf/services/2.0.0-SNAPSHOT/services-2.0.0-SNAPSHOT.pom
[JENKINS] Archiving <https://jclouds.ci.cloudbees.com/job/jclouds-karaf/ws/core/pom.xml>
to org.apache.jclouds.karaf/core/2.0.0-SNAPSHOT/core-2.0.0-SNAPSHOT.pom
[JENKINS] Archiving <https://jclouds.ci.cloudbees.com/job/jclouds-karaf/ws/recipe/pom.xml>
to org.apache.jclouds.karaf/recipe/2.0.0-SNAPSHOT/recipe-2.0.0-SNAPSHOT.pom
[JENKINS] Archiving <https://jclouds.ci.cloudbees.com/job/jclouds-karaf/ws/chef/services/pom.xml>
to org.apache.jclouds.karaf.chef/services/2.0.0-SNAPSHOT/services-2.0.0-SNAPSHOT.pom
[JENKINS] Archiving <https://jclouds.ci.cloudbees.com/job/jclouds-karaf/ws/chef/pom.xml>
to org.apache.jclouds.karaf/chef/2.0.0-SNAPSHOT/chef-2.0.0-SNAPSHOT.pom
[JENKINS] Archiving <https://jclouds.ci.cloudbees.com/job/jclouds-karaf/ws/cache/pom.xml>
to org.apache.jclouds.karaf/cache/2.0.0-SNAPSHOT/cache-2.0.0-SNAPSHOT.pom
[JENKINS] Archiving <https://jclouds.ci.cloudbees.com/job/jclouds-karaf/ws/pom.xml>
to org.apache.jclouds/jclouds-karaf/2.0.0-SNAPSHOT/jclouds-karaf-2.0.0-SNAPSHOT.pom
channel stopped

Mime
View raw message