jclouds-notifications mailing list archives

Site index · List index
Message view « Date » · « Thread »
Top « Date » · « Thread »
From jenkins-no-re...@cloudbees.com
Subject Build failed in Jenkins: jclouds-guava-17-18 » 17.0,OpenJDK 7 (latest) #163
Date Wed, 01 Apr 2015 02:36:57 GMT
See <https://jclouds.ci.cloudbees.com/job/jclouds-guava-17-18/GUAVA_VERSION=17.0,jdk=OpenJDK%207%20(latest)/163/changes>

Changes:

[Andrew Gaul] Do not allow Windows line endings

[Andrew Gaul] Convert Windows to Unix line endings

[Andrew Gaul] Upgrade to maven-checkstyle-plugin to 2.15

------------------------------------------
[...truncated 14228 lines...]
Test suite progress: tests succeeded: 65, failed: 0, skipped: 0.
Starting test testOverwriteBlobMetadata(org.jclouds.filesystem.strategy.internal.FilesystemStorageStrategyImplTest)
[pool-38-thread-1] Test testOverwriteBlobMetadata(org.jclouds.filesystem.strategy.internal.FilesystemStorageStrategyImplTest)
succeeded: 7ms
Test suite progress: tests succeeded: 66, failed: 0, skipped: 0.
Starting test testRemoveBlob(org.jclouds.filesystem.strategy.internal.FilesystemStorageStrategyImplTest)
[pool-38-thread-1] Test testRemoveBlob(org.jclouds.filesystem.strategy.internal.FilesystemStorageStrategyImplTest)
succeeded: 60ms
Test suite progress: tests succeeded: 67, failed: 0, skipped: 0.
Starting test testRemoveBlob_BlobNotExists(org.jclouds.filesystem.strategy.internal.FilesystemStorageStrategyImplTest)
[pool-38-thread-1] Test testRemoveBlob_BlobNotExists(org.jclouds.filesystem.strategy.internal.FilesystemStorageStrategyImplTest)
succeeded: 1ms
Test suite progress: tests succeeded: 68, failed: 0, skipped: 0.
Starting test testRemoveBlob_ContainerNotExists(org.jclouds.filesystem.strategy.internal.FilesystemStorageStrategyImplTest)
[pool-38-thread-1] Test testRemoveBlob_ContainerNotExists(org.jclouds.filesystem.strategy.internal.FilesystemStorageStrategyImplTest)
succeeded: 0ms
Test suite progress: tests succeeded: 69, failed: 0, skipped: 0.
Starting test testWriteDirectoryBlob(org.jclouds.filesystem.strategy.internal.FilesystemStorageStrategyImplTest)
[pool-38-thread-1] Test testWriteDirectoryBlob(org.jclouds.filesystem.strategy.internal.FilesystemStorageStrategyImplTest)
succeeded: 3ms
Test suite progress: tests succeeded: 70, failed: 0, skipped: 0.
Starting test testWritePayloadOnFile(org.jclouds.filesystem.strategy.internal.FilesystemStorageStrategyImplTest)
[pool-38-thread-1] Test testWritePayloadOnFile(org.jclouds.filesystem.strategy.internal.FilesystemStorageStrategyImplTest)
succeeded: 10ms
Test suite progress: tests succeeded: 71, failed: 0, skipped: 0.
Starting test testWritePayloadOnFileInputStream(org.jclouds.filesystem.strategy.internal.FilesystemStorageStrategyImplTest)
[pool-38-thread-1] Test testWritePayloadOnFileInputStream(org.jclouds.filesystem.strategy.internal.FilesystemStorageStrategyImplTest)
succeeded: 25ms
Test suite progress: tests succeeded: 72, failed: 0, skipped: 0.
Starting test testWritePayloadOnFile_SourceFileDoesntExist(org.jclouds.filesystem.strategy.internal.FilesystemStorageStrategyImplTest)
[pool-38-thread-1] Test testWritePayloadOnFile_SourceFileDoesntExist(org.jclouds.filesystem.strategy.internal.FilesystemStorageStrategyImplTest)
succeeded: 2ms
Test suite progress: tests succeeded: 73, failed: 0, skipped: 0.
Starting test testInvalidNames(org.jclouds.filesystem.predicates.validators.internal.FilesystemBlobKeyValidatorTest)
Starting test testNamesValidity(org.jclouds.filesystem.predicates.validators.internal.FilesystemBlobKeyValidatorTest)
[pool-39-thread-2] Test testNamesValidity(org.jclouds.filesystem.predicates.validators.internal.FilesystemBlobKeyValidatorTest)
succeeded: 0ms
Test suite progress: tests succeeded: 74, failed: 0, skipped: 0.
[pool-39-thread-1] Test testInvalidNames(org.jclouds.filesystem.predicates.validators.internal.FilesystemBlobKeyValidatorTest)
succeeded: 1ms
Test suite progress: tests succeeded: 75, failed: 0, skipped: 0.
Starting test testInvalidNames(org.jclouds.filesystem.predicates.validators.internal.FilesystemContainerNameValidatorTest)
Starting test testNamesValidity(org.jclouds.filesystem.predicates.validators.internal.FilesystemContainerNameValidatorTest)
[pool-40-thread-2] Test testNamesValidity(org.jclouds.filesystem.predicates.validators.internal.FilesystemContainerNameValidatorTest)
succeeded: 0ms
Test suite progress: tests succeeded: 76, failed: 0, skipped: 0.
[pool-40-thread-1] Test testInvalidNames(org.jclouds.filesystem.predicates.validators.internal.FilesystemContainerNameValidatorTest)
succeeded: 1ms
Test suite progress: tests succeeded: 77, failed: 0, skipped: 0.
Tests run: 77, Failures: 0, Errors: 0, Skipped: 0, Time elapsed: 12.225 sec - in TestSuite

Results :

Tests run: 77, Failures: 0, Errors: 0, Skipped: 0

[INFO] 
[INFO] --- animal-sniffer-maven-plugin:1.11:check (default) @ filesystem ---
[INFO] Checking unresolved references to org.codehaus.mojo.signature:java17:1.0
Downloading: http://repo.cloudbees.com/content/repositories/central/org/codehaus/mojo/signature/java17/1.0/java17-1.0.signature
                          
Downloading: https://repository-jclouds.forge.cloudbees.com/release/org/codehaus/mojo/signature/java17/1.0/java17-1.0.signature
                          
[INFO] ------------------------------------------------------------------------
[INFO] Reactor Summary:
[INFO] 
[INFO] Apache jclouds Project ............................ SUCCESS [16.777s]
[INFO] jclouds shared Maven resources .................... SUCCESS [4.234s]
[INFO] jclouds Components Core ........................... SUCCESS [1:46.244s]
[INFO] jclouds OpenStack Components Core ................. SUCCESS [20.426s]
[INFO] jclouds commons project ........................... SUCCESS [0.833s]
[INFO] jclouds script builder ............................ SUCCESS [5.821s]
[INFO] jclouds compute core .............................. SUCCESS [49.660s]
[INFO] jclouds Log4J Logging Module ...................... SUCCESS [2.924s]
[INFO] jclouds loadbalancer core ......................... SUCCESS [2.410s]
[INFO] jclouds sts api ................................... SUCCESS [6.336s]
[INFO] jclouds cloudwatch api ............................ SUCCESS [8.181s]
[INFO] jclouds SLF4J Logging Module ...................... SUCCESS [2.471s]
[INFO] jclouds bouncycastle EncryptionService Module ..... SUCCESS [4.362s]
[INFO] jclouds sshj ssh client ........................... SUCCESS [7.025s]
[INFO] jclouds cloudstack core ........................... SUCCESS [50.521s]
[INFO] jclouds blobstore core ............................ SUCCESS [39.412s]
[INFO] jclouds filesystem core ........................... FAILURE [14.051s]
[INFO] jclouds bring your own node provider .............. SKIPPED
[INFO] jclouds OkHttp Driver ............................. SKIPPED
[INFO] jclouds s3 api .................................... SKIPPED
[INFO] jclouds ec2 api ................................... SKIPPED
[INFO] jclouds sqs api ................................... SKIPPED
[INFO] jclouds elasticstack core ......................... SKIPPED
[INFO] jclouds atmos components .......................... SKIPPED
[INFO] jclouds openstack-keystone api .................... SKIPPED
[INFO] jclouds swift api ................................. SKIPPED
[INFO] jclouds openstack-cinder api ...................... SKIPPED
[INFO] Apache jclouds :: OpenStack :: Nova API ........... SKIPPED
[INFO] jclouds openstack-nova-ec2 api .................... SKIPPED
[INFO] jclouds openstack-swift api ....................... SKIPPED
[INFO] jclouds openstack-trove api ....................... SKIPPED
[INFO] jclouds cloudfiles api ............................ SKIPPED
[INFO] jclouds rackspace cloudidentity api ............... SKIPPED
[INFO] jclouds Rackspace Cloud Load Balancers API ........ SKIPPED
[INFO] jclouds Rackspace Next Generation Cloud Block Storage US provider  SKIPPED
[INFO] jclouds Rackspace Next Generation Cloud Servers US provider  SKIPPED
[INFO] jclouds rackspace clouddns api .................... SKIPPED
[INFO] jclouds route53 api ............................... SKIPPED
[INFO] jclouds Chef api .................................. SKIPPED
[INFO] jclouds apis project .............................. SKIPPED
[INFO] jclouds GoGrid provider ........................... SKIPPED
[INFO] jclouds Azure Storage provider .................... SKIPPED
[INFO] jclouds Apache Http Components Client ............. SKIPPED
[INFO] jclouds joda DateService Module ................... SKIPPED
[INFO] jclouds netty payload module ...................... SKIPPED
[INFO] jclouds enterprise Module ......................... SKIPPED
[INFO] jclouds Amazon Simple Storage Service (S3) provider  SKIPPED
[INFO] jclouds Amazon Elastic Load Balancer provider ..... SKIPPED
[INFO] jclouds Amazon EC2 provider ....................... SKIPPED
[INFO] jclouds Amazon Simple Queue Service provider ...... SKIPPED
[INFO] jclouds ElasticHosts Peer1 London provider ........ SKIPPED
[INFO] jclouds ElasticHosts Peer1 San Antonio provider ... SKIPPED
[INFO] jclouds ElasticHosts BlueSquare London provider ... SKIPPED
[INFO] jclouds ElasticHosts Peer1 Toronto provider ....... SKIPPED
[INFO] jclouds ElasticHosts Peer1 Los Angeles provider ... SKIPPED
[INFO] jclouds ElasticHosts Amsterdam provider ........... SKIPPED
[INFO] jclouds ElasticHosts San Jose provider ............ SKIPPED
[INFO] jclouds ElasticHosts Hong Kong provider ........... SKIPPED
[INFO] jclouds ElasticHosts Sydney provider .............. SKIPPED
[INFO] jclouds Open Hosting East1 provider ............... SKIPPED
[INFO] jclouds Serverlove Manchester provider ............ SKIPPED
[INFO] jclouds SkaliCloud Malaysia provider .............. SKIPPED
[INFO] jclouds Go2Cloud Johannesburg1 provider ........... SKIPPED
[INFO] jclouds SoftLayer core ............................ SKIPPED
[INFO] jclouds HP Cloud Compute provider ................. SKIPPED
[INFO] jclouds HP Cloud Block Storage Provider ........... SKIPPED
[INFO] jclouds HP Cloud Object Storage ................... SKIPPED
[INFO] jclouds CloudFiles US provider .................... SKIPPED
[INFO] jclouds CloudFiles UK provider .................... SKIPPED
[INFO] jclouds Rackspace Next Generation Cloud DNS US provider  SKIPPED
[INFO] jclouds Rackspace Next Generation Cloud DNS UK provider  SKIPPED
[INFO] jclouds Rackspace Cloud Databases US provider ..... SKIPPED
[INFO] jclouds Rackspace Cloud Databases UK provider ..... SKIPPED
[INFO] jclouds Rackspace Cloud Load Balancers US provider  SKIPPED
[INFO] jclouds Rackspace Cloud Load Balancers UK provider  SKIPPED
[INFO] jclouds Rackspace Next Generation Cloud Block Storage UK provider  SKIPPED
[INFO] jclouds Rackspace Next Generation Cloud Servers provider  SKIPPED
[INFO] jclouds GleSYS core ............................... SKIPPED
[INFO] jclouds Amazon Identity and Access Management (STS) provider  SKIPPED
[INFO] jclouds Amazon Route 53 provider .................. SKIPPED
[INFO] jclouds ultradns-ws provider ...................... SKIPPED
[INFO] jclouds dynect api ................................ SKIPPED
[INFO] jclouds Enterprise Chef provider .................. SKIPPED
[INFO] jclouds providers project ......................... SKIPPED
[INFO] jclouds jsch ssh client ........................... SKIPPED
[INFO] jclouds example components for a standalone compute provider  SKIPPED
[INFO] jclouds skeletons project ......................... SKIPPED
[INFO] jclouds Google App Engine Components .............. SKIPPED
[INFO] jclouds drivers project ........................... SKIPPED
[INFO] allcompute ........................................ SKIPPED
[INFO] allblobstore ...................................... SKIPPED
[INFO] allloadbalancer ................................... SKIPPED
[INFO] all ............................................... SKIPPED
[INFO] Apache jclouds .................................... SKIPPED
[INFO] ------------------------------------------------------------------------
[INFO] BUILD FAILURE
[INFO] ------------------------------------------------------------------------
[INFO] Total time: 5:44.049s
[INFO] Finished at: Tue Mar 31 22:36:55 EDT 2015
[INFO] Final Memory: 118M/373M
[INFO] ------------------------------------------------------------------------
[ERROR] Failed to execute goal org.codehaus.mojo:animal-sniffer-maven-plugin:1.11:check (default)
on project filesystem: Failed to obtain signature: org.codehaus.mojo.signature:java17:1.0:
Could not find artifact org.codehaus.mojo.signature:java17:signature:1.0 in central (http://repo.cloudbees.com/content/repositories/central)
[ERROR] 
[ERROR] Try downloading the file manually from the project website.
[ERROR] 
[ERROR] Then, install it using the command:
[ERROR] mvn install:install-file -DgroupId=org.codehaus.mojo.signature -DartifactId=java17
-Dversion=1.0 -Dpackaging=signature -Dfile=/path/to/file
[ERROR] 
[ERROR] Alternatively, if you host your own repository you can deploy the file there:
[ERROR] mvn deploy:deploy-file -DgroupId=org.codehaus.mojo.signature -DartifactId=java17 -Dversion=1.0
-Dpackaging=signature -Dfile=/path/to/file -Durl=[url] -DrepositoryId=[id]
[ERROR] 
[ERROR] 
[ERROR] org.codehaus.mojo.signature:java17:signature:1.0
[ERROR] 
[ERROR] from the specified remote repositories:
[ERROR] central (http://repo.cloudbees.com/content/repositories/central, releases=true, snapshots=false),
[ERROR] cloudbees-private-snapshot-repository (https://repository-jclouds.forge.cloudbees.com/snapshot,
releases=false, snapshots=true),
[ERROR] cloudbees-private-release-repository (https://repository-jclouds.forge.cloudbees.com/release,
releases=true, snapshots=false),
[ERROR] apache-snapshots (https://repository.apache.org/content/repositories/snapshots, releases=false,
snapshots=true),
[ERROR] apache.snapshots (http://repository.apache.org/snapshots, releases=false, snapshots=true)
[ERROR] -> [Help 1]
org.apache.maven.lifecycle.LifecycleExecutionException: Failed to execute goal org.codehaus.mojo:animal-sniffer-maven-plugin:1.11:check
(default) on project filesystem: Failed to obtain signature: org.codehaus.mojo.signature:java17:1.0
	at org.apache.maven.lifecycle.internal.MojoExecutor.execute(MojoExecutor.java:217)
	at org.apache.maven.lifecycle.internal.MojoExecutor.execute(MojoExecutor.java:153)
	at org.apache.maven.lifecycle.internal.MojoExecutor.execute(MojoExecutor.java:145)
	at org.apache.maven.lifecycle.internal.LifecycleModuleBuilder.buildProject(LifecycleModuleBuilder.java:84)
	at org.apache.maven.lifecycle.internal.LifecycleModuleBuilder.buildProject(LifecycleModuleBuilder.java:59)
	at org.apache.maven.lifecycle.internal.LifecycleStarter.singleThreadedBuild(LifecycleStarter.java:183)
	at org.apache.maven.lifecycle.internal.LifecycleStarter.execute(LifecycleStarter.java:161)
	at org.apache.maven.DefaultMaven.doExecute(DefaultMaven.java:320)
	at org.apache.maven.DefaultMaven.execute(DefaultMaven.java:156)
	at org.apache.maven.cli.MavenCli.execute(MavenCli.java:537)
	at org.apache.maven.cli.MavenCli.doMain(MavenCli.java:196)
	at org.apache.maven.cli.MavenCli.main(MavenCli.java:141)
	at sun.reflect.NativeMethodAccessorImpl.invoke0(Native Method)
	at sun.reflect.NativeMethodAccessorImpl.invoke(NativeMethodAccessorImpl.java:57)
	at sun.reflect.DelegatingMethodAccessorImpl.invoke(DelegatingMethodAccessorImpl.java:43)
	at java.lang.reflect.Method.invoke(Method.java:606)
	at org.codehaus.plexus.classworlds.launcher.Launcher.launchEnhanced(Launcher.java:290)
	at org.codehaus.plexus.classworlds.launcher.Launcher.launch(Launcher.java:230)
	at org.codehaus.plexus.classworlds.launcher.Launcher.mainWithExitCode(Launcher.java:409)
	at org.codehaus.plexus.classworlds.launcher.Launcher.main(Launcher.java:352)
Caused by: org.apache.maven.plugin.MojoExecutionException: Failed to obtain signature: org.codehaus.mojo.signature:java17:1.0
	at org.codehaus.mojo.animal_sniffer.maven.CheckSignatureMojo.execute(CheckSignatureMojo.java:210)
	at org.apache.maven.plugin.DefaultBuildPluginManager.executeMojo(DefaultBuildPluginManager.java:101)
	at org.apache.maven.lifecycle.internal.MojoExecutor.execute(MojoExecutor.java:209)
	... 19 more
Caused by: org.apache.maven.artifact.resolver.ArtifactNotFoundException: Could not find artifact
org.codehaus.mojo.signature:java17:signature:1.0 in central (http://repo.cloudbees.com/content/repositories/central)

Try downloading the file manually from the project website.

Then, install it using the command: 
    mvn install:install-file -DgroupId=org.codehaus.mojo.signature -DartifactId=java17 -Dversion=1.0
-Dpackaging=signature -Dfile=/path/to/file

Alternatively, if you host your own repository you can deploy the file there: 
    mvn deploy:deploy-file -DgroupId=org.codehaus.mojo.signature -DartifactId=java17 -Dversion=1.0
-Dpackaging=signature -Dfile=/path/to/file -Durl=[url] -DrepositoryId=[id]


  org.codehaus.mojo.signature:java17:signature:1.0

from the specified remote repositories:
  central (http://repo.cloudbees.com/content/repositories/central, releases=true, snapshots=false),
  cloudbees-private-snapshot-repository (https://repository-jclouds.forge.cloudbees.com/snapshot,
releases=false, snapshots=true),
  cloudbees-private-release-repository (https://repository-jclouds.forge.cloudbees.com/release,
releases=true, snapshots=false),
  apache-snapshots (https://repository.apache.org/content/repositories/snapshots, releases=false,
snapshots=true),
  apache.snapshots (http://repository.apache.org/snapshots, releases=false, snapshots=true)

	at org.apache.maven.artifact.resolver.DefaultArtifactResolver.resolve(DefaultArtifactResolver.java:219)
	at org.apache.maven.artifact.resolver.DefaultArtifactResolver.resolve(DefaultArtifactResolver.java:157)
	at org.apache.maven.artifact.resolver.DefaultArtifactResolver.resolve(DefaultArtifactResolver.java:525)
	at org.codehaus.mojo.animal_sniffer.maven.CheckSignatureMojo.execute(CheckSignatureMojo.java:160)
	... 21 more
Caused by: org.sonatype.aether.resolution.ArtifactResolutionException: Could not find artifact
org.codehaus.mojo.signature:java17:signature:1.0 in central (http://repo.cloudbees.com/content/repositories/central)
	at org.sonatype.aether.impl.internal.DefaultArtifactResolver.resolve(DefaultArtifactResolver.java:538)
	at org.sonatype.aether.impl.internal.DefaultArtifactResolver.resolveArtifacts(DefaultArtifactResolver.java:216)
	at org.sonatype.aether.impl.internal.DefaultArtifactResolver.resolveArtifact(DefaultArtifactResolver.java:193)
	at org.sonatype.aether.impl.internal.DefaultRepositorySystem.resolveArtifact(DefaultRepositorySystem.java:286)
	at org.apache.maven.artifact.resolver.DefaultArtifactResolver.resolve(DefaultArtifactResolver.java:213)
	... 24 more
Caused by: org.sonatype.aether.transfer.ArtifactNotFoundException: Could not find artifact
org.codehaus.mojo.signature:java17:signature:1.0 in central (http://repo.cloudbees.com/content/repositories/central)
	at org.sonatype.aether.connector.wagon.WagonRepositoryConnector$4.wrap(WagonRepositoryConnector.java:947)
	at org.sonatype.aether.connector.wagon.WagonRepositoryConnector$4.wrap(WagonRepositoryConnector.java:941)
	at org.sonatype.aether.connector.wagon.WagonRepositoryConnector$GetTask.run(WagonRepositoryConnector.java:669)
	at org.sonatype.aether.util.concurrency.RunnableErrorForwarder$1.run(RunnableErrorForwarder.java:60)
	at java.util.concurrent.ThreadPoolExecutor.runWorker(ThreadPoolExecutor.java:1145)
	at java.util.concurrent.ThreadPoolExecutor$Worker.run(ThreadPoolExecutor.java:615)
	at java.lang.Thread.run(Thread.java:744)
[ERROR] 
[ERROR] Re-run Maven using the -X switch to enable full debug logging.
[ERROR] 
[ERROR] For more information about the errors and possible solutions, please read the following
articles:
[ERROR] [Help 1] http://cwiki.apache.org/confluence/display/MAVEN/MojoExecutionException
[ERROR] 
[ERROR] After correcting the problems, you can resume the build with the command
[ERROR]   mvn <goals> -rf :filesystem
Build step 'Invoke top-level Maven targets' marked build as failure

Mime
View raw message