jclouds-notifications mailing list archives

Site index · List index
Message view « Date » · « Thread »
Top « Date » · « Thread »
From jenkins-no-re...@cloudbees.com
Subject Build failed in Jenkins: jclouds-labs #856
Date Thu, 02 Apr 2015 09:42:29 GMT
See <https://jclouds.ci.cloudbees.com/job/jclouds-labs/856/changes>

Changes:

[Ignasi Barrera] [JCLOUDS-842] provided support for traffic manager operations

[Ignasi Barrera] [JCLOUDS-837] added service certificate support

------------------------------------------
[...truncated 2226 lines...]
Downloaded: http://repo.cloudbees.com/content/repositories/central/net/schmizz/sshj/0.10.0/sshj-0.10.0.pom
(13 KB at 2.5 KB/sec)
Downloading: http://repo.cloudbees.com/content/repositories/central/org/slf4j/slf4j-api/1.7.7/slf4j-api-1.7.7.pom
Downloaded: http://repo.cloudbees.com/content/repositories/central/org/slf4j/slf4j-api/1.7.7/slf4j-api-1.7.7.pom
(3 KB at 131.3 KB/sec)
Downloading: http://repo.cloudbees.com/content/repositories/central/org/slf4j/slf4j-parent/1.7.7/slf4j-parent-1.7.7.pom
Downloaded: http://repo.cloudbees.com/content/repositories/central/org/slf4j/slf4j-parent/1.7.7/slf4j-parent-1.7.7.pom
(12 KB at 135.2 KB/sec)
Downloading: http://repo.cloudbees.com/content/repositories/central/org/bouncycastle/bcpkix-jdk15on/1.50/bcpkix-jdk15on-1.50.pom
Downloaded: http://repo.cloudbees.com/content/repositories/central/org/bouncycastle/bcpkix-jdk15on/1.50/bcpkix-jdk15on-1.50.pom
(2 KB at 102.7 KB/sec)
Downloading: http://repo.cloudbees.com/content/repositories/central/org/bouncycastle/bcprov-jdk15on/1.50/bcprov-jdk15on-1.50.pom
Downloaded: http://repo.cloudbees.com/content/repositories/central/org/bouncycastle/bcprov-jdk15on/1.50/bcprov-jdk15on-1.50.pom
(2 KB at 51.2 KB/sec)
Downloading: https://repository-jclouds.forge.cloudbees.com/snapshot/net/schmizz/sshj/0.10.1-SNAPSHOT/maven-metadata.xml
Downloading: https://repository.apache.org/content/repositories/snapshots/net/schmizz/sshj/0.10.1-SNAPSHOT/maven-metadata.xml
Downloading: https://oss.sonatype.org/content/repositories/snapshots/net/schmizz/sshj/0.10.1-SNAPSHOT/maven-metadata.xml
Downloading: http://repository.apache.org/snapshots/net/schmizz/sshj/0.10.1-SNAPSHOT/maven-metadata.xml
Downloading: https://oss.sonatype.org/content/repositories/snapshots/net/schmizz/sshj/0.10.1-SNAPSHOT/maven-metadata.xml
Downloaded: https://oss.sonatype.org/content/repositories/snapshots/net/schmizz/sshj/0.10.1-SNAPSHOT/maven-metadata.xml
(2 KB at 15.0 KB/sec)
Downloaded: https://oss.sonatype.org/content/repositories/snapshots/net/schmizz/sshj/0.10.1-SNAPSHOT/maven-metadata.xml
(2 KB at 13.3 KB/sec)
Downloading: https://repository-jclouds.forge.cloudbees.com/snapshot/net/schmizz/sshj/0.10.1-SNAPSHOT/sshj-0.10.1-20140702.063459-1.pom
Downloading: https://repository.apache.org/content/repositories/snapshots/net/schmizz/sshj/0.10.1-SNAPSHOT/sshj-0.10.1-20140702.063459-1.pom
Downloading: https://oss.sonatype.org/content/repositories/snapshots/net/schmizz/sshj/0.10.1-SNAPSHOT/sshj-0.10.1-20140702.063459-1.pom
Downloaded: https://oss.sonatype.org/content/repositories/snapshots/net/schmizz/sshj/0.10.1-SNAPSHOT/sshj-0.10.1-20140702.063459-1.pom
(13 KB at 100.5 KB/sec)
Downloading: http://repo.cloudbees.com/content/repositories/central/com/jcraft/jsch.agentproxy.core/0.0.8/jsch.agentproxy.core-0.0.8.pom
Downloaded: http://repo.cloudbees.com/content/repositories/central/com/jcraft/jsch.agentproxy.core/0.0.8/jsch.agentproxy.core-0.0.8.pom
(804 B at 0.2 KB/sec)
Downloading: http://repo.cloudbees.com/content/repositories/central/com/jcraft/jsch.agentproxy.connector-factory/0.0.8/jsch.agentproxy.connector-factory-0.0.8.pom
Downloaded: http://repo.cloudbees.com/content/repositories/central/com/jcraft/jsch.agentproxy.connector-factory/0.0.8/jsch.agentproxy.connector-factory-0.0.8.pom
(2 KB at 108.3 KB/sec)
Downloading: http://repo.cloudbees.com/content/repositories/central/com/jcraft/jsch.agentproxy.usocket-jna/0.0.8/jsch.agentproxy.usocket-jna-0.0.8.pom
Downloaded: http://repo.cloudbees.com/content/repositories/central/com/jcraft/jsch.agentproxy.usocket-jna/0.0.8/jsch.agentproxy.usocket-jna-0.0.8.pom
(2 KB at 79.8 KB/sec)
Downloading: http://repo.cloudbees.com/content/repositories/central/net/java/dev/jna/jna/4.1.0/jna-4.1.0.pom
Downloaded: http://repo.cloudbees.com/content/repositories/central/net/java/dev/jna/jna/4.1.0/jna-4.1.0.pom
(2 KB at 73.3 KB/sec)
Downloading: http://repo.cloudbees.com/content/repositories/central/net/java/dev/jna/jna-platform/4.1.0/jna-platform-4.1.0.pom
Downloaded: http://repo.cloudbees.com/content/repositories/central/net/java/dev/jna/jna-platform/4.1.0/jna-platform-4.1.0.pom
(2 KB at 97.5 KB/sec)
Downloading: http://repo.cloudbees.com/content/repositories/central/com/jcraft/jsch.agentproxy.usocket-nc/0.0.8/jsch.agentproxy.usocket-nc-0.0.8.pom
Downloaded: http://repo.cloudbees.com/content/repositories/central/com/jcraft/jsch.agentproxy.usocket-nc/0.0.8/jsch.agentproxy.usocket-nc-0.0.8.pom
(996 B at 64.8 KB/sec)
Downloading: http://repo.cloudbees.com/content/repositories/central/com/jcraft/jsch.agentproxy.sshagent/0.0.8/jsch.agentproxy.sshagent-0.0.8.pom
Downloaded: http://repo.cloudbees.com/content/repositories/central/com/jcraft/jsch.agentproxy.sshagent/0.0.8/jsch.agentproxy.sshagent-0.0.8.pom
(971 B at 36.5 KB/sec)
Downloading: http://repo.cloudbees.com/content/repositories/central/com/jcraft/jsch.agentproxy.pageant/0.0.8/jsch.agentproxy.pageant-0.0.8.pom
Downloaded: http://repo.cloudbees.com/content/repositories/central/com/jcraft/jsch.agentproxy.pageant/0.0.8/jsch.agentproxy.pageant-0.0.8.pom
(2 KB at 90.1 KB/sec)
Downloading: http://repo.cloudbees.com/content/repositories/central/com/squareup/okhttp/mockwebserver/2.2.0/mockwebserver-2.2.0.pom
Downloaded: http://repo.cloudbees.com/content/repositories/central/com/squareup/okhttp/mockwebserver/2.2.0/mockwebserver-2.2.0.pom
(2 KB at 98.0 KB/sec)
Downloading: http://repo.cloudbees.com/content/repositories/central/com/squareup/okhttp/parent/2.2.0/parent-2.2.0.pom
Downloaded: http://repo.cloudbees.com/content/repositories/central/com/squareup/okhttp/parent/2.2.0/parent-2.2.0.pom
(9 KB at 375.2 KB/sec)
Downloading: http://repo.cloudbees.com/content/repositories/central/com/squareup/okhttp/okhttp/2.2.0/okhttp-2.2.0.pom
Downloaded: http://repo.cloudbees.com/content/repositories/central/com/squareup/okhttp/okhttp/2.2.0/okhttp-2.2.0.pom
(2 KB at 53.1 KB/sec)
Downloading: http://repo.cloudbees.com/content/repositories/central/com/squareup/okio/okio/1.2.0/okio-1.2.0.pom
Downloaded: http://repo.cloudbees.com/content/repositories/central/com/squareup/okio/okio/1.2.0/okio-1.2.0.pom
(812 B at 36.0 KB/sec)
Downloading: http://repo.cloudbees.com/content/repositories/central/com/squareup/okio/okio-parent/1.2.0/okio-parent-1.2.0.pom
Downloaded: http://repo.cloudbees.com/content/repositories/central/com/squareup/okio/okio-parent/1.2.0/okio-parent-1.2.0.pom
(4 KB at 136.8 KB/sec)
Downloading: http://repo.cloudbees.com/content/repositories/central/com/jamesmurty/utils/java-xmlbuilder/1.1/java-xmlbuilder-1.1.jar
Downloading: http://repo.cloudbees.com/content/repositories/central/net/iharder/base64/2.3.8/base64-2.3.8.jar
Downloading: http://repo.cloudbees.com/content/repositories/central/com/google/auto/service/auto-service/1.0-rc2/auto-service-1.0-rc2.jar
Downloading: http://repo.cloudbees.com/content/repositories/central/com/google/auto/auto-common/0.3/auto-common-0.3.jar
Downloading: http://repo.cloudbees.com/content/repositories/central/com/google/auto/value/auto-value/1.0/auto-value-1.0.jar
Downloaded: http://repo.cloudbees.com/content/repositories/central/com/google/auto/auto-common/0.3/auto-common-0.3.jar
(39 KB at 1057.6 KB/sec)
Downloading: http://repo.cloudbees.com/content/repositories/central/javax/ws/rs/jsr311-api/1.1.1/jsr311-api-1.1.1.jar
Downloaded: http://repo.cloudbees.com/content/repositories/central/net/iharder/base64/2.3.8/base64-2.3.8.jar
(17 KB at 353.4 KB/sec)
Downloading: http://repo.cloudbees.com/content/repositories/central/com/google/inject/extensions/guice-assistedinject/3.0/guice-assistedinject-3.0.jar
Downloaded: http://repo.cloudbees.com/content/repositories/central/com/jamesmurty/utils/java-xmlbuilder/1.1/java-xmlbuilder-1.1.jar
(17 KB at 281.8 KB/sec)
Downloading: http://repo.cloudbees.com/content/repositories/central/com/google/inject/guice/3.0/guice-3.0.jar
Downloaded: http://repo.cloudbees.com/content/repositories/central/com/google/auto/service/auto-service/1.0-rc2/auto-service-1.0-rc2.jar
(11 KB at 163.3 KB/sec)
Downloading: http://repo.cloudbees.com/content/repositories/central/aopalliance/aopalliance/1.0/aopalliance-1.0.jar
Downloaded: http://repo.cloudbees.com/content/repositories/central/com/google/auto/value/auto-value/1.0/auto-value-1.0.jar
(1746 KB at 20776.5 KB/sec)
Downloading: http://repo.cloudbees.com/content/repositories/central/org/99soft/guice/rocoto/6.2/rocoto-6.2.jar
Downloaded: http://repo.cloudbees.com/content/repositories/central/javax/ws/rs/jsr311-api/1.1.1/jsr311-api-1.1.1.jar
(46 KB at 943.3 KB/sec)
Downloading: http://repo.cloudbees.com/content/repositories/central/javax/inject/javax.inject/1/javax.inject-1.jar
Downloaded: http://repo.cloudbees.com/content/repositories/central/aopalliance/aopalliance/1.0/aopalliance-1.0.jar
(5 KB at 101.4 KB/sec)
Downloading: http://repo.cloudbees.com/content/repositories/central/javax/annotation/jsr250-api/1.0/jsr250-api-1.0.jar
Downloaded: http://repo.cloudbees.com/content/repositories/central/com/google/inject/extensions/guice-assistedinject/3.0/guice-assistedinject-3.0.jar
(37 KB at 5.3 KB/sec)
Downloading: http://repo.cloudbees.com/content/repositories/central/com/google/code/gson/gson/2.3/gson-2.3.jar
Downloaded: http://repo.cloudbees.com/content/repositories/central/org/99soft/guice/rocoto/6.2/rocoto-6.2.jar
(48 KB at 6.9 KB/sec)
Downloaded: http://repo.cloudbees.com/content/repositories/central/javax/inject/javax.inject/1/javax.inject-1.jar
(3 KB at 0.4 KB/sec)
Downloaded: http://repo.cloudbees.com/content/repositories/central/com/google/inject/guice/3.0/guice-3.0.jar
(694 KB at 101.3 KB/sec)
Downloaded: http://repo.cloudbees.com/content/repositories/central/javax/annotation/jsr250-api/1.0/jsr250-api-1.0.jar
(6 KB at 0.8 KB/sec)
Downloaded: http://repo.cloudbees.com/content/repositories/central/com/google/code/gson/gson/2.3/gson-2.3.jar
(203 KB at 2433.8 KB/sec)
Downloading: https://repository.apache.org/content/repositories/snapshots/org/apache/jclouds/jclouds-compute/2.0.0-SNAPSHOT/jclouds-compute-2.0.0-20150401.015254-280.jar
Downloading: https://repository.apache.org/content/repositories/snapshots/org/apache/jclouds/jclouds-scriptbuilder/2.0.0-SNAPSHOT/jclouds-scriptbuilder-2.0.0-20150401.015142-281.jar
Downloading: https://repository.apache.org/content/repositories/snapshots/org/apache/jclouds/jclouds-core/2.0.0-SNAPSHOT/jclouds-core-2.0.0-20150401.015030-281.jar
Downloaded: https://repository.apache.org/content/repositories/snapshots/org/apache/jclouds/jclouds-scriptbuilder/2.0.0-SNAPSHOT/jclouds-scriptbuilder-2.0.0-20150401.015142-281.jar
(170 KB at 8.1 KB/sec)
Downloaded: https://repository.apache.org/content/repositories/snapshots/org/apache/jclouds/jclouds-compute/2.0.0-SNAPSHOT/jclouds-compute-2.0.0-20150401.015254-280.jar
(501 KB at 23.9 KB/sec)
Downloaded: https://repository.apache.org/content/repositories/snapshots/org/apache/jclouds/jclouds-core/2.0.0-SNAPSHOT/jclouds-core-2.0.0-20150401.015030-281.jar
(712 KB at 33.3 KB/sec)
Downloading: https://repository.apache.org/content/repositories/snapshots/org/apache/jclouds/driver/jclouds-okhttp/2.0.0-SNAPSHOT/maven-metadata.xml
Downloading: https://repository-jclouds.forge.cloudbees.com/snapshot/org/apache/jclouds/driver/jclouds-okhttp/2.0.0-SNAPSHOT/maven-metadata.xml
Downloading: https://oss.sonatype.org/content/repositories/snapshots/org/apache/jclouds/driver/jclouds-okhttp/2.0.0-SNAPSHOT/maven-metadata.xml
Downloading: http://repository.apache.org/snapshots/org/apache/jclouds/driver/jclouds-okhttp/2.0.0-SNAPSHOT/maven-metadata.xml
Downloaded: https://repository.apache.org/content/repositories/snapshots/org/apache/jclouds/driver/jclouds-okhttp/2.0.0-SNAPSHOT/maven-metadata.xml
(1009 B at 0.1 KB/sec)
Downloaded: http://repository.apache.org/snapshots/org/apache/jclouds/driver/jclouds-okhttp/2.0.0-SNAPSHOT/maven-metadata.xml
(1009 B at 0.1 KB/sec)
Downloading: https://repository-jclouds.forge.cloudbees.com/snapshot/org/apache/jclouds/driver/jclouds-okhttp/2.0.0-SNAPSHOT/jclouds-okhttp-2.0.0-20150401.015923-266.pom
Downloading: https://repository.apache.org/content/repositories/snapshots/org/apache/jclouds/driver/jclouds-okhttp/2.0.0-SNAPSHOT/jclouds-okhttp-2.0.0-20150401.015923-266.pom
Downloaded: https://repository.apache.org/content/repositories/snapshots/org/apache/jclouds/driver/jclouds-okhttp/2.0.0-SNAPSHOT/jclouds-okhttp-2.0.0-20150401.015923-266.pom
(3 KB at 0.1 KB/sec)
Downloading: http://repo.cloudbees.com/content/repositories/central/org/jboss/shrinkwrap/shrinkwrap-depchain/1.2.2/shrinkwrap-depchain-1.2.2.pom
Downloaded: http://repo.cloudbees.com/content/repositories/central/org/jboss/shrinkwrap/shrinkwrap-depchain/1.2.2/shrinkwrap-depchain-1.2.2.pom
(2 KB at 0.4 KB/sec)
Downloading: http://repo.cloudbees.com/content/repositories/central/org/jboss/shrinkwrap/shrinkwrap-parent/1.2.2/shrinkwrap-parent-1.2.2.pom
Downloaded: http://repo.cloudbees.com/content/repositories/central/org/jboss/shrinkwrap/shrinkwrap-parent/1.2.2/shrinkwrap-parent-1.2.2.pom
(11 KB at 258.4 KB/sec)
Downloading: http://repo.cloudbees.com/content/repositories/central/org/jboss/jboss-parent/8/jboss-parent-8.pom
Downloaded: http://repo.cloudbees.com/content/repositories/central/org/jboss/jboss-parent/8/jboss-parent-8.pom
(22 KB at 1420.8 KB/sec)
Downloading: http://repo.cloudbees.com/content/repositories/central/org/jboss/shrinkwrap/shrinkwrap-api/1.2.2/shrinkwrap-api-1.2.2.pom
Downloaded: http://repo.cloudbees.com/content/repositories/central/org/jboss/shrinkwrap/shrinkwrap-api/1.2.2/shrinkwrap-api-1.2.2.pom
(4 KB at 216.1 KB/sec)
Downloading: http://repo.cloudbees.com/content/repositories/central/org/jboss/shrinkwrap/shrinkwrap-spi/1.2.2/shrinkwrap-spi-1.2.2.pom
Downloaded: http://repo.cloudbees.com/content/repositories/central/org/jboss/shrinkwrap/shrinkwrap-spi/1.2.2/shrinkwrap-spi-1.2.2.pom
(2 KB at 88.3 KB/sec)
Downloading: http://repo.cloudbees.com/content/repositories/central/org/jboss/shrinkwrap/shrinkwrap-impl-base/1.2.2/shrinkwrap-impl-base-1.2.2.pom
Downloaded: http://repo.cloudbees.com/content/repositories/central/org/jboss/shrinkwrap/shrinkwrap-impl-base/1.2.2/shrinkwrap-impl-base-1.2.2.pom
(4 KB at 278.7 KB/sec)
Downloading: https://repository.apache.org/content/repositories/snapshots/org/apache/jclouds/driver/jclouds-sshj/2.0.0-SNAPSHOT/jclouds-sshj-2.0.0-20150401.015522-280.jar
Downloading: https://repository.apache.org/content/repositories/snapshots/org/apache/jclouds/driver/jclouds-bouncycastle/2.0.0-SNAPSHOT/jclouds-bouncycastle-2.0.0-20150401.015501-280.jar
Downloading: https://repository.apache.org/content/repositories/snapshots/org/apache/jclouds/driver/jclouds-okhttp/2.0.0-SNAPSHOT/jclouds-okhttp-2.0.0-20150401.015923-266.jar
Downloaded: https://repository.apache.org/content/repositories/snapshots/org/apache/jclouds/driver/jclouds-bouncycastle/2.0.0-SNAPSHOT/jclouds-bouncycastle-2.0.0-20150401.015501-280.jar
(11 KB at 0.6 KB/sec)
Downloaded: https://repository.apache.org/content/repositories/snapshots/org/apache/jclouds/driver/jclouds-sshj/2.0.0-SNAPSHOT/jclouds-sshj-2.0.0-20150401.015522-280.jar
(37 KB at 2.0 KB/sec)
Downloaded: https://repository.apache.org/content/repositories/snapshots/org/apache/jclouds/driver/jclouds-okhttp/2.0.0-SNAPSHOT/jclouds-okhttp-2.0.0-20150401.015923-266.jar
(18 KB at 0.8 KB/sec)
Downloading: http://repo.cloudbees.com/content/repositories/central/net/schmizz/sshj/0.8.1/sshj-0.8.1.jar
Downloading: http://repo.cloudbees.com/content/repositories/central/org/bouncycastle/bcpkix-jdk15on/1.49/bcpkix-jdk15on-1.49.jar
Downloading: http://repo.cloudbees.com/content/repositories/central/com/jcraft/jsch.agentproxy.sshj/0.0.8/jsch.agentproxy.sshj-0.0.8.jar
Downloading: http://repo.cloudbees.com/content/repositories/central/com/jcraft/jsch.agentproxy.core/0.0.8/jsch.agentproxy.core-0.0.8.jar
Downloading: http://repo.cloudbees.com/content/repositories/central/com/jcraft/jsch.agentproxy.connector-factory/0.0.8/jsch.agentproxy.connector-factory-0.0.8.jar
Downloaded: http://repo.cloudbees.com/content/repositories/central/com/jcraft/jsch.agentproxy.core/0.0.8/jsch.agentproxy.core-0.0.8.jar
(10 KB at 3.5 KB/sec)
Downloading: http://repo.cloudbees.com/content/repositories/central/com/jcraft/jsch.agentproxy.usocket-jna/0.0.8/jsch.agentproxy.usocket-jna-0.0.8.jar
Downloaded: http://repo.cloudbees.com/content/repositories/central/com/jcraft/jsch.agentproxy.connector-factory/0.0.8/jsch.agentproxy.connector-factory-0.0.8.jar
(12 KB at 4.4 KB/sec)
Downloading: http://repo.cloudbees.com/content/repositories/central/net/java/dev/jna/jna/4.1.0/jna-4.1.0.jar
Downloaded: http://repo.cloudbees.com/content/repositories/central/com/jcraft/jsch.agentproxy.usocket-jna/0.0.8/jsch.agentproxy.usocket-jna-0.0.8.jar
(7 KB at 339.1 KB/sec)
Downloading: http://repo.cloudbees.com/content/repositories/central/net/java/dev/jna/jna-platform/4.1.0/jna-platform-4.1.0.jar
Downloaded: http://repo.cloudbees.com/content/repositories/central/net/java/dev/jna/jna-platform/4.1.0/jna-platform-4.1.0.jar
(1431 KB at 25537.5 KB/sec)
Downloading: http://repo.cloudbees.com/content/repositories/central/com/jcraft/jsch.agentproxy.usocket-nc/0.0.8/jsch.agentproxy.usocket-nc-0.0.8.jar
Downloaded: http://repo.cloudbees.com/content/repositories/central/net/java/dev/jna/jna/4.1.0/jna-4.1.0.jar
(894 KB at 13134.7 KB/sec)
Downloading: http://repo.cloudbees.com/content/repositories/central/com/jcraft/jsch.agentproxy.sshagent/0.0.8/jsch.agentproxy.sshagent-0.0.8.jar
Downloading: http://repo.cloudbees.com/content/repositories/central/com/jcraft/jsch.agentproxy.pageant/0.0.8/jsch.agentproxy.pageant-0.0.8.jar
Downloading: http://repo.cloudbees.com/content/repositories/central/org/bouncycastle/bcprov-ext-jdk15on/1.49/bcprov-ext-jdk15on-1.49.jar
Downloaded: http://repo.cloudbees.com/content/repositories/central/com/jcraft/jsch.agentproxy.pageant/0.0.8/jsch.agentproxy.pageant-0.0.8.jar
(8 KB at 232.2 KB/sec)
Downloading: http://repo.cloudbees.com/content/repositories/central/com/squareup/okhttp/okhttp/2.2.0/okhttp-2.2.0.jar
Downloading: http://repo.cloudbees.com/content/repositories/central/com/squareup/okio/okio/1.2.0/okio-1.2.0.jar
Downloaded: http://repo.cloudbees.com/content/repositories/central/com/squareup/okio/okio/1.2.0/okio-1.2.0.jar
(54 KB at 2550.5 KB/sec)
Downloading: http://repo.cloudbees.com/content/repositories/central/org/slf4j/slf4j-api/1.7.2/slf4j-api-1.7.2.jar
Downloaded: http://repo.cloudbees.com/content/repositories/central/com/jcraft/jsch.agentproxy.sshagent/0.0.8/jsch.agentproxy.sshagent-0.0.8.jar
(5 KB at 38.4 KB/sec)
Downloaded: http://repo.cloudbees.com/content/repositories/central/com/squareup/okhttp/okhttp/2.2.0/okhttp-2.2.0.jar
(304 KB at 9205.2 KB/sec)
Downloaded: http://repo.cloudbees.com/content/repositories/central/com/jcraft/jsch.agentproxy.usocket-nc/0.0.8/jsch.agentproxy.usocket-nc-0.0.8.jar
(6 KB at 45.2 KB/sec)
Downloaded: http://repo.cloudbees.com/content/repositories/central/org/slf4j/slf4j-api/1.7.2/slf4j-api-1.7.2.jar
(26 KB at 1157.8 KB/sec)
Downloaded: http://repo.cloudbees.com/content/repositories/central/org/bouncycastle/bcprov-ext-jdk15on/1.49/bcprov-ext-jdk15on-1.49.jar
(2493 KB at 34619.8 KB/sec)
Downloading: https://repository-jclouds.forge.cloudbees.com/release/org/bouncycastle/bcpkix-jdk15on/1.49/bcpkix-jdk15on-1.49.jar
Downloading: https://repository-jclouds.forge.cloudbees.com/release/com/jcraft/jsch.agentproxy.sshj/0.0.8/jsch.agentproxy.sshj-0.0.8.jar
Downloading: https://oss.sonatype.org/content/repositories/snapshots/org/bouncycastle/bcpkix-jdk15on/1.49/bcpkix-jdk15on-1.49.jar
Downloading: https://oss.sonatype.org/content/repositories/snapshots/com/jcraft/jsch.agentproxy.sshj/0.0.8/jsch.agentproxy.sshj-0.0.8.jar
Started calculate disk usage of build
Finished Calculation of disk usage of build in 0 seconds
Started calculate disk usage of workspace
Finished Calculation of disk usage of workspace in 0 seconds
[INFO] ------------------------------------------------------------------------
[INFO] Reactor Summary:
[INFO] 
[INFO] Apache jclouds labs ............................... FAILURE [9:03.967s]
[INFO] jclouds azure compute API ......................... SKIPPED
[INFO] jclouds docker API ................................ SKIPPED
[INFO] jclouds cdmi api .................................. SKIPPED
[INFO] jclouds CloudSigma v2 API ......................... SKIPPED
[INFO] jclouds CloudSigma v2 Honolulu Provider ........... SKIPPED
[INFO] jclouds CloudSigma v2 Las Vegas Provider .......... SKIPPED
[INFO] jclouds CloudSigma v2 San Jose Provider ........... SKIPPED
[INFO] jclouds CloudSigma v2 Washington DC Provider ...... SKIPPED
[INFO] jclouds CloudSigma v2 Zurich Provider ............. SKIPPED
[INFO] jclouds DigitalOcean Provider ..................... SKIPPED
[INFO] jclouds joyent-cloudapi api ....................... SKIPPED
[INFO] jclouds joyentcloud provider ...................... SKIPPED
[INFO] jclouds Abiquo api ................................ SKIPPED
[INFO] jclouds ProfitBricks api .......................... SKIPPED
[INFO] jclouds shipyard API .............................. SKIPPED
[INFO] ------------------------------------------------------------------------
[INFO] BUILD FAILURE
[INFO] ------------------------------------------------------------------------
[INFO] Total time: 9:33.492s
[INFO] Finished at: Thu Apr 02 05:42:20 EDT 2015
[INFO] Final Memory: 28M/118M
[INFO] ------------------------------------------------------------------------
Waiting for Jenkins to finish collecting data
[ERROR] Failed to execute goal on project docker: Could not resolve dependencies for project
org.apache.jclouds.labs:docker:bundle:2.0.0-SNAPSHOT: The following artifacts could not be
resolved: net.schmizz:sshj:jar:0.8.1, org.bouncycastle:bcpkix-jdk15on:jar:1.49, com.jcraft:jsch.agentproxy.sshj:jar:0.0.8:
Could not find artifact net.schmizz:sshj:jar:0.8.1 in central (http://repo.cloudbees.com/content/repositories/central)
-> [Help 1]
org.apache.maven.lifecycle.LifecycleExecutionException: Failed to execute goal on project
docker: Could not resolve dependencies for project org.apache.jclouds.labs:docker:bundle:2.0.0-SNAPSHOT:
The following artifacts could not be resolved: net.schmizz:sshj:jar:0.8.1, org.bouncycastle:bcpkix-jdk15on:jar:1.49,
com.jcraft:jsch.agentproxy.sshj:jar:0.0.8: Could not find artifact net.schmizz:sshj:jar:0.8.1
in central (http://repo.cloudbees.com/content/repositories/central)
	at org.apache.maven.lifecycle.internal.LifecycleDependencyResolver.getDependencies(LifecycleDependencyResolver.java:210)
	at org.apache.maven.lifecycle.internal.LifecycleDependencyResolver.resolveProjectDependencies(LifecycleDependencyResolver.java:117)
	at org.apache.maven.lifecycle.internal.MojoExecutor.ensureDependenciesAreResolved(MojoExecutor.java:275)
	at org.apache.maven.lifecycle.internal.MojoExecutor.execute(MojoExecutor.java:201)
	at org.apache.maven.lifecycle.internal.MojoExecutor.execute(MojoExecutor.java:153)
	at org.apache.maven.lifecycle.internal.MojoExecutor.execute(MojoExecutor.java:145)
	at org.apache.maven.lifecycle.internal.LifecycleModuleBuilder.buildProject(LifecycleModuleBuilder.java:84)
	at org.apache.maven.lifecycle.internal.LifecycleModuleBuilder.buildProject(LifecycleModuleBuilder.java:59)
	at org.apache.maven.lifecycle.internal.LifecycleStarter.singleThreadedBuild(LifecycleStarter.java:183)
	at org.apache.maven.lifecycle.internal.LifecycleStarter.execute(LifecycleStarter.java:161)
	at org.apache.maven.DefaultMaven.doExecute(DefaultMaven.java:320)
	at org.apache.maven.DefaultMaven.execute(DefaultMaven.java:156)
	at org.jvnet.hudson.maven3.launcher.Maven3Launcher.main(Maven3Launcher.java:117)
	at sun.reflect.NativeMethodAccessorImpl.invoke0(Native Method)
	at sun.reflect.NativeMethodAccessorImpl.invoke(NativeMethodAccessorImpl.java:57)
	at sun.reflect.DelegatingMethodAccessorImpl.invoke(DelegatingMethodAccessorImpl.java:43)
	at java.lang.reflect.Method.invoke(Method.java:606)
	at org.codehaus.plexus.classworlds.launcher.Launcher.launchStandard(Launcher.java:329)
	at org.codehaus.plexus.classworlds.launcher.Launcher.launch(Launcher.java:239)
	at org.jvnet.hudson.maven3.agent.Maven3Main.launch(Maven3Main.java:178)
	at sun.reflect.NativeMethodAccessorImpl.invoke0(Native Method)
	at sun.reflect.NativeMethodAccessorImpl.invoke(NativeMethodAccessorImpl.java:57)
	at sun.reflect.DelegatingMethodAccessorImpl.invoke(DelegatingMethodAccessorImpl.java:43)
	at java.lang.reflect.Method.invoke(Method.java:606)
	at hudson.maven.Maven3Builder.call(Maven3Builder.java:136)
	at hudson.maven.Maven3Builder.call(Maven3Builder.java:71)
	at hudson.remoting.UserRequest.perform(UserRequest.java:121)
	at hudson.remoting.UserRequest.perform(UserRequest.java:49)
	at hudson.remoting.Request$2.run(Request.java:324)
	at hudson.remoting.InterceptingExecutorService$1.call(InterceptingExecutorService.java:68)
	at java.util.concurrent.FutureTask.run(FutureTask.java:262)
	at java.util.concurrent.ThreadPoolExecutor.runWorker(ThreadPoolExecutor.java:1145)
	at java.util.concurrent.ThreadPoolExecutor$Worker.run(ThreadPoolExecutor.java:615)
	at java.lang.Thread.run(Thread.java:745)
Caused by: org.apache.maven.project.DependencyResolutionException: Could not resolve dependencies
for project org.apache.jclouds.labs:docker:bundle:2.0.0-SNAPSHOT: The following artifacts
could not be resolved: net.schmizz:sshj:jar:0.8.1, org.bouncycastle:bcpkix-jdk15on:jar:1.49,
com.jcraft:jsch.agentproxy.sshj:jar:0.0.8: Could not find artifact net.schmizz:sshj:jar:0.8.1
in central (http://repo.cloudbees.com/content/repositories/central)
	at org.apache.maven.project.DefaultProjectDependenciesResolver.resolve(DefaultProjectDependenciesResolver.java:189)
	at org.apache.maven.lifecycle.internal.LifecycleDependencyResolver.getDependencies(LifecycleDependencyResolver.java:185)
	... 33 more
Caused by: org.sonatype.aether.resolution.DependencyResolutionException: The following artifacts
could not be resolved: net.schmizz:sshj:jar:0.8.1, org.bouncycastle:bcpkix-jdk15on:jar:1.49,
com.jcraft:jsch.agentproxy.sshj:jar:0.0.8: Could not find artifact net.schmizz:sshj:jar:0.8.1
in central (http://repo.cloudbees.com/content/repositories/central)
	at org.sonatype.aether.impl.internal.DefaultRepositorySystem.resolveDependencies(DefaultRepositorySystem.java:375)
	at org.apache.maven.project.DefaultProjectDependenciesResolver.resolve(DefaultProjectDependenciesResolver.java:183)
	... 34 more
Caused by: org.sonatype.aether.resolution.ArtifactResolutionException: The following artifacts
could not be resolved: net.schmizz:sshj:jar:0.8.1, org.bouncycastle:bcpkix-jdk15on:jar:1.49,
com.jcraft:jsch.agentproxy.sshj:jar:0.0.8: Could not find artifact net.schmizz:sshj:jar:0.8.1
in central (http://repo.cloudbees.com/content/repositories/central)
	at org.sonatype.aether.impl.internal.DefaultArtifactResolver.resolve(DefaultArtifactResolver.java:538)
	at org.sonatype.aether.impl.internal.DefaultArtifactResolver.resolveArtifacts(DefaultArtifactResolver.java:216)
	at org.sonatype.aether.impl.internal.DefaultRepositorySystem.resolveDependencies(DefaultRepositorySystem.java:358)
	... 35 more
Caused by: org.sonatype.aether.transfer.ArtifactNotFoundException: Could not find artifact
net.schmizz:sshj:jar:0.8.1 in central (http://repo.cloudbees.com/content/repositories/central)
	at org.sonatype.aether.connector.wagon.WagonRepositoryConnector$4.wrap(WagonRepositoryConnector.java:947)
	at org.sonatype.aether.connector.wagon.WagonRepositoryConnector$4.wrap(WagonRepositoryConnector.java:941)
	at org.sonatype.aether.connector.wagon.WagonRepositoryConnector$GetTask.run(WagonRepositoryConnector.java:669)
	at org.sonatype.aether.util.concurrency.RunnableErrorForwarder$1.run(RunnableErrorForwarder.java:60)
	... 3 more
[ERROR] 
[ERROR] Re-run Maven using the -X switch to enable full debug logging.
[ERROR] 
[ERROR] For more information about the errors and possible solutions, please read the following
articles:
[ERROR] [Help 1] http://cwiki.apache.org/confluence/display/MAVEN/DependencyResolutionException
[ERROR] 
[ERROR] After correcting the problems, you can resume the build with the command
[ERROR]   mvn <goals> -rf :docker
[JENKINS] Archiving <https://jclouds.ci.cloudbees.com/job/jclouds-labs/ws/cloudsigma2/pom.xml>
to org.apache.jclouds.labs/cloudsigma2/2.0.0-SNAPSHOT/cloudsigma2-2.0.0-SNAPSHOT.pom
[JENKINS] Archiving <https://jclouds.ci.cloudbees.com/job/jclouds-labs/ws/cloudsigma2-zrh/pom.xml>
to org.apache.jclouds.labs/cloudsigma2-zrh/2.0.0-SNAPSHOT/cloudsigma2-zrh-2.0.0-SNAPSHOT.pom
[JENKINS] Archiving <https://jclouds.ci.cloudbees.com/job/jclouds-labs/ws/joyent-cloudapi/pom.xml>
to org.apache.jclouds.labs/joyent-cloudapi/2.0.0-SNAPSHOT/joyent-cloudapi-2.0.0-SNAPSHOT.pom
[JENKINS] Archiving <https://jclouds.ci.cloudbees.com/job/jclouds-labs/ws/pom.xml> to
org.apache.jclouds.labs/jclouds-labs/2.0.0-SNAPSHOT/jclouds-labs-2.0.0-SNAPSHOT.pom
[JENKINS] Archiving <https://jclouds.ci.cloudbees.com/job/jclouds-labs/ws/target/jclouds-labs-2.0.0-SNAPSHOT-tests.jar>
to org.apache.jclouds.labs/jclouds-labs/2.0.0-SNAPSHOT/jclouds-labs-2.0.0-SNAPSHOT-tests.jar
[JENKINS] Archiving <https://jclouds.ci.cloudbees.com/job/jclouds-labs/ws/docker/pom.xml>
to org.apache.jclouds.labs/docker/2.0.0-SNAPSHOT/docker-2.0.0-SNAPSHOT.pom
[JENKINS] Archiving <https://jclouds.ci.cloudbees.com/job/jclouds-labs/ws/cloudsigma2-wdc/pom.xml>
to org.apache.jclouds.labs/cloudsigma2-wdc/2.0.0-SNAPSHOT/cloudsigma2-wdc-2.0.0-SNAPSHOT.pom
[JENKINS] Archiving <https://jclouds.ci.cloudbees.com/job/jclouds-labs/ws/profitbricks/pom.xml>
to org.apache.jclouds.labs/profitbricks/2.0.0-SNAPSHOT/profitbricks-2.0.0-SNAPSHOT.pom
[JENKINS] Archiving <https://jclouds.ci.cloudbees.com/job/jclouds-labs/ws/cloudsigma2-sjc/pom.xml>
to org.apache.jclouds.labs/cloudsigma2-sjc/2.0.0-SNAPSHOT/cloudsigma2-sjc-2.0.0-SNAPSHOT.pom
[JENKINS] Archiving <https://jclouds.ci.cloudbees.com/job/jclouds-labs/ws/digitalocean/pom.xml>
to org.apache.jclouds.labs/digitalocean/2.0.0-SNAPSHOT/digitalocean-2.0.0-SNAPSHOT.pom
[JENKINS] Archiving <https://jclouds.ci.cloudbees.com/job/jclouds-labs/ws/azurecompute/pom.xml>
to org.apache.jclouds.labs/azurecompute/2.0.0-SNAPSHOT/azurecompute-2.0.0-SNAPSHOT.pom
[JENKINS] Archiving <https://jclouds.ci.cloudbees.com/job/jclouds-labs/ws/joyentcloud/pom.xml>
to org.apache.jclouds.labs/joyentcloud/2.0.0-SNAPSHOT/joyentcloud-2.0.0-SNAPSHOT.pom
[JENKINS] Archiving <https://jclouds.ci.cloudbees.com/job/jclouds-labs/ws/shipyard/pom.xml>
to org.apache.jclouds.labs/shipyard/2.0.0-SNAPSHOT/shipyard-2.0.0-SNAPSHOT.pom
[JENKINS] Archiving <https://jclouds.ci.cloudbees.com/job/jclouds-labs/ws/cloudsigma2-lvs/pom.xml>
to org.apache.jclouds.labs/cloudsigma2-lvs/2.0.0-SNAPSHOT/cloudsigma2-lvs-2.0.0-SNAPSHOT.pom
[JENKINS] Archiving <https://jclouds.ci.cloudbees.com/job/jclouds-labs/ws/abiquo/pom.xml>
to org.apache.jclouds.labs/abiquo/2.0.0-SNAPSHOT/abiquo-2.0.0-SNAPSHOT.pom
[JENKINS] Archiving <https://jclouds.ci.cloudbees.com/job/jclouds-labs/ws/cloudsigma2-hnl/pom.xml>
to org.apache.jclouds.labs/cloudsigma2-hnl/2.0.0-SNAPSHOT/cloudsigma2-hnl-2.0.0-SNAPSHOT.pom
[JENKINS] Archiving <https://jclouds.ci.cloudbees.com/job/jclouds-labs/ws/cdmi/pom.xml>
to org.apache.jclouds.labs/cdmi/2.0.0-SNAPSHOT/cdmi-2.0.0-SNAPSHOT.pom
Sending e-mails to: notifications@jclouds.apache.org
channel stopped

Mime
View raw message