jclouds-notifications mailing list archives

Site index · List index
Message view « Date » · « Thread »
Top « Date » · « Thread »
From jenkins-no-re...@cloudbees.com
Subject Build failed in Jenkins: jclouds-labs-google #530
Date Wed, 01 Apr 2015 13:52:17 GMT
See <https://jclouds.ci.cloudbees.com/job/jclouds-labs-google/530/changes>

Changes:

[Andrew Gaul] Make deleteObject() return false on 404 response

------------------------------------------
[...truncated 2136 lines...]
Downloaded: http://repo.cloudbees.com/content/repositories/central/com/google/inject/extensions/guice-assistedinject/3.0/guice-assistedinject-3.0.jar
(37 KB at 6.6 KB/sec)
Downloaded: http://repo.cloudbees.com/content/repositories/central/com/google/code/gson/gson/2.3/gson-2.3.jar
(203 KB at 1063.2 KB/sec)
Downloaded: http://repo.cloudbees.com/content/repositories/central/com/google/auto/value/auto-value/1.0/auto-value-1.0.jar
(1746 KB at 5759.8 KB/sec)
Downloading: https://repository-jclouds.forge.cloudbees.com/snapshot/org/apache/jclouds/labs/oauth/2.0.0-SNAPSHOT/maven-metadata.xml
Downloading: https://repository.apache.org/content/repositories/snapshots/org/apache/jclouds/labs/oauth/2.0.0-SNAPSHOT/maven-metadata.xml
Downloading: http://repository.apache.org/snapshots/org/apache/jclouds/labs/oauth/2.0.0-SNAPSHOT/maven-metadata.xml
Downloaded: http://repository.apache.org/snapshots/org/apache/jclouds/labs/oauth/2.0.0-SNAPSHOT/maven-metadata.xml
(2 KB at 4.0 KB/sec)
Downloaded: https://repository.apache.org/content/repositories/snapshots/org/apache/jclouds/labs/oauth/2.0.0-SNAPSHOT/maven-metadata.xml
(2 KB at 4.0 KB/sec)
Downloading: https://repository-jclouds.forge.cloudbees.com/snapshot/org/apache/jclouds/labs/oauth/2.0.0-SNAPSHOT/oauth-2.0.0-20150401.023900-305.pom
Downloading: https://repository.apache.org/content/repositories/snapshots/org/apache/jclouds/labs/oauth/2.0.0-SNAPSHOT/oauth-2.0.0-20150401.023900-305.pom
Downloaded: https://repository.apache.org/content/repositories/snapshots/org/apache/jclouds/labs/oauth/2.0.0-SNAPSHOT/oauth-2.0.0-20150401.023900-305.pom
(5 KB at 19.7 KB/sec)
Downloading: https://repository.apache.org/content/repositories/snapshots/org/apache/jclouds/labs/oauth/2.0.0-SNAPSHOT/oauth-2.0.0-20150401.023900-305.jar
Downloaded: https://repository.apache.org/content/repositories/snapshots/org/apache/jclouds/labs/oauth/2.0.0-SNAPSHOT/oauth-2.0.0-20150401.023900-305.jar
(33 KB at 84.8 KB/sec)
Downloading: https://repository-jclouds.forge.cloudbees.com/snapshot/org/apache/jclouds/labs/googlecloud/2.0.0-SNAPSHOT/maven-metadata.xml
Downloading: https://repository.apache.org/content/repositories/snapshots/org/apache/jclouds/labs/googlecloud/2.0.0-SNAPSHOT/maven-metadata.xml
Downloading: http://repository.apache.org/snapshots/org/apache/jclouds/labs/googlecloud/2.0.0-SNAPSHOT/maven-metadata.xml
Downloaded: http://repository.apache.org/snapshots/org/apache/jclouds/labs/googlecloud/2.0.0-SNAPSHOT/maven-metadata.xml
(2 KB at 5.9 KB/sec)
Downloaded: https://repository.apache.org/content/repositories/snapshots/org/apache/jclouds/labs/googlecloud/2.0.0-SNAPSHOT/maven-metadata.xml
(2 KB at 5.9 KB/sec)
Downloading: https://repository-jclouds.forge.cloudbees.com/snapshot/org/apache/jclouds/labs/googlecloud/2.0.0-SNAPSHOT/googlecloud-2.0.0-20150401.023916-171.pom
Downloading: https://repository.apache.org/content/repositories/snapshots/org/apache/jclouds/labs/googlecloud/2.0.0-SNAPSHOT/googlecloud-2.0.0-20150401.023916-171.pom
Downloaded: https://repository.apache.org/content/repositories/snapshots/org/apache/jclouds/labs/googlecloud/2.0.0-SNAPSHOT/googlecloud-2.0.0-20150401.023916-171.pom
(3 KB at 10.7 KB/sec)
Downloading: https://repository-jclouds.forge.cloudbees.com/snapshot/org/apache/jclouds/jclouds-compute/2.0.0-SNAPSHOT/maven-metadata.xml
Downloading: http://repository.apache.org/snapshots/org/apache/jclouds/jclouds-compute/2.0.0-SNAPSHOT/maven-metadata.xml
Downloading: https://repository.apache.org/content/repositories/snapshots/org/apache/jclouds/jclouds-compute/2.0.0-SNAPSHOT/maven-metadata.xml
Downloaded: https://repository.apache.org/content/repositories/snapshots/org/apache/jclouds/jclouds-compute/2.0.0-SNAPSHOT/maven-metadata.xml
(1003 B at 2.7 KB/sec)
Downloaded: http://repository.apache.org/snapshots/org/apache/jclouds/jclouds-compute/2.0.0-SNAPSHOT/maven-metadata.xml
(1003 B at 2.7 KB/sec)
Downloading: https://repository-jclouds.forge.cloudbees.com/snapshot/org/apache/jclouds/jclouds-compute/2.0.0-SNAPSHOT/jclouds-compute-2.0.0-20150401.015254-280.pom
Downloading: https://repository.apache.org/content/repositories/snapshots/org/apache/jclouds/jclouds-compute/2.0.0-SNAPSHOT/jclouds-compute-2.0.0-20150401.015254-280.pom
Downloaded: https://repository.apache.org/content/repositories/snapshots/org/apache/jclouds/jclouds-compute/2.0.0-SNAPSHOT/jclouds-compute-2.0.0-20150401.015254-280.pom
(3 KB at 3.2 KB/sec)
Downloading: https://repository-jclouds.forge.cloudbees.com/snapshot/org/apache/jclouds/jclouds-scriptbuilder/2.0.0-SNAPSHOT/maven-metadata.xml
Downloading: https://repository.apache.org/content/repositories/snapshots/org/apache/jclouds/jclouds-scriptbuilder/2.0.0-SNAPSHOT/maven-metadata.xml
Downloading: http://repository.apache.org/snapshots/org/apache/jclouds/jclouds-scriptbuilder/2.0.0-SNAPSHOT/maven-metadata.xml
Downloaded: https://repository.apache.org/content/repositories/snapshots/org/apache/jclouds/jclouds-scriptbuilder/2.0.0-SNAPSHOT/maven-metadata.xml
(1009 B at 0.7 KB/sec)
Downloaded: http://repository.apache.org/snapshots/org/apache/jclouds/jclouds-scriptbuilder/2.0.0-SNAPSHOT/maven-metadata.xml
(1009 B at 0.2 KB/sec)
Downloading: https://repository-jclouds.forge.cloudbees.com/snapshot/org/apache/jclouds/jclouds-scriptbuilder/2.0.0-SNAPSHOT/jclouds-scriptbuilder-2.0.0-20150401.015142-281.pom
Downloading: https://repository.apache.org/content/repositories/snapshots/org/apache/jclouds/jclouds-scriptbuilder/2.0.0-SNAPSHOT/jclouds-scriptbuilder-2.0.0-20150401.015142-281.pom
Downloaded: https://repository.apache.org/content/repositories/snapshots/org/apache/jclouds/jclouds-scriptbuilder/2.0.0-SNAPSHOT/jclouds-scriptbuilder-2.0.0-20150401.015142-281.pom
(4 KB at 4.2 KB/sec)
Downloading: http://repo.cloudbees.com/content/repositories/central/com/google/auto/service/auto-service/1.0-rc2/auto-service-1.0-rc2.pom
Downloaded: http://repo.cloudbees.com/content/repositories/central/com/google/auto/service/auto-service/1.0-rc2/auto-service-1.0-rc2.pom
(3 KB at 47.1 KB/sec)
Downloading: http://repo.cloudbees.com/content/repositories/central/com/google/auto/auto-common/0.3/auto-common-0.3.pom
Downloaded: http://repo.cloudbees.com/content/repositories/central/com/google/auto/auto-common/0.3/auto-common-0.3.pom
(3 KB at 52.2 KB/sec)
Downloading: https://repository.apache.org/content/repositories/snapshots/org/apache/jclouds/driver/jclouds-sshj/2.0.0-SNAPSHOT/maven-metadata.xml
Downloading: http://repository.apache.org/snapshots/org/apache/jclouds/driver/jclouds-sshj/2.0.0-SNAPSHOT/maven-metadata.xml
Downloading: https://repository-jclouds.forge.cloudbees.com/snapshot/org/apache/jclouds/driver/jclouds-sshj/2.0.0-SNAPSHOT/maven-metadata.xml
Downloaded: https://repository.apache.org/content/repositories/snapshots/org/apache/jclouds/driver/jclouds-sshj/2.0.0-SNAPSHOT/maven-metadata.xml
(1007 B at 3.2 KB/sec)
Downloaded: http://repository.apache.org/snapshots/org/apache/jclouds/driver/jclouds-sshj/2.0.0-SNAPSHOT/maven-metadata.xml
(1007 B at 1.2 KB/sec)
Downloading: https://repository-jclouds.forge.cloudbees.com/snapshot/org/apache/jclouds/driver/jclouds-sshj/2.0.0-SNAPSHOT/jclouds-sshj-2.0.0-20150401.015522-280.pom
Downloading: https://repository.apache.org/content/repositories/snapshots/org/apache/jclouds/driver/jclouds-sshj/2.0.0-SNAPSHOT/jclouds-sshj-2.0.0-20150401.015522-280.pom
Downloaded: https://repository.apache.org/content/repositories/snapshots/org/apache/jclouds/driver/jclouds-sshj/2.0.0-SNAPSHOT/jclouds-sshj-2.0.0-20150401.015522-280.pom
(6 KB at 23.9 KB/sec)
Downloading: https://oss.sonatype.org/content/repositories/snapshots/org/apache/jclouds/driver/jclouds-bouncycastle/2.0.0-SNAPSHOT/maven-metadata.xml
Downloading: https://repository.apache.org/content/repositories/snapshots/org/apache/jclouds/driver/jclouds-bouncycastle/2.0.0-SNAPSHOT/maven-metadata.xml
Downloading: http://repository.apache.org/snapshots/org/apache/jclouds/driver/jclouds-bouncycastle/2.0.0-SNAPSHOT/maven-metadata.xml
Downloading: https://repository-jclouds.forge.cloudbees.com/snapshot/org/apache/jclouds/driver/jclouds-bouncycastle/2.0.0-SNAPSHOT/maven-metadata.xml
Downloaded: https://repository.apache.org/content/repositories/snapshots/org/apache/jclouds/driver/jclouds-bouncycastle/2.0.0-SNAPSHOT/maven-metadata.xml
(1015 B at 4.1 KB/sec)
Downloaded: http://repository.apache.org/snapshots/org/apache/jclouds/driver/jclouds-bouncycastle/2.0.0-SNAPSHOT/maven-metadata.xml
(1015 B at 0.3 KB/sec)
Downloading: https://repository-jclouds.forge.cloudbees.com/snapshot/org/apache/jclouds/driver/jclouds-bouncycastle/2.0.0-SNAPSHOT/jclouds-bouncycastle-2.0.0-20150401.015501-280.pom
Downloading: https://repository.apache.org/content/repositories/snapshots/org/apache/jclouds/driver/jclouds-bouncycastle/2.0.0-SNAPSHOT/jclouds-bouncycastle-2.0.0-20150401.015501-280.pom
Downloaded: https://repository.apache.org/content/repositories/snapshots/org/apache/jclouds/driver/jclouds-bouncycastle/2.0.0-SNAPSHOT/jclouds-bouncycastle-2.0.0-20150401.015501-280.pom
(3 KB at 4.3 KB/sec)
Downloading: http://repo.cloudbees.com/content/repositories/central/org/bouncycastle/bcprov-ext-jdk15on/1.49/bcprov-ext-jdk15on-1.49.pom
Downloaded: http://repo.cloudbees.com/content/repositories/central/org/bouncycastle/bcprov-ext-jdk15on/1.49/bcprov-ext-jdk15on-1.49.pom
(2 KB at 0.2 KB/sec)
Downloading: http://repo.cloudbees.com/content/repositories/central/net/schmizz/sshj/0.8.1/sshj-0.8.1.pom
Downloaded: http://repo.cloudbees.com/content/repositories/central/net/schmizz/sshj/0.8.1/sshj-0.8.1.pom
(10 KB at 101.3 KB/sec)
Downloading: http://repo.cloudbees.com/content/repositories/central/org/slf4j/slf4j-api/1.6.1/slf4j-api-1.6.1.pom
Downloaded: http://repo.cloudbees.com/content/repositories/central/org/slf4j/slf4j-api/1.6.1/slf4j-api-1.6.1.pom
(3 KB at 243.7 KB/sec)
Downloading: http://repo.cloudbees.com/content/repositories/central/org/slf4j/slf4j-parent/1.6.1/slf4j-parent-1.6.1.pom
Downloaded: http://repo.cloudbees.com/content/repositories/central/org/slf4j/slf4j-parent/1.6.1/slf4j-parent-1.6.1.pom
(10 KB at 700.3 KB/sec)
Downloading: http://repo.cloudbees.com/content/repositories/central/org/bouncycastle/bcpkix-jdk15on/1.49/bcpkix-jdk15on-1.49.pom
Downloaded: http://repo.cloudbees.com/content/repositories/central/org/bouncycastle/bcpkix-jdk15on/1.49/bcpkix-jdk15on-1.49.pom
(2 KB at 40.1 KB/sec)
Downloading: http://repo.cloudbees.com/content/repositories/central/com/jcraft/jsch.agentproxy.sshj/0.0.8/jsch.agentproxy.sshj-0.0.8.pom
Downloaded: http://repo.cloudbees.com/content/repositories/central/com/jcraft/jsch.agentproxy.sshj/0.0.8/jsch.agentproxy.sshj-0.0.8.pom
(2 KB at 11.8 KB/sec)
Downloading: http://repo.cloudbees.com/content/repositories/central/com/jcraft/jsch.agentproxy/0.0.8/jsch.agentproxy-0.0.8.pom
Downloaded: http://repo.cloudbees.com/content/repositories/central/com/jcraft/jsch.agentproxy/0.0.8/jsch.agentproxy-0.0.8.pom
(5 KB at 74.5 KB/sec)
Downloading: http://repo.cloudbees.com/content/repositories/central/org/sonatype/oss/oss-parent/6/oss-parent-6.pom
Downloaded: http://repo.cloudbees.com/content/repositories/central/org/sonatype/oss/oss-parent/6/oss-parent-6.pom
(5 KB at 362.9 KB/sec)
Downloading: http://repo.cloudbees.com/content/repositories/central/net/schmizz/sshj/maven-metadata.xml
Downloading: https://repository-jclouds.forge.cloudbees.com/snapshot/net/schmizz/sshj/maven-metadata.xml
Downloading: https://repository.apache.org/content/repositories/snapshots/net/schmizz/sshj/maven-metadata.xml
Downloading: https://repository-jclouds.forge.cloudbees.com/release/net/schmizz/sshj/maven-metadata.xml
Downloading: http://repository.apache.org/snapshots/net/schmizz/sshj/maven-metadata.xml
Downloading: https://oss.sonatype.org/content/repositories/snapshots/net/schmizz/sshj/maven-metadata.xml
Downloaded: http://repo.cloudbees.com/content/repositories/central/net/schmizz/sshj/maven-metadata.xml
(790 B at 8.6 KB/sec)
Downloading: https://oss.sonatype.org/content/repositories/snapshots/net/schmizz/sshj/maven-metadata.xml
Downloaded: https://oss.sonatype.org/content/repositories/snapshots/net/schmizz/sshj/maven-metadata.xml
(398 B at 1.4 KB/sec)
Downloaded: https://oss.sonatype.org/content/repositories/snapshots/net/schmizz/sshj/maven-metadata.xml
(398 B at 1.2 KB/sec)
Downloading: http://repo.cloudbees.com/content/repositories/central/net/schmizz/sshj/0.9.0/sshj-0.9.0.pom
Downloaded: http://repo.cloudbees.com/content/repositories/central/net/schmizz/sshj/0.9.0/sshj-0.9.0.pom
(9 KB at 166.3 KB/sec)
Downloading: http://repo.cloudbees.com/content/repositories/central/org/slf4j/slf4j-api/1.7.5/slf4j-api-1.7.5.pom
Downloaded: http://repo.cloudbees.com/content/repositories/central/org/slf4j/slf4j-api/1.7.5/slf4j-api-1.7.5.pom
(3 KB at 202.0 KB/sec)
Downloading: http://repo.cloudbees.com/content/repositories/central/org/slf4j/slf4j-parent/1.7.5/slf4j-parent-1.7.5.pom
Downloaded: http://repo.cloudbees.com/content/repositories/central/org/slf4j/slf4j-parent/1.7.5/slf4j-parent-1.7.5.pom
(12 KB at 886.7 KB/sec)
Downloading: http://repo.cloudbees.com/content/repositories/central/org/bouncycastle/bcprov-jdk15on/1.49/bcprov-jdk15on-1.49.pom
Downloaded: http://repo.cloudbees.com/content/repositories/central/org/bouncycastle/bcprov-jdk15on/1.49/bcprov-jdk15on-1.49.pom
(2 KB at 14.6 KB/sec)
Downloading: https://repository-jclouds.forge.cloudbees.com/snapshot/net/schmizz/sshj/0.9.1-SNAPSHOT/maven-metadata.xml
Downloading: https://repository.apache.org/content/repositories/snapshots/net/schmizz/sshj/0.9.1-SNAPSHOT/maven-metadata.xml
Downloading: https://oss.sonatype.org/content/repositories/snapshots/net/schmizz/sshj/0.9.1-SNAPSHOT/maven-metadata.xml
Downloading: http://repository.apache.org/snapshots/net/schmizz/sshj/0.9.1-SNAPSHOT/maven-metadata.xml
Downloading: https://oss.sonatype.org/content/repositories/snapshots/net/schmizz/sshj/0.9.1-SNAPSHOT/maven-metadata.xml
Downloaded: https://oss.sonatype.org/content/repositories/snapshots/net/schmizz/sshj/0.9.1-SNAPSHOT/maven-metadata.xml
(2 KB at 11.5 KB/sec)
Downloaded: https://oss.sonatype.org/content/repositories/snapshots/net/schmizz/sshj/0.9.1-SNAPSHOT/maven-metadata.xml
(2 KB at 11.7 KB/sec)
Downloading: https://repository-jclouds.forge.cloudbees.com/snapshot/net/schmizz/sshj/0.9.1-SNAPSHOT/sshj-0.9.1-20130812.023717-1.pom
Downloading: https://repository.apache.org/content/repositories/snapshots/net/schmizz/sshj/0.9.1-SNAPSHOT/sshj-0.9.1-20130812.023717-1.pom
Downloading: http://repository.apache.org/snapshots/net/schmizz/sshj/0.9.1-SNAPSHOT/sshj-0.9.1-20130812.023717-1.pom
Downloading: https://oss.sonatype.org/content/repositories/snapshots/net/schmizz/sshj/0.9.1-SNAPSHOT/sshj-0.9.1-20130812.023717-1.pom
Downloaded: https://oss.sonatype.org/content/repositories/snapshots/net/schmizz/sshj/0.9.1-SNAPSHOT/sshj-0.9.1-20130812.023717-1.pom
(9 KB at 95.9 KB/sec)
Downloading: http://repo.cloudbees.com/content/repositories/central/net/schmizz/sshj/0.10.0/sshj-0.10.0.pom
Downloaded: http://repo.cloudbees.com/content/repositories/central/net/schmizz/sshj/0.10.0/sshj-0.10.0.pom
(13 KB at 2.1 KB/sec)
Downloading: http://repo.cloudbees.com/content/repositories/central/org/slf4j/slf4j-api/1.7.7/slf4j-api-1.7.7.pom
Downloaded: http://repo.cloudbees.com/content/repositories/central/org/slf4j/slf4j-api/1.7.7/slf4j-api-1.7.7.pom
(3 KB at 25.2 KB/sec)
Downloading: http://repo.cloudbees.com/content/repositories/central/org/slf4j/slf4j-parent/1.7.7/slf4j-parent-1.7.7.pom
Downloaded: http://repo.cloudbees.com/content/repositories/central/org/slf4j/slf4j-parent/1.7.7/slf4j-parent-1.7.7.pom
(12 KB at 775.2 KB/sec)
Downloading: http://repo.cloudbees.com/content/repositories/central/org/bouncycastle/bcpkix-jdk15on/1.50/bcpkix-jdk15on-1.50.pom
Downloaded: http://repo.cloudbees.com/content/repositories/central/org/bouncycastle/bcpkix-jdk15on/1.50/bcpkix-jdk15on-1.50.pom
(2 KB at 21.2 KB/sec)
Downloading: https://repository-jclouds.forge.cloudbees.com/snapshot/net/schmizz/sshj/0.10.1-SNAPSHOT/maven-metadata.xml
Downloading: https://repository.apache.org/content/repositories/snapshots/net/schmizz/sshj/0.10.1-SNAPSHOT/maven-metadata.xml
Downloading: http://repository.apache.org/snapshots/net/schmizz/sshj/0.10.1-SNAPSHOT/maven-metadata.xml
Downloading: https://oss.sonatype.org/content/repositories/snapshots/net/schmizz/sshj/0.10.1-SNAPSHOT/maven-metadata.xml
Downloading: https://oss.sonatype.org/content/repositories/snapshots/net/schmizz/sshj/0.10.1-SNAPSHOT/maven-metadata.xml
Downloaded: https://oss.sonatype.org/content/repositories/snapshots/net/schmizz/sshj/0.10.1-SNAPSHOT/maven-metadata.xml
(2 KB at 14.1 KB/sec)
Downloaded: https://oss.sonatype.org/content/repositories/snapshots/net/schmizz/sshj/0.10.1-SNAPSHOT/maven-metadata.xml
(2 KB at 14.2 KB/sec)
Downloading: https://repository-jclouds.forge.cloudbees.com/snapshot/net/schmizz/sshj/0.10.1-SNAPSHOT/sshj-0.10.1-20140702.063459-1.pom
Downloading: https://repository.apache.org/content/repositories/snapshots/net/schmizz/sshj/0.10.1-SNAPSHOT/sshj-0.10.1-20140702.063459-1.pom
Downloading: http://repository.apache.org/snapshots/net/schmizz/sshj/0.10.1-SNAPSHOT/sshj-0.10.1-20140702.063459-1.pom
Downloading: https://oss.sonatype.org/content/repositories/snapshots/net/schmizz/sshj/0.10.1-SNAPSHOT/sshj-0.10.1-20140702.063459-1.pom
Downloaded: https://oss.sonatype.org/content/repositories/snapshots/net/schmizz/sshj/0.10.1-SNAPSHOT/sshj-0.10.1-20140702.063459-1.pom
(13 KB at 95.9 KB/sec)
Downloading: http://repo.cloudbees.com/content/repositories/central/com/jcraft/jsch.agentproxy.core/0.0.8/jsch.agentproxy.core-0.0.8.pom
Downloaded: http://repo.cloudbees.com/content/repositories/central/com/jcraft/jsch.agentproxy.core/0.0.8/jsch.agentproxy.core-0.0.8.pom
(804 B at 8.8 KB/sec)
Downloading: http://repo.cloudbees.com/content/repositories/central/com/jcraft/jsch.agentproxy.connector-factory/0.0.8/jsch.agentproxy.connector-factory-0.0.8.pom
Downloaded: http://repo.cloudbees.com/content/repositories/central/com/jcraft/jsch.agentproxy.connector-factory/0.0.8/jsch.agentproxy.connector-factory-0.0.8.pom
(2 KB at 11.6 KB/sec)
Downloading: http://repo.cloudbees.com/content/repositories/central/com/jcraft/jsch.agentproxy.usocket-jna/0.0.8/jsch.agentproxy.usocket-jna-0.0.8.pom
Downloaded: http://repo.cloudbees.com/content/repositories/central/com/jcraft/jsch.agentproxy.usocket-jna/0.0.8/jsch.agentproxy.usocket-jna-0.0.8.pom
(2 KB at 0.2 KB/sec)
Downloading: http://repo.cloudbees.com/content/repositories/central/net/java/dev/jna/jna/4.1.0/jna-4.1.0.pom
Downloaded: http://repo.cloudbees.com/content/repositories/central/net/java/dev/jna/jna/4.1.0/jna-4.1.0.pom
(2 KB at 73.3 KB/sec)
Downloading: http://repo.cloudbees.com/content/repositories/central/net/java/dev/jna/jna-platform/4.1.0/jna-platform-4.1.0.pom
Downloaded: http://repo.cloudbees.com/content/repositories/central/net/java/dev/jna/jna-platform/4.1.0/jna-platform-4.1.0.pom
(2 KB at 22.2 KB/sec)
Downloading: http://repo.cloudbees.com/content/repositories/central/com/jcraft/jsch.agentproxy.usocket-nc/0.0.8/jsch.agentproxy.usocket-nc-0.0.8.pom
Downloaded: http://repo.cloudbees.com/content/repositories/central/com/jcraft/jsch.agentproxy.usocket-nc/0.0.8/jsch.agentproxy.usocket-nc-0.0.8.pom
(996 B at 12.3 KB/sec)
Downloading: http://repo.cloudbees.com/content/repositories/central/com/jcraft/jsch.agentproxy.sshagent/0.0.8/jsch.agentproxy.sshagent-0.0.8.pom
Downloaded: http://repo.cloudbees.com/content/repositories/central/com/jcraft/jsch.agentproxy.sshagent/0.0.8/jsch.agentproxy.sshagent-0.0.8.pom
(971 B at 10.8 KB/sec)
Downloading: http://repo.cloudbees.com/content/repositories/central/com/jcraft/jsch.agentproxy.pageant/0.0.8/jsch.agentproxy.pageant-0.0.8.pom
Downloaded: http://repo.cloudbees.com/content/repositories/central/com/jcraft/jsch.agentproxy.pageant/0.0.8/jsch.agentproxy.pageant-0.0.8.pom
(2 KB at 14.8 KB/sec)
Downloading: https://repository-jclouds.forge.cloudbees.com/snapshot/org/apache/jclouds/driver/jclouds-okhttp/2.0.0-SNAPSHOT/maven-metadata.xml
Downloading: https://repository.apache.org/content/repositories/snapshots/org/apache/jclouds/driver/jclouds-okhttp/2.0.0-SNAPSHOT/maven-metadata.xml
Downloading: http://repository.apache.org/snapshots/org/apache/jclouds/driver/jclouds-okhttp/2.0.0-SNAPSHOT/maven-metadata.xml
Downloaded: https://repository.apache.org/content/repositories/snapshots/org/apache/jclouds/driver/jclouds-okhttp/2.0.0-SNAPSHOT/maven-metadata.xml
(1009 B at 1.8 KB/sec)
Downloaded: http://repository.apache.org/snapshots/org/apache/jclouds/driver/jclouds-okhttp/2.0.0-SNAPSHOT/maven-metadata.xml
(1009 B at 1.5 KB/sec)
Downloading: https://repository-jclouds.forge.cloudbees.com/snapshot/org/apache/jclouds/driver/jclouds-okhttp/2.0.0-SNAPSHOT/jclouds-okhttp-2.0.0-20150401.015923-266.pom
Downloading: https://repository.apache.org/content/repositories/snapshots/org/apache/jclouds/driver/jclouds-okhttp/2.0.0-SNAPSHOT/jclouds-okhttp-2.0.0-20150401.015923-266.pom
Downloaded: https://repository.apache.org/content/repositories/snapshots/org/apache/jclouds/driver/jclouds-okhttp/2.0.0-SNAPSHOT/jclouds-okhttp-2.0.0-20150401.015923-266.pom
(3 KB at 2.0 KB/sec)
Downloading: https://repository.apache.org/content/repositories/snapshots/org/apache/jclouds/labs/googlecloud/2.0.0-SNAPSHOT/googlecloud-2.0.0-20150401.023916-171.jar
Downloading: https://repository.apache.org/content/repositories/snapshots/org/apache/jclouds/jclouds-compute/2.0.0-SNAPSHOT/jclouds-compute-2.0.0-20150401.015254-280.jar
Downloading: https://repository.apache.org/content/repositories/snapshots/org/apache/jclouds/jclouds-scriptbuilder/2.0.0-SNAPSHOT/jclouds-scriptbuilder-2.0.0-20150401.015142-281.jar
Downloaded: https://repository.apache.org/content/repositories/snapshots/org/apache/jclouds/labs/googlecloud/2.0.0-SNAPSHOT/googlecloud-2.0.0-20150401.023916-171.jar
(25 KB at 39.7 KB/sec)
Downloaded: https://repository.apache.org/content/repositories/snapshots/org/apache/jclouds/jclouds-scriptbuilder/2.0.0-SNAPSHOT/jclouds-scriptbuilder-2.0.0-20150401.015142-281.jar
(170 KB at 162.1 KB/sec)
Downloaded: https://repository.apache.org/content/repositories/snapshots/org/apache/jclouds/jclouds-compute/2.0.0-SNAPSHOT/jclouds-compute-2.0.0-20150401.015254-280.jar
(501 KB at 344.0 KB/sec)
Downloading: http://repo.cloudbees.com/content/repositories/central/com/google/auto/service/auto-service/1.0-rc2/auto-service-1.0-rc2.jar
Downloading: http://repo.cloudbees.com/content/repositories/central/com/google/auto/auto-common/0.3/auto-common-0.3.jar
Downloaded: http://repo.cloudbees.com/content/repositories/central/com/google/auto/service/auto-service/1.0-rc2/auto-service-1.0-rc2.jar
(11 KB at 2.1 KB/sec)
Downloading: https://repository-jclouds.forge.cloudbees.com/release/com/google/auto/auto-common/0.3/auto-common-0.3.jar
Started calculate disk usage of build
Finished Calculation of disk usage of build in 0 seconds
Started calculate disk usage of workspace
Finished Calculation of disk usage of workspace in 0 seconds
[INFO] ------------------------------------------------------------------------
[INFO] Reactor Summary:
[INFO] 
[INFO] Apache jclouds labs google ........................ FAILURE [4:29.865s]
[INFO] jclouds OAuth core ................................ SKIPPED
[INFO] jclouds Google Cloud Core ......................... SKIPPED
[INFO] jclouds Google Compute Engine provider ............ SKIPPED
[INFO] jclouds Google Cloud Storage provider ............. SKIPPED
[INFO] ------------------------------------------------------------------------
[INFO] BUILD FAILURE
[INFO] ------------------------------------------------------------------------
[INFO] Total time: 4:49.618s
[INFO] Finished at: Wed Apr 01 09:52:15 EDT 2015
[INFO] Final Memory: 23M/128M
[INFO] ------------------------------------------------------------------------
Waiting for Jenkins to finish collecting data
[ERROR] Failed to execute goal on project google-compute-engine: Could not resolve dependencies
for project org.apache.jclouds.labs:google-compute-engine:jar:2.0.0-SNAPSHOT: Could not find
artifact com.google.auto:auto-common:jar:0.3 in central (http://repo.cloudbees.com/content/repositories/central)
-> [Help 1]
org.apache.maven.lifecycle.LifecycleExecutionException: Failed to execute goal on project
google-compute-engine: Could not resolve dependencies for project org.apache.jclouds.labs:google-compute-engine:jar:2.0.0-SNAPSHOT:
Could not find artifact com.google.auto:auto-common:jar:0.3 in central (http://repo.cloudbees.com/content/repositories/central)
	at org.apache.maven.lifecycle.internal.LifecycleDependencyResolver.getDependencies(LifecycleDependencyResolver.java:210)
	at org.apache.maven.lifecycle.internal.LifecycleDependencyResolver.resolveProjectDependencies(LifecycleDependencyResolver.java:117)
	at org.apache.maven.lifecycle.internal.MojoExecutor.ensureDependenciesAreResolved(MojoExecutor.java:275)
	at org.apache.maven.lifecycle.internal.MojoExecutor.execute(MojoExecutor.java:201)
	at org.apache.maven.lifecycle.internal.MojoExecutor.execute(MojoExecutor.java:153)
	at org.apache.maven.lifecycle.internal.MojoExecutor.execute(MojoExecutor.java:145)
	at org.apache.maven.lifecycle.internal.LifecycleModuleBuilder.buildProject(LifecycleModuleBuilder.java:84)
	at org.apache.maven.lifecycle.internal.LifecycleModuleBuilder.buildProject(LifecycleModuleBuilder.java:59)
	at org.apache.maven.lifecycle.internal.LifecycleStarter.singleThreadedBuild(LifecycleStarter.java:183)
	at org.apache.maven.lifecycle.internal.LifecycleStarter.execute(LifecycleStarter.java:161)
	at org.apache.maven.DefaultMaven.doExecute(DefaultMaven.java:320)
	at org.apache.maven.DefaultMaven.execute(DefaultMaven.java:156)
	at org.jvnet.hudson.maven3.launcher.Maven3Launcher.main(Maven3Launcher.java:117)
	at sun.reflect.NativeMethodAccessorImpl.invoke0(Native Method)
	at sun.reflect.NativeMethodAccessorImpl.invoke(NativeMethodAccessorImpl.java:57)
	at sun.reflect.DelegatingMethodAccessorImpl.invoke(DelegatingMethodAccessorImpl.java:43)
	at java.lang.reflect.Method.invoke(Method.java:606)
	at org.codehaus.plexus.classworlds.launcher.Launcher.launchStandard(Launcher.java:329)
	at org.codehaus.plexus.classworlds.launcher.Launcher.launch(Launcher.java:239)
	at org.jvnet.hudson.maven3.agent.Maven3Main.launch(Maven3Main.java:178)
	at sun.reflect.NativeMethodAccessorImpl.invoke0(Native Method)
	at sun.reflect.NativeMethodAccessorImpl.invoke(NativeMethodAccessorImpl.java:57)
	at sun.reflect.DelegatingMethodAccessorImpl.invoke(DelegatingMethodAccessorImpl.java:43)
	at java.lang.reflect.Method.invoke(Method.java:606)
	at hudson.maven.Maven3Builder.call(Maven3Builder.java:136)
	at hudson.maven.Maven3Builder.call(Maven3Builder.java:71)
	at hudson.remoting.UserRequest.perform(UserRequest.java:121)
	at hudson.remoting.UserRequest.perform(UserRequest.java:49)
	at hudson.remoting.Request$2.run(Request.java:324)
	at hudson.remoting.InterceptingExecutorService$1.call(InterceptingExecutorService.java:68)
	at java.util.concurrent.FutureTask.run(FutureTask.java:262)
	at java.util.concurrent.ThreadPoolExecutor.runWorker(ThreadPoolExecutor.java:1145)
	at java.util.concurrent.ThreadPoolExecutor$Worker.run(ThreadPoolExecutor.java:615)
	at java.lang.Thread.run(Thread.java:745)
Caused by: org.apache.maven.project.DependencyResolutionException: Could not resolve dependencies
for project org.apache.jclouds.labs:google-compute-engine:jar:2.0.0-SNAPSHOT: Could not find
artifact com.google.auto:auto-common:jar:0.3 in central (http://repo.cloudbees.com/content/repositories/central)
	at org.apache.maven.project.DefaultProjectDependenciesResolver.resolve(DefaultProjectDependenciesResolver.java:189)
	at org.apache.maven.lifecycle.internal.LifecycleDependencyResolver.getDependencies(LifecycleDependencyResolver.java:185)
	... 33 more
Caused by: org.sonatype.aether.resolution.DependencyResolutionException: Could not find artifact
com.google.auto:auto-common:jar:0.3 in central (http://repo.cloudbees.com/content/repositories/central)
	at org.sonatype.aether.impl.internal.DefaultRepositorySystem.resolveDependencies(DefaultRepositorySystem.java:375)
	at org.apache.maven.project.DefaultProjectDependenciesResolver.resolve(DefaultProjectDependenciesResolver.java:183)
	... 34 more
Caused by: org.sonatype.aether.resolution.ArtifactResolutionException: Could not find artifact
com.google.auto:auto-common:jar:0.3 in central (http://repo.cloudbees.com/content/repositories/central)
	at org.sonatype.aether.impl.internal.DefaultArtifactResolver.resolve(DefaultArtifactResolver.java:538)
	at org.sonatype.aether.impl.internal.DefaultArtifactResolver.resolveArtifacts(DefaultArtifactResolver.java:216)
	at org.sonatype.aether.impl.internal.DefaultRepositorySystem.resolveDependencies(DefaultRepositorySystem.java:358)
	... 35 more
Caused by: org.sonatype.aether.transfer.ArtifactNotFoundException: Could not find artifact
com.google.auto:auto-common:jar:0.3 in central (http://repo.cloudbees.com/content/repositories/central)
	at org.sonatype.aether.connector.wagon.WagonRepositoryConnector$4.wrap(WagonRepositoryConnector.java:947)
	at org.sonatype.aether.connector.wagon.WagonRepositoryConnector$4.wrap(WagonRepositoryConnector.java:941)
	at org.sonatype.aether.connector.wagon.WagonRepositoryConnector$GetTask.run(WagonRepositoryConnector.java:669)
	at org.sonatype.aether.util.concurrency.RunnableErrorForwarder$1.run(RunnableErrorForwarder.java:60)
	... 3 more
[ERROR] 
[ERROR] Re-run Maven using the -X switch to enable full debug logging.
[ERROR] 
[ERROR] For more information about the errors and possible solutions, please read the following
articles:
[ERROR] [Help 1] http://cwiki.apache.org/confluence/display/MAVEN/DependencyResolutionException
[ERROR] 
[ERROR] After correcting the problems, you can resume the build with the command
[ERROR]   mvn <goals> -rf :google-compute-engine
[JENKINS] Archiving <https://jclouds.ci.cloudbees.com/job/jclouds-labs-google/ws/googlecloud/pom.xml>
to org.apache.jclouds.labs/googlecloud/2.0.0-SNAPSHOT/googlecloud-2.0.0-SNAPSHOT.pom
[JENKINS] Archiving <https://jclouds.ci.cloudbees.com/job/jclouds-labs-google/ws/pom.xml>
to org.apache.jclouds.labs/jclouds-labs-google/2.0.0-SNAPSHOT/jclouds-labs-google-2.0.0-SNAPSHOT.pom
[JENKINS] Archiving <https://jclouds.ci.cloudbees.com/job/jclouds-labs-google/ws/target/jclouds-labs-google-2.0.0-SNAPSHOT-tests.jar>
to org.apache.jclouds.labs/jclouds-labs-google/2.0.0-SNAPSHOT/jclouds-labs-google-2.0.0-SNAPSHOT-tests.jar
[JENKINS] Archiving <https://jclouds.ci.cloudbees.com/job/jclouds-labs-google/ws/google-cloud-storage/pom.xml>
to org.apache.jclouds.labs/google-cloud-storage/2.0.0-SNAPSHOT/google-cloud-storage-2.0.0-SNAPSHOT.pom
[JENKINS] Archiving <https://jclouds.ci.cloudbees.com/job/jclouds-labs-google/ws/google-compute-engine/pom.xml>
to org.apache.jclouds.labs/google-compute-engine/2.0.0-SNAPSHOT/google-compute-engine-2.0.0-SNAPSHOT.pom
[JENKINS] Archiving <https://jclouds.ci.cloudbees.com/job/jclouds-labs-google/ws/oauth/pom.xml>
to org.apache.jclouds.labs/oauth/2.0.0-SNAPSHOT/oauth-2.0.0-SNAPSHOT.pom
Sending e-mails to: notifications@jclouds.apache.org
channel stopped

Mime
View raw message