jclouds-notifications mailing list archives

Site index · List index
Message view « Date » · « Thread »
Top « Date » · « Thread »
From jenkins-no-re...@cloudbees.com
Subject Build failed in Jenkins: jclouds-guava-17-18 » 18.0,OpenJDK 7 (latest) #280
Date Thu, 28 May 2015 06:18:01 GMT
See <https://jclouds.ci.cloudbees.com/job/jclouds-guava-17-18/GUAVA_VERSION=18.0,jdk=OpenJDK%207%20(latest)/280/changes>

Changes:

[Andrew Gaul] Revert "metadata and content metadata should have the same length"

------------------------------------------
[...truncated 11603 lines...]
java.lang.RuntimeException: java.nio.file.NoSuchFileException: ./target/basedir/jenkins-blobstore6
	at com.google.common.base.Throwables.propagate(Throwables.java:160)
	at org.jclouds.filesystem.strategy.internal.FilesystemStorageStrategyImpl.getContainerMetadata(FilesystemStorageStrategyImpl.java:261)
	at org.jclouds.blobstore.config.LocalBlobStore$5.apply(LocalBlobStore.java:400)
	at org.jclouds.blobstore.config.LocalBlobStore$5.apply(LocalBlobStore.java:398)
	at com.google.common.collect.Iterators$8.transform(Iterators.java:799)
	at com.google.common.collect.TransformedIterator.next(TransformedIterator.java:48)
	at com.google.common.collect.Iterators.addAll(Iterators.java:362)
	at com.google.common.collect.Iterables.addAll(Iterables.java:354)
	at org.jclouds.blobstore.domain.internal.PageSetImpl.<init>(PageSetImpl.java:31)
	at org.jclouds.blobstore.config.LocalBlobStore.list(LocalBlobStore.java:397)
	at sun.reflect.NativeMethodAccessorImpl.invoke0(Native Method)
	at sun.reflect.NativeMethodAccessorImpl.invoke(NativeMethodAccessorImpl.java:57)
	at sun.reflect.DelegatingMethodAccessorImpl.invoke(DelegatingMethodAccessorImpl.java:43)
	at java.lang.reflect.Method.invoke(Method.java:606)
	at com.google.inject.internal.DelegatingInvocationHandler.invoke(DelegatingInvocationHandler.java:37)
	at com.sun.proxy.$Proxy44.list(Unknown Source)
	at org.jclouds.blobstore.integration.internal.BaseBlobStoreIntegrationTest.returnContainer(BaseBlobStoreIntegrationTest.java:458)
	at org.jclouds.blobstore.integration.internal.BaseBlobStoreIntegrationTest.recycleContainerAndAddToPool(BaseBlobStoreIntegrationTest.java:495)
	at org.jclouds.blobstore.integration.internal.BaseContainerIntegrationTest.testSetContainerAccess(BaseContainerIntegrationTest.java:515)
	at sun.reflect.NativeMethodAccessorImpl.invoke0(Native Method)
	at sun.reflect.NativeMethodAccessorImpl.invoke(NativeMethodAccessorImpl.java:57)
	at sun.reflect.DelegatingMethodAccessorImpl.invoke(DelegatingMethodAccessorImpl.java:43)
	at java.lang.reflect.Method.invoke(Method.java:606)
	at org.testng.internal.MethodInvocationHelper.invokeMethod(MethodInvocationHelper.java:84)
	at org.testng.internal.Invoker.invokeMethod(Invoker.java:714)
	at org.testng.internal.Invoker.invokeTestMethod(Invoker.java:901)
	at org.testng.internal.Invoker.invokeTestMethods(Invoker.java:1231)
	at org.testng.internal.TestMethodWorker.invokeTestMethods(TestMethodWorker.java:127)
	at org.testng.internal.TestMethodWorker.run(TestMethodWorker.java:111)
	at org.testng.TestRunner.privateRun(TestRunner.java:767)
	at org.testng.TestRunner.run(TestRunner.java:617)
	at org.testng.SuiteRunner.runTest(SuiteRunner.java:348)
	at org.testng.SuiteRunner.access$000(SuiteRunner.java:38)
	at org.testng.SuiteRunner$SuiteWorker.run(SuiteRunner.java:382)
	at org.testng.internal.thread.ThreadUtil$2.call(ThreadUtil.java:64)
	at java.util.concurrent.FutureTask.run(FutureTask.java:262)
	at java.util.concurrent.ThreadPoolExecutor.runWorker(ThreadPoolExecutor.java:1145)
	at java.util.concurrent.ThreadPoolExecutor$Worker.run(ThreadPoolExecutor.java:615)
	at java.lang.Thread.run(Thread.java:744)
Caused by: java.nio.file.NoSuchFileException: ./target/basedir/jenkins-blobstore6
	at sun.nio.fs.UnixException.translateToIOException(UnixException.java:86)
	at sun.nio.fs.UnixException.rethrowAsIOException(UnixException.java:102)
	at sun.nio.fs.UnixException.rethrowAsIOException(UnixException.java:107)
	at sun.nio.fs.UnixFileAttributeViews$Basic.readAttributes(UnixFileAttributeViews.java:55)
	at sun.nio.fs.UnixFileSystemProvider.readAttributes(UnixFileSystemProvider.java:144)
	at sun.nio.fs.LinuxFileSystemProvider.readAttributes(LinuxFileSystemProvider.java:97)
	at java.nio.file.Files.readAttributes(Files.java:1686)
	at org.jclouds.filesystem.strategy.internal.FilesystemStorageStrategyImpl.getContainerMetadata(FilesystemStorageStrategyImpl.java:259)
	at org.jclouds.blobstore.config.LocalBlobStore$5.apply(LocalBlobStore.java:400)
	at org.jclouds.blobstore.config.LocalBlobStore$5.apply(LocalBlobStore.java:398)
	at com.google.common.collect.Iterators$8.transform(Iterators.java:799)
	at com.google.common.collect.TransformedIterator.next(TransformedIterator.java:48)
	at com.google.common.collect.Iterators.addAll(Iterators.java:362)
	at com.google.common.collect.Iterables.addAll(Iterables.java:354)
	at org.jclouds.blobstore.domain.internal.PageSetImpl.<init>(PageSetImpl.java:31)
	at org.jclouds.blobstore.config.LocalBlobStore.list(LocalBlobStore.java:397)
	at sun.reflect.NativeMethodAccessorImpl.invoke0(Native Method)
	at sun.reflect.NativeMethodAccessorImpl.invoke(NativeMethodAccessorImpl.java:57)
	at sun.reflect.DelegatingMethodAccessorImpl.invoke(DelegatingMethodAccessorImpl.java:43)
	at java.lang.reflect.Method.invoke(Method.java:606)
	at com.google.inject.internal.DelegatingInvocationHandler.invoke(DelegatingInvocationHandler.java:37)
	at com.sun.proxy.$Proxy44.list(Unknown Source)
	at org.jclouds.blobstore.integration.internal.BaseBlobStoreIntegrationTest.returnContainer(BaseBlobStoreIntegrationTest.java:458)
	at org.jclouds.blobstore.integration.internal.BaseBlobStoreIntegrationTest.recycleContainerAndAddToPool(BaseBlobStoreIntegrationTest.java:495)
	at org.jclouds.blobstore.integration.internal.BaseContainerIntegrationTest.testSetContainerAccess(BaseContainerIntegrationTest.java:515)
	at sun.reflect.NativeMethodAccessorImpl.invoke0(Native Method)
	at sun.reflect.NativeMethodAccessorImpl.invoke(NativeMethodAccessorImpl.java:57)
	at sun.reflect.DelegatingMethodAccessorImpl.invoke(DelegatingMethodAccessorImpl.java:43)
	at java.lang.reflect.Method.invoke(Method.java:606)
	at org.testng.internal.MethodInvocationHelper.invokeMethod(MethodInvocationHelper.java:84)
	at org.testng.internal.Invoker.invokeMethod(Invoker.java:714)
	at org.testng.internal.Invoker.invokeTestMethod(Invoker.java:901)
	at org.testng.internal.Invoker.invokeTestMethods(Invoker.java:1231)
	at org.testng.internal.TestMethodWorker.invokeTestMethods(TestMethodWorker.java:127)
	at org.testng.internal.TestMethodWorker.run(TestMethodWorker.java:111)
	at org.testng.TestRunner.privateRun(TestRunner.java:767)
	at org.testng.TestRunner.run(TestRunner.java:617)
	at org.testng.SuiteRunner.runTest(SuiteRunner.java:348)
	at org.testng.SuiteRunner.access$000(SuiteRunner.java:38)
	at org.testng.SuiteRunner$SuiteWorker.run(SuiteRunner.java:382)
	at org.testng.internal.thread.ThreadUtil$2.call(ThreadUtil.java:64)
	at java.util.concurrent.FutureTask.run(FutureTask.java:262)
	at java.util.concurrent.ThreadPoolExecutor.runWorker(ThreadPoolExecutor.java:1145)
	at java.util.concurrent.ThreadPoolExecutor$Worker.run(ThreadPoolExecutor.java:615)
	at java.lang.Thread.run(Thread.java:744)


Results :

Failed tests: 
  FilesystemContainerIntegrationTest>BaseContainerIntegrationTest.testSetContainerAccess:515->BaseBlobStoreIntegrationTest.recycleContainerAndAddToPool:495->BaseBlobStoreIntegrationTest.returnContainer:458
» Runtime

Tests run: 74, Failures: 1, Errors: 0, Skipped: 4

[INFO] ------------------------------------------------------------------------
[INFO] Reactor Summary:
[INFO] 
[INFO] Apache jclouds Project ............................ SUCCESS [35.184s]
[INFO] jclouds shared Maven resources .................... SUCCESS [25.111s]
[INFO] jclouds Components Core ........................... SUCCESS [4:49.844s]
[INFO] jclouds OpenStack Components Core ................. SUCCESS [38.548s]
[INFO] jclouds commons project ........................... SUCCESS [5.212s]
[INFO] jclouds script builder ............................ SUCCESS [22.522s]
[INFO] jclouds compute core .............................. SUCCESS [2:05.741s]
[INFO] jclouds Log4J Logging Module ...................... SUCCESS [9.176s]
[INFO] jclouds loadbalancer core ......................... SUCCESS [7.350s]
[INFO] jclouds sts api ................................... SUCCESS [27.594s]
[INFO] jclouds cloudwatch api ............................ SUCCESS [34.233s]
[INFO] jclouds SLF4J Logging Module ...................... SUCCESS [7.794s]
[INFO] jclouds bouncycastle EncryptionService Module ..... SUCCESS [15.630s]
[INFO] jclouds sshj ssh client ........................... SUCCESS [20.318s]
[INFO] jclouds cloudstack core ........................... SUCCESS [3:14.400s]
[INFO] jclouds blobstore core ............................ SUCCESS [2:10.423s]
[INFO] jclouds filesystem core ........................... FAILURE [1:18.948s]
[INFO] jclouds bring your own node provider .............. SKIPPED
[INFO] jclouds OkHttp Driver ............................. SKIPPED
[INFO] jclouds s3 api .................................... SKIPPED
[INFO] jclouds ec2 api ................................... SKIPPED
[INFO] jclouds sqs api ................................... SKIPPED
[INFO] jclouds elasticstack core ......................... SKIPPED
[INFO] jclouds atmos components .......................... SKIPPED
[INFO] jclouds openstack-keystone api .................... SKIPPED
[INFO] jclouds swift api ................................. SKIPPED
[INFO] jclouds openstack-cinder api ...................... SKIPPED
[INFO] Apache jclouds :: OpenStack :: Nova API ........... SKIPPED
[INFO] jclouds openstack-nova-ec2 api .................... SKIPPED
[INFO] jclouds openstack-swift api ....................... SKIPPED
[INFO] jclouds openstack-trove api ....................... SKIPPED
[INFO] jclouds cloudfiles api ............................ SKIPPED
[INFO] jclouds rackspace cloudidentity api ............... SKIPPED
[INFO] jclouds Rackspace Cloud Load Balancers API ........ SKIPPED
[INFO] jclouds Rackspace Next Generation Cloud Block Storage US provider  SKIPPED
[INFO] jclouds Rackspace Next Generation Cloud Servers US provider  SKIPPED
[INFO] jclouds rackspace clouddns api .................... SKIPPED
[INFO] jclouds rackspace-cloudfiles api .................. SKIPPED
[INFO] jclouds route53 api ............................... SKIPPED
[INFO] jclouds Chef api .................................. SKIPPED
[INFO] jclouds OAuth core ................................ SKIPPED
[INFO] jclouds apis project .............................. SKIPPED
[INFO] jclouds GoGrid provider ........................... SKIPPED
[INFO] jclouds Azure Storage provider .................... SKIPPED
[INFO] jclouds Apache Http Components Client ............. SKIPPED
[INFO] jclouds joda DateService Module ................... SKIPPED
[INFO] jclouds netty payload module ...................... SKIPPED
[INFO] jclouds enterprise Module ......................... SKIPPED
[INFO] jclouds Amazon Simple Storage Service (S3) provider  SKIPPED
[INFO] jclouds Amazon Elastic Load Balancer provider ..... SKIPPED
[INFO] jclouds Amazon EC2 provider ....................... SKIPPED
[INFO] jclouds Amazon Simple Queue Service provider ...... SKIPPED
[INFO] jclouds ElasticHosts Peer1 London provider ........ SKIPPED
[INFO] jclouds ElasticHosts Peer1 San Antonio provider ... SKIPPED
[INFO] jclouds ElasticHosts BlueSquare London provider ... SKIPPED
[INFO] jclouds ElasticHosts Peer1 Toronto provider ....... SKIPPED
[INFO] jclouds ElasticHosts Peer1 Los Angeles provider ... SKIPPED
[INFO] jclouds ElasticHosts Amsterdam provider ........... SKIPPED
[INFO] jclouds ElasticHosts San Jose provider ............ SKIPPED
[INFO] jclouds ElasticHosts Hong Kong provider ........... SKIPPED
[INFO] jclouds ElasticHosts Sydney provider .............. SKIPPED
[INFO] jclouds Open Hosting East1 provider ............... SKIPPED
[INFO] jclouds Serverlove Manchester provider ............ SKIPPED
[INFO] jclouds SkaliCloud Malaysia provider .............. SKIPPED
[INFO] jclouds Go2Cloud Johannesburg1 provider ........... SKIPPED
[INFO] jclouds SoftLayer core ............................ SKIPPED
[INFO] jclouds HP Cloud Compute provider ................. SKIPPED
[INFO] jclouds HP Cloud Block Storage Provider ........... SKIPPED
[INFO] jclouds HP Cloud Object Storage ................... SKIPPED
[INFO] jclouds CloudFiles US provider .................... SKIPPED
[INFO] jclouds CloudFiles UK provider .................... SKIPPED
[INFO] jclouds Rackspace Cloud Files US provider ......... SKIPPED
[INFO] jclouds Rackspace Cloud Files UK provider ......... SKIPPED
[INFO] jclouds Rackspace Next Generation Cloud DNS US provider  SKIPPED
[INFO] jclouds Rackspace Next Generation Cloud DNS UK provider  SKIPPED
[INFO] jclouds Rackspace Cloud Databases US provider ..... SKIPPED
[INFO] jclouds Rackspace Cloud Databases UK provider ..... SKIPPED
[INFO] jclouds Rackspace Cloud Load Balancers US provider  SKIPPED
[INFO] jclouds Rackspace Cloud Load Balancers UK provider  SKIPPED
[INFO] jclouds Rackspace Next Generation Cloud Block Storage UK provider  SKIPPED
[INFO] jclouds Rackspace Next Generation Cloud Servers provider  SKIPPED
[INFO] jclouds GleSYS core ............................... SKIPPED
[INFO] jclouds Amazon Identity and Access Management (STS) provider  SKIPPED
[INFO] jclouds Amazon Route 53 provider .................. SKIPPED
[INFO] jclouds ultradns-ws provider ...................... SKIPPED
[INFO] jclouds dynect api ................................ SKIPPED
[INFO] jclouds Enterprise Chef provider .................. SKIPPED
[INFO] jclouds providers project ......................... SKIPPED
[INFO] jclouds jsch ssh client ........................... SKIPPED
[INFO] jclouds example components for a standalone compute provider  SKIPPED
[INFO] jclouds skeletons project ......................... SKIPPED
[INFO] jclouds Google App Engine Components .............. SKIPPED
[INFO] jclouds drivers project ........................... SKIPPED
[INFO] allcompute ........................................ SKIPPED
[INFO] allblobstore ...................................... SKIPPED
[INFO] allloadbalancer ................................... SKIPPED
[INFO] all ............................................... SKIPPED
[INFO] Apache jclouds .................................... SKIPPED
[INFO] ------------------------------------------------------------------------
[INFO] BUILD FAILURE
[INFO] ------------------------------------------------------------------------
[INFO] Total time: 18:03.440s
[INFO] Finished at: Thu May 28 02:17:58 EDT 2015
[INFO] Final Memory: 97M/315M
[INFO] ------------------------------------------------------------------------
[ERROR] Failed to execute goal org.apache.maven.plugins:maven-surefire-plugin:2.17:test (integration)
on project filesystem: There are test failures.
[ERROR] 
[ERROR] Please refer to <https://jclouds.ci.cloudbees.com/job/jclouds-guava-17-18/GUAVA_VERSION=18.0,jdk=OpenJDK%207%20(latest)/ws/apis/filesystem/target/surefire-reports>
for the individual test results.
[ERROR] -> [Help 1]
org.apache.maven.lifecycle.LifecycleExecutionException: Failed to execute goal org.apache.maven.plugins:maven-surefire-plugin:2.17:test
(integration) on project filesystem: There are test failures.

Please refer to <https://jclouds.ci.cloudbees.com/job/jclouds-guava-17-18/GUAVA_VERSION=18.0,jdk=OpenJDK%207%20(latest)/ws/apis/filesystem/target/surefire-reports>
for the individual test results.
	at org.apache.maven.lifecycle.internal.MojoExecutor.execute(MojoExecutor.java:213)
	at org.apache.maven.lifecycle.internal.MojoExecutor.execute(MojoExecutor.java:153)
	at org.apache.maven.lifecycle.internal.MojoExecutor.execute(MojoExecutor.java:145)
	at org.apache.maven.lifecycle.internal.LifecycleModuleBuilder.buildProject(LifecycleModuleBuilder.java:84)
	at org.apache.maven.lifecycle.internal.LifecycleModuleBuilder.buildProject(LifecycleModuleBuilder.java:59)
	at org.apache.maven.lifecycle.internal.LifecycleStarter.singleThreadedBuild(LifecycleStarter.java:183)
	at org.apache.maven.lifecycle.internal.LifecycleStarter.execute(LifecycleStarter.java:161)
	at org.apache.maven.DefaultMaven.doExecute(DefaultMaven.java:320)
	at org.apache.maven.DefaultMaven.execute(DefaultMaven.java:156)
	at org.apache.maven.cli.MavenCli.execute(MavenCli.java:537)
	at org.apache.maven.cli.MavenCli.doMain(MavenCli.java:196)
	at org.apache.maven.cli.MavenCli.main(MavenCli.java:141)
	at sun.reflect.NativeMethodAccessorImpl.invoke0(Native Method)
	at sun.reflect.NativeMethodAccessorImpl.invoke(NativeMethodAccessorImpl.java:57)
	at sun.reflect.DelegatingMethodAccessorImpl.invoke(DelegatingMethodAccessorImpl.java:43)
	at java.lang.reflect.Method.invoke(Method.java:606)
	at org.codehaus.plexus.classworlds.launcher.Launcher.launchEnhanced(Launcher.java:290)
	at org.codehaus.plexus.classworlds.launcher.Launcher.launch(Launcher.java:230)
	at org.codehaus.plexus.classworlds.launcher.Launcher.mainWithExitCode(Launcher.java:409)
	at org.codehaus.plexus.classworlds.launcher.Launcher.main(Launcher.java:352)
Caused by: org.apache.maven.plugin.MojoFailureException: There are test failures.

Please refer to <https://jclouds.ci.cloudbees.com/job/jclouds-guava-17-18/GUAVA_VERSION=18.0,jdk=OpenJDK%207%20(latest)/ws/apis/filesystem/target/surefire-reports>
for the individual test results.
	at org.apache.maven.plugin.surefire.SurefireHelper.reportExecution(SurefireHelper.java:82)
	at org.apache.maven.plugin.surefire.SurefirePlugin.handleSummary(SurefirePlugin.java:195)
	at org.apache.maven.plugin.surefire.AbstractSurefireMojo.executeAfterPreconditionsChecked(AbstractSurefireMojo.java:861)
	at org.apache.maven.plugin.surefire.AbstractSurefireMojo.execute(AbstractSurefireMojo.java:729)
	at org.apache.maven.plugin.DefaultBuildPluginManager.executeMojo(DefaultBuildPluginManager.java:101)
	at org.apache.maven.lifecycle.internal.MojoExecutor.execute(MojoExecutor.java:209)
	... 19 more
[ERROR] 
[ERROR] Re-run Maven using the -X switch to enable full debug logging.
[ERROR] 
[ERROR] For more information about the errors and possible solutions, please read the following
articles:
[ERROR] [Help 1] http://cwiki.apache.org/confluence/display/MAVEN/MojoFailureException
[ERROR] 
[ERROR] After correcting the problems, you can resume the build with the command
[ERROR]   mvn <goals> -rf :filesystem
Build step 'Invoke top-level Maven targets' marked build as failure

Mime
View raw message