jclouds-notifications mailing list archives

Site index · List index
Message view « Date » · « Thread »
Top « Date » · « Thread »
From jenkins-no-re...@cloudbees.com
Subject Build failed in Jenkins: jclouds-guava-17-18 » 18.0,OpenJDK 7 (latest) #274
Date Thu, 28 May 2015 00:21:47 GMT
See <https://jclouds.ci.cloudbees.com/job/jclouds-guava-17-18/GUAVA_VERSION=18.0,jdk=OpenJDK%207%20(latest)/274/changes>

Changes:

[khc] metadata and content metadata should have the same length

[Andrew Gaul] implemented some basic range validations in local blob store

[Andrew Gaul] tighten the isUrlEncoded check

------------------------------------------
[...truncated 5171 lines...]
Starting test testCanOverrideDefault(org.jclouds.json.internal.DeserializationConstructorAndReflectiveTypeAdapterFactoryTest)
Starting test testEmptyObjectIsNull(org.jclouds.json.internal.DeserializationConstructorAndReflectiveTypeAdapterFactoryTest)
Starting test testGenericParamsCopiedIn(org.jclouds.json.internal.DeserializationConstructorAndReflectiveTypeAdapterFactoryTest)
[pool-86-thread-1] Test checkSimpleComposedObject(org.jclouds.json.internal.DeserializationConstructorAndReflectiveTypeAdapterFactoryTest)
succeeded: 1ms
Test suite progress: tests succeeded: 798, failed: 4, skipped: 0.
[pool-86-thread-4] Test testEmptyObjectIsNull(org.jclouds.json.internal.DeserializationConstructorAndReflectiveTypeAdapterFactoryTest)
succeeded: 1ms
Test suite progress: tests succeeded: 799, failed: 4, skipped: 0.
[pool-86-thread-3] Test testCanOverrideDefault(org.jclouds.json.internal.DeserializationConstructorAndReflectiveTypeAdapterFactoryTest)
succeeded: 2ms
Test suite progress: tests succeeded: 800, failed: 4, skipped: 0.
Starting test testNoDuplicateSerializedNamesRequiredOnAllParameters(org.jclouds.json.internal.DeserializationConstructorAndReflectiveTypeAdapterFactoryTest)
Starting test testNullWhenPrimitive(org.jclouds.json.internal.DeserializationConstructorAndReflectiveTypeAdapterFactoryTest)
Starting test testPartialObjectStillThrows(org.jclouds.json.internal.DeserializationConstructorAndReflectiveTypeAdapterFactoryTest)
[pool-86-thread-4] Test testNullWhenPrimitive(org.jclouds.json.internal.DeserializationConstructorAndReflectiveTypeAdapterFactoryTest)
succeeded: 0ms
Test suite progress: tests succeeded: 801, failed: 4, skipped: 0.
Starting test testRejectsIfNoConstuctorMarked(org.jclouds.json.internal.DeserializationConstructorAndReflectiveTypeAdapterFactoryTest)
[pool-86-thread-1] Test testNoDuplicateSerializedNamesRequiredOnAllParameters(org.jclouds.json.internal.DeserializationConstructorAndReflectiveTypeAdapterFactoryTest)
succeeded: 0ms
Test suite progress: tests succeeded: 802, failed: 4, skipped: 0.
[pool-86-thread-2] Test testBuilderOnAbstractValueType(org.jclouds.json.internal.DeserializationConstructorAndReflectiveTypeAdapterFactoryTest)
succeeded: 2ms
Test suite progress: tests succeeded: 803, failed: 4, skipped: 0.
[pool-86-thread-3] Test testPartialObjectStillThrows(org.jclouds.json.internal.DeserializationConstructorAndReflectiveTypeAdapterFactoryTest)
succeeded: 1ms
Starting test testRenamedFields(org.jclouds.json.internal.DeserializationConstructorAndReflectiveTypeAdapterFactoryTest)
Test suite progress: tests succeeded: 804, failed: 4, skipped: 0.
Starting test testSerializedNameRequiredOnAllParameters(org.jclouds.json.internal.DeserializationConstructorAndReflectiveTypeAdapterFactoryTest)
[pool-86-thread-4] Test testRejectsIfNoConstuctorMarked(org.jclouds.json.internal.DeserializationConstructorAndReflectiveTypeAdapterFactoryTest)
succeeded: 1ms
Starting test testSerializedNamesMustHaveCorrectCountOfNames(org.jclouds.json.internal.DeserializationConstructorAndReflectiveTypeAdapterFactoryTest)
Test suite progress: tests succeeded: 805, failed: 4, skipped: 0.
[pool-86-thread-5] Test testGenericParamsCopiedIn(org.jclouds.json.internal.DeserializationConstructorAndReflectiveTypeAdapterFactoryTest)
succeeded: 3ms
Test suite progress: tests succeeded: 806, failed: 4, skipped: 0.
Starting test testValidatedConstructor(org.jclouds.json.internal.DeserializationConstructorAndReflectiveTypeAdapterFactoryTest)
[pool-86-thread-1] Test testRenamedFields(org.jclouds.json.internal.DeserializationConstructorAndReflectiveTypeAdapterFactoryTest)
succeeded: 0ms
Test suite progress: tests succeeded: 807, failed: 4, skipped: 0.
[pool-86-thread-2] Test testSerializedNameRequiredOnAllParameters(org.jclouds.json.internal.DeserializationConstructorAndReflectiveTypeAdapterFactoryTest)
succeeded: 1ms
Test suite progress: tests succeeded: 808, failed: 4, skipped: 0.
[pool-86-thread-3] Test testSerializedNamesMustHaveCorrectCountOfNames(org.jclouds.json.internal.DeserializationConstructorAndReflectiveTypeAdapterFactoryTest)
succeeded: 1ms
Test suite progress: tests succeeded: 809, failed: 4, skipped: 0.
[pool-86-thread-4] Test testValidatedConstructor(org.jclouds.json.internal.DeserializationConstructorAndReflectiveTypeAdapterFactoryTest)
succeeded: 2ms
Test suite progress: tests succeeded: 810, failed: 4, skipped: 0.
Starting test testNoLeafs(org.jclouds.functions.ExpandPropertiesTest)
Starting test testPropertiesMandatory(org.jclouds.functions.ExpandPropertiesTest)
[pool-87-thread-1] Test testNoLeafs(org.jclouds.functions.ExpandPropertiesTest) succeeded:
0ms
Test suite progress: tests succeeded: 811, failed: 4, skipped: 0.
Starting test testResolveProperties(org.jclouds.functions.ExpandPropertiesTest)
[pool-87-thread-2] Test testPropertiesMandatory(org.jclouds.functions.ExpandPropertiesTest)
succeeded: 0ms
Test suite progress: tests succeeded: 812, failed: 4, skipped: 0.
[pool-87-thread-3] Test testResolveProperties(org.jclouds.functions.ExpandPropertiesTest)
succeeded: 1ms
Test suite progress: tests succeeded: 813, failed: 4, skipped: 0.
Starting test howTo(org.jclouds.functions.CacheLearningTest)
[pool-88-thread-1] Test howTo(org.jclouds.functions.CacheLearningTest) succeeded: 2ms
Test suite progress: tests succeeded: 814, failed: 4, skipped: 0.
Tests run: 818, Failures: 4, Errors: 0, Skipped: 0, Time elapsed: 34.645 sec <<<
FAILURE! - in TestSuite
testDecodes(org.jclouds.rest.binders.BindMapToStringPayloadTest)  Time elapsed: 0.006 sec
 <<< FAILURE!
java.lang.AssertionError: expected [{"changePassword":{"adminPass":"foo"}}] but found [%7B"changePassword":%7B"adminPass":"foo"%7D%7D]
	at org.testng.Assert.fail(Assert.java:94)
	at org.testng.Assert.failNotEquals(Assert.java:494)
	at org.testng.Assert.assertEquals(Assert.java:123)
	at org.testng.Assert.assertEquals(Assert.java:165)
	at org.jclouds.rest.binders.BindMapToStringPayloadTest.testDecodes(BindMapToStringPayloadTest.java:76)

testCreateGetRequest(org.jclouds.rest.internal.RestAnnotationProcessorTest)  Time elapsed:
0.001 sec  <<< FAILURE!
java.lang.AssertionError: expected [/qu%3Fstion] but found [/qu]
	at org.testng.Assert.fail(Assert.java:94)
	at org.testng.Assert.failNotEquals(Assert.java:494)
	at org.testng.Assert.assertEquals(Assert.java:123)
	at org.testng.Assert.assertEquals(Assert.java:176)
	at org.testng.Assert.assertEquals(Assert.java:186)
	at org.jclouds.rest.internal.RestAnnotationProcessorTest.testCreateGetRequest(RestAnnotationProcessorTest.java:2133)

testAddBase64AndUrlEncodedQueryParams(org.jclouds.http.HttpRequestTest)  Time elapsed: 0 sec
 <<< FAILURE!
java.lang.AssertionError: expected [GET http://goo.com:443?header1=ABCDEFGHIJKLMNOPQRSTUVWXYZabcdefghijklmnopqrstuvwxyz0123456789%2B/%3D&header2=ABCDEFGHIJKLMNOPQRSTUVWXYZabcdefghijklmnopqrstuvwxyz0123456789%2B/%3D
HTTP/1.1] but found [GET http://goo.com:443?header1=ABCDEFGHIJKLMNOPQRSTUVWXYZabcdefghijklmnopqrstuvwxyz0123456789%20/%3D&header2=ABCDEFGHIJKLMNOPQRSTUVWXYZabcdefghijklmnopqrstuvwxyz0123456789+/=
HTTP/1.1]
	at org.testng.Assert.fail(Assert.java:94)
	at org.testng.Assert.failNotEquals(Assert.java:494)
	at org.testng.Assert.assertEquals(Assert.java:123)
	at org.testng.Assert.assertEquals(Assert.java:176)
	at org.testng.Assert.assertEquals(Assert.java:186)
	at org.jclouds.http.HttpRequestTest.testAddBase64AndUrlEncodedQueryParams(HttpRequestTest.java:78)

testEncodesOnlyOnce(org.jclouds.http.HttpRequestTest)  Time elapsed: 0.001 sec  <<<
FAILURE!
java.lang.AssertionError: expected [{method=GET, endpoint=http://goo.com:443?header=hello%3F,
headers={}}] but found [{method=GET, endpoint=http://goo.com:443?header=hello?, headers={}}]
	at org.testng.Assert.fail(Assert.java:94)
	at org.testng.Assert.failNotEquals(Assert.java:494)
	at org.testng.Assert.assertEquals(Assert.java:123)
	at org.testng.Assert.assertEquals(Assert.java:165)
	at org.jclouds.http.HttpRequestTest.testEncodesOnlyOnce(HttpRequestTest.java:55)


Results :

Failed tests: 
  BindMapToStringPayloadTest.testDecodes:76 expected [{"changePassword":{"adminPass":"foo"}}]
but found [%7B"changePassword":%7B"adminPass":"foo"%7D%7D]
  RestAnnotationProcessorTest.testCreateGetRequest:2133 expected [/qu%3Fstion] but found [/qu]
  HttpRequestTest.testAddBase64AndUrlEncodedQueryParams:78 expected [GET http://goo.com:443?header1=ABCDEFGHIJKLMNOPQRSTUVWXYZabcdefghijklmnopqrstuvwxyz0123456789%2B/%3D&header2=ABCDEFGHIJKLMNOPQRSTUVWXYZabcdefghijklmnopqrstuvwxyz0123456789%2B/%3D
HTTP/1.1] but found [GET http://goo.com:443?header1=ABCDEFGHIJKLMNOPQRSTUVWXYZabcdefghijklmnopqrstuvwxyz0123456789%20/%3D&header2=ABCDEFGHIJKLMNOPQRSTUVWXYZabcdefghijklmnopqrstuvwxyz0123456789+/=
HTTP/1.1]
  HttpRequestTest.testEncodesOnlyOnce:55 expected [{method=GET, endpoint=http://goo.com:443?header=hello%3F,
headers={}}] but found [{method=GET, endpoint=http://goo.com:443?header=hello?, headers={}}]

Tests run: 818, Failures: 4, Errors: 0, Skipped: 0

[INFO] ------------------------------------------------------------------------
[INFO] Reactor Summary:
[INFO] 
[INFO] Apache jclouds Project ............................ SUCCESS [8.339s]
[INFO] jclouds shared Maven resources .................... SUCCESS [4.587s]
[INFO] jclouds Components Core ........................... FAILURE [51.702s]
[INFO] jclouds OpenStack Components Core ................. SKIPPED
[INFO] jclouds commons project ........................... SKIPPED
[INFO] jclouds script builder ............................ SKIPPED
[INFO] jclouds compute core .............................. SKIPPED
[INFO] jclouds Log4J Logging Module ...................... SKIPPED
[INFO] jclouds loadbalancer core ......................... SKIPPED
[INFO] jclouds sts api ................................... SKIPPED
[INFO] jclouds cloudwatch api ............................ SKIPPED
[INFO] jclouds SLF4J Logging Module ...................... SKIPPED
[INFO] jclouds bouncycastle EncryptionService Module ..... SKIPPED
[INFO] jclouds sshj ssh client ........................... SKIPPED
[INFO] jclouds cloudstack core ........................... SKIPPED
[INFO] jclouds blobstore core ............................ SKIPPED
[INFO] jclouds filesystem core ........................... SKIPPED
[INFO] jclouds bring your own node provider .............. SKIPPED
[INFO] jclouds OkHttp Driver ............................. SKIPPED
[INFO] jclouds s3 api .................................... SKIPPED
[INFO] jclouds ec2 api ................................... SKIPPED
[INFO] jclouds sqs api ................................... SKIPPED
[INFO] jclouds elasticstack core ......................... SKIPPED
[INFO] jclouds atmos components .......................... SKIPPED
[INFO] jclouds openstack-keystone api .................... SKIPPED
[INFO] jclouds swift api ................................. SKIPPED
[INFO] jclouds openstack-cinder api ...................... SKIPPED
[INFO] Apache jclouds :: OpenStack :: Nova API ........... SKIPPED
[INFO] jclouds openstack-nova-ec2 api .................... SKIPPED
[INFO] jclouds openstack-swift api ....................... SKIPPED
[INFO] jclouds openstack-trove api ....................... SKIPPED
[INFO] jclouds cloudfiles api ............................ SKIPPED
[INFO] jclouds rackspace cloudidentity api ............... SKIPPED
[INFO] jclouds Rackspace Cloud Load Balancers API ........ SKIPPED
[INFO] jclouds Rackspace Next Generation Cloud Block Storage US provider  SKIPPED
[INFO] jclouds Rackspace Next Generation Cloud Servers US provider  SKIPPED
[INFO] jclouds rackspace clouddns api .................... SKIPPED
[INFO] jclouds rackspace-cloudfiles api .................. SKIPPED
[INFO] jclouds route53 api ............................... SKIPPED
[INFO] jclouds Chef api .................................. SKIPPED
[INFO] jclouds OAuth core ................................ SKIPPED
[INFO] jclouds apis project .............................. SKIPPED
[INFO] jclouds GoGrid provider ........................... SKIPPED
[INFO] jclouds Azure Storage provider .................... SKIPPED
[INFO] jclouds Apache Http Components Client ............. SKIPPED
[INFO] jclouds joda DateService Module ................... SKIPPED
[INFO] jclouds netty payload module ...................... SKIPPED
[INFO] jclouds enterprise Module ......................... SKIPPED
[INFO] jclouds Amazon Simple Storage Service (S3) provider  SKIPPED
[INFO] jclouds Amazon Elastic Load Balancer provider ..... SKIPPED
[INFO] jclouds Amazon EC2 provider ....................... SKIPPED
[INFO] jclouds Amazon Simple Queue Service provider ...... SKIPPED
[INFO] jclouds ElasticHosts Peer1 London provider ........ SKIPPED
[INFO] jclouds ElasticHosts Peer1 San Antonio provider ... SKIPPED
[INFO] jclouds ElasticHosts BlueSquare London provider ... SKIPPED
[INFO] jclouds ElasticHosts Peer1 Toronto provider ....... SKIPPED
[INFO] jclouds ElasticHosts Peer1 Los Angeles provider ... SKIPPED
[INFO] jclouds ElasticHosts Amsterdam provider ........... SKIPPED
[INFO] jclouds ElasticHosts San Jose provider ............ SKIPPED
[INFO] jclouds ElasticHosts Hong Kong provider ........... SKIPPED
[INFO] jclouds ElasticHosts Sydney provider .............. SKIPPED
[INFO] jclouds Open Hosting East1 provider ............... SKIPPED
[INFO] jclouds Serverlove Manchester provider ............ SKIPPED
[INFO] jclouds SkaliCloud Malaysia provider .............. SKIPPED
[INFO] jclouds Go2Cloud Johannesburg1 provider ........... SKIPPED
[INFO] jclouds SoftLayer core ............................ SKIPPED
[INFO] jclouds HP Cloud Compute provider ................. SKIPPED
[INFO] jclouds HP Cloud Block Storage Provider ........... SKIPPED
[INFO] jclouds HP Cloud Object Storage ................... SKIPPED
[INFO] jclouds CloudFiles US provider .................... SKIPPED
[INFO] jclouds CloudFiles UK provider .................... SKIPPED
[INFO] jclouds Rackspace Cloud Files US provider ......... SKIPPED
[INFO] jclouds Rackspace Cloud Files UK provider ......... SKIPPED
[INFO] jclouds Rackspace Next Generation Cloud DNS US provider  SKIPPED
[INFO] jclouds Rackspace Next Generation Cloud DNS UK provider  SKIPPED
[INFO] jclouds Rackspace Cloud Databases US provider ..... SKIPPED
[INFO] jclouds Rackspace Cloud Databases UK provider ..... SKIPPED
[INFO] jclouds Rackspace Cloud Load Balancers US provider  SKIPPED
[INFO] jclouds Rackspace Cloud Load Balancers UK provider  SKIPPED
[INFO] jclouds Rackspace Next Generation Cloud Block Storage UK provider  SKIPPED
[INFO] jclouds Rackspace Next Generation Cloud Servers provider  SKIPPED
[INFO] jclouds GleSYS core ............................... SKIPPED
[INFO] jclouds Amazon Identity and Access Management (STS) provider  SKIPPED
[INFO] jclouds Amazon Route 53 provider .................. SKIPPED
[INFO] jclouds ultradns-ws provider ...................... SKIPPED
[INFO] jclouds dynect api ................................ SKIPPED
[INFO] jclouds Enterprise Chef provider .................. SKIPPED
[INFO] jclouds providers project ......................... SKIPPED
[INFO] jclouds jsch ssh client ........................... SKIPPED
[INFO] jclouds example components for a standalone compute provider  SKIPPED
[INFO] jclouds skeletons project ......................... SKIPPED
[INFO] jclouds Google App Engine Components .............. SKIPPED
[INFO] jclouds drivers project ........................... SKIPPED
[INFO] allcompute ........................................ SKIPPED
[INFO] allblobstore ...................................... SKIPPED
[INFO] allloadbalancer ................................... SKIPPED
[INFO] all ............................................... SKIPPED
[INFO] Apache jclouds .................................... SKIPPED
[INFO] ------------------------------------------------------------------------
[INFO] BUILD FAILURE
[INFO] ------------------------------------------------------------------------
[INFO] Total time: 1:06.844s
[INFO] Finished at: Wed May 27 20:21:43 EDT 2015
[INFO] Final Memory: 91M/321M
[INFO] ------------------------------------------------------------------------
[ERROR] Failed to execute goal org.apache.maven.plugins:maven-surefire-plugin:2.17:test (default-test)
on project jclouds-core: There are test failures.
[ERROR] 
[ERROR] Please refer to <https://jclouds.ci.cloudbees.com/job/jclouds-guava-17-18/GUAVA_VERSION=18.0,jdk=OpenJDK%207%20(latest)/ws/core/target/surefire-reports>
for the individual test results.
[ERROR] -> [Help 1]
org.apache.maven.lifecycle.LifecycleExecutionException: Failed to execute goal org.apache.maven.plugins:maven-surefire-plugin:2.17:test
(default-test) on project jclouds-core: There are test failures.

Please refer to <https://jclouds.ci.cloudbees.com/job/jclouds-guava-17-18/GUAVA_VERSION=18.0,jdk=OpenJDK%207%20(latest)/ws/core/target/surefire-reports>
for the individual test results.
	at org.apache.maven.lifecycle.internal.MojoExecutor.execute(MojoExecutor.java:213)
	at org.apache.maven.lifecycle.internal.MojoExecutor.execute(MojoExecutor.java:153)
	at org.apache.maven.lifecycle.internal.MojoExecutor.execute(MojoExecutor.java:145)
	at org.apache.maven.lifecycle.internal.LifecycleModuleBuilder.buildProject(LifecycleModuleBuilder.java:84)
	at org.apache.maven.lifecycle.internal.LifecycleModuleBuilder.buildProject(LifecycleModuleBuilder.java:59)
	at org.apache.maven.lifecycle.internal.LifecycleStarter.singleThreadedBuild(LifecycleStarter.java:183)
	at org.apache.maven.lifecycle.internal.LifecycleStarter.execute(LifecycleStarter.java:161)
	at org.apache.maven.DefaultMaven.doExecute(DefaultMaven.java:320)
	at org.apache.maven.DefaultMaven.execute(DefaultMaven.java:156)
	at org.apache.maven.cli.MavenCli.execute(MavenCli.java:537)
	at org.apache.maven.cli.MavenCli.doMain(MavenCli.java:196)
	at org.apache.maven.cli.MavenCli.main(MavenCli.java:141)
	at sun.reflect.NativeMethodAccessorImpl.invoke0(Native Method)
	at sun.reflect.NativeMethodAccessorImpl.invoke(NativeMethodAccessorImpl.java:57)
	at sun.reflect.DelegatingMethodAccessorImpl.invoke(DelegatingMethodAccessorImpl.java:43)
	at java.lang.reflect.Method.invoke(Method.java:606)
	at org.codehaus.plexus.classworlds.launcher.Launcher.launchEnhanced(Launcher.java:290)
	at org.codehaus.plexus.classworlds.launcher.Launcher.launch(Launcher.java:230)
	at org.codehaus.plexus.classworlds.launcher.Launcher.mainWithExitCode(Launcher.java:409)
	at org.codehaus.plexus.classworlds.launcher.Launcher.main(Launcher.java:352)
Caused by: org.apache.maven.plugin.MojoFailureException: There are test failures.

Please refer to <https://jclouds.ci.cloudbees.com/job/jclouds-guava-17-18/GUAVA_VERSION=18.0,jdk=OpenJDK%207%20(latest)/ws/core/target/surefire-reports>
for the individual test results.
	at org.apache.maven.plugin.surefire.SurefireHelper.reportExecution(SurefireHelper.java:82)
	at org.apache.maven.plugin.surefire.SurefirePlugin.handleSummary(SurefirePlugin.java:195)
	at org.apache.maven.plugin.surefire.AbstractSurefireMojo.executeAfterPreconditionsChecked(AbstractSurefireMojo.java:861)
	at org.apache.maven.plugin.surefire.AbstractSurefireMojo.execute(AbstractSurefireMojo.java:729)
	at org.apache.maven.plugin.DefaultBuildPluginManager.executeMojo(DefaultBuildPluginManager.java:101)
	at org.apache.maven.lifecycle.internal.MojoExecutor.execute(MojoExecutor.java:209)
	... 19 more
[ERROR] 
[ERROR] Re-run Maven using the -X switch to enable full debug logging.
[ERROR] 
[ERROR] For more information about the errors and possible solutions, please read the following
articles:
[ERROR] [Help 1] http://cwiki.apache.org/confluence/display/MAVEN/MojoFailureException
[ERROR] 
[ERROR] After correcting the problems, you can resume the build with the command
[ERROR]   mvn <goals> -rf :jclouds-core
Build step 'Invoke top-level Maven targets' marked build as failure

Mime
View raw message