jclouds-notifications mailing list archives

Site index · List index
Message view « Date » · « Thread »
Top « Date » · « Thread »
From jenkins-no-re...@cloudbees.com
Subject Build failed in Jenkins: jclouds-labs-1.9.x-branch #108
Date Wed, 01 Jul 2015 16:35:56 GMT
See <https://jclouds.ci.cloudbees.com/job/jclouds-labs-1.9.x-branch/108/changes>

Changes:

[Andrea Turli] [azurecompute] fix JCLOUDS-952

------------------------------------------
[...truncated 2917 lines...]
Downloaded: https://repository.apache.org/content/repositories/snapshots/org/apache/jclouds/labs/jclouds-labs/1.9.1-SNAPSHOT/maven-metadata.xml
(2 KB at 1.0 KB/sec)
Uploading: https://repository.apache.org/content/repositories/snapshots/org/apache/jclouds/labs/jclouds-labs/1.9.1-SNAPSHOT/jclouds-labs-1.9.1-20150701.163526-99.pom
Uploaded: https://repository.apache.org/content/repositories/snapshots/org/apache/jclouds/labs/jclouds-labs/1.9.1-SNAPSHOT/jclouds-labs-1.9.1-20150701.163526-99.pom
(7 KB at 7.4 KB/sec)
Downloading: https://repository.apache.org/content/repositories/snapshots/org/apache/jclouds/labs/jclouds-labs/maven-metadata.xml
Downloaded: https://repository.apache.org/content/repositories/snapshots/org/apache/jclouds/labs/jclouds-labs/maven-metadata.xml
(595 B at 0.9 KB/sec)
Uploading: https://repository.apache.org/content/repositories/snapshots/org/apache/jclouds/labs/jclouds-labs/1.9.1-SNAPSHOT/maven-metadata.xml
Uploaded: https://repository.apache.org/content/repositories/snapshots/org/apache/jclouds/labs/jclouds-labs/1.9.1-SNAPSHOT/maven-metadata.xml
(2 KB at 1.3 KB/sec)
Uploading: https://repository.apache.org/content/repositories/snapshots/org/apache/jclouds/labs/jclouds-labs/maven-metadata.xml
Uploaded: https://repository.apache.org/content/repositories/snapshots/org/apache/jclouds/labs/jclouds-labs/maven-metadata.xml
(595 B at 0.7 KB/sec)
Uploading: https://repository.apache.org/content/repositories/snapshots/org/apache/jclouds/labs/jclouds-labs/1.9.1-SNAPSHOT/jclouds-labs-1.9.1-20150701.163526-99-tests.jar
Uploaded: https://repository.apache.org/content/repositories/snapshots/org/apache/jclouds/labs/jclouds-labs/1.9.1-SNAPSHOT/jclouds-labs-1.9.1-20150701.163526-99-tests.jar
(4 KB at 3.9 KB/sec)
Uploading: https://repository.apache.org/content/repositories/snapshots/org/apache/jclouds/labs/jclouds-labs/1.9.1-SNAPSHOT/maven-metadata.xml
Uploaded: https://repository.apache.org/content/repositories/snapshots/org/apache/jclouds/labs/jclouds-labs/1.9.1-SNAPSHOT/maven-metadata.xml
(2 KB at 1.2 KB/sec)
Uploading: https://repository.apache.org/content/repositories/snapshots/org/apache/jclouds/labs/jclouds-labs/1.9.1-SNAPSHOT/jclouds-labs-1.9.1-20150701.163526-99-javadoc.jar
Uploaded: https://repository.apache.org/content/repositories/snapshots/org/apache/jclouds/labs/jclouds-labs/1.9.1-SNAPSHOT/jclouds-labs-1.9.1-20150701.163526-99-javadoc.jar
(5333 KB at 1346.6 KB/sec)
Uploading: https://repository.apache.org/content/repositories/snapshots/org/apache/jclouds/labs/jclouds-labs/1.9.1-SNAPSHOT/maven-metadata.xml
Uploaded: https://repository.apache.org/content/repositories/snapshots/org/apache/jclouds/labs/jclouds-labs/1.9.1-SNAPSHOT/maven-metadata.xml
(2 KB at 1.3 KB/sec)
Started calculate disk usage of build
Finished Calculation of disk usage of build in 0 seconds
Started calculate disk usage of workspace
Finished Calculation of disk usage of workspace in  1 second
[INFO]                                                                         
[INFO] ------------------------------------------------------------------------
[INFO] Building jclouds azure compute API 1.9.1-SNAPSHOT
[INFO] ------------------------------------------------------------------------
Downloading: https://repository-jclouds.forge.cloudbees.com/release/org/apache/maven/plugins/maven-resources-plugin/2.6/maven-resources-plugin-2.6.pom
Downloading: http://repo.cloudbees.com/content/repositories/central/org/apache/maven/plugins/maven-resources-plugin/2.6/maven-resources-plugin-2.6.pom
Downloaded: http://repo.cloudbees.com/content/repositories/central/org/apache/maven/plugins/maven-resources-plugin/2.6/maven-resources-plugin-2.6.pom
(8 KB at 440.3 KB/sec)
Downloading: https://repository-jclouds.forge.cloudbees.com/release/org/apache/maven/plugins/maven-resources-plugin/2.6/maven-resources-plugin-2.6.jar
Downloading: http://repo.cloudbees.com/content/repositories/central/org/apache/maven/plugins/maven-resources-plugin/2.6/maven-resources-plugin-2.6.jar
Downloaded: http://repo.cloudbees.com/content/repositories/central/org/apache/maven/plugins/maven-resources-plugin/2.6/maven-resources-plugin-2.6.jar
(29 KB at 1695.7 KB/sec)
Downloading: https://repository-jclouds.forge.cloudbees.com/release/org/apache/maven/plugins/maven-compiler-plugin/3.1/maven-compiler-plugin-3.1.pom
Downloading: http://repo.cloudbees.com/content/repositories/central/org/apache/maven/plugins/maven-compiler-plugin/3.1/maven-compiler-plugin-3.1.pom
Downloaded: http://repo.cloudbees.com/content/repositories/central/org/apache/maven/plugins/maven-compiler-plugin/3.1/maven-compiler-plugin-3.1.pom
(10 KB at 415.4 KB/sec)
Downloading: https://repository-jclouds.forge.cloudbees.com/release/org/apache/maven/plugins/maven-compiler-plugin/3.1/maven-compiler-plugin-3.1.jar
Downloading: http://repo.cloudbees.com/content/repositories/central/org/apache/maven/plugins/maven-compiler-plugin/3.1/maven-compiler-plugin-3.1.jar
Downloaded: http://repo.cloudbees.com/content/repositories/central/org/apache/maven/plugins/maven-compiler-plugin/3.1/maven-compiler-plugin-3.1.jar
(42 KB at 2330.1 KB/sec)
[INFO] 
[INFO] --- maven-clean-plugin:2.5:clean (default-clean) @ azurecompute ---
[INFO] 
[INFO] --- maven-enforcer-plugin:1.1.1:enforce (enforce-banned-dependencies) @ azurecompute
---
[INFO] 
[INFO] --- maven-enforcer-plugin:1.1.1:enforce (enforce-java) @ azurecompute ---
[INFO] 
[INFO] --- maven-remote-resources-plugin:1.5:process (default) @ azurecompute ---
[INFO] artifact net.schmizz:sshj: checking for updates from central
[INFO] artifact net.schmizz:sshj: checking for updates from cloudbees-private-release-repository
[INFO] artifact net.schmizz:sshj: checking for updates from jclouds-sona-snapshots-nexus
[INFO] 
[INFO] --- maven-resources-plugin:2.6:resources (default-resources) @ azurecompute ---
Downloading: https://repository-jclouds.forge.cloudbees.com/release/org/codehaus/plexus/plexus-utils/2.0.5/plexus-utils-2.0.5.jar
Downloading: http://repo.cloudbees.com/content/repositories/central/org/codehaus/plexus/plexus-utils/2.0.5/plexus-utils-2.0.5.jar
Downloaded: http://repo.cloudbees.com/content/repositories/central/org/codehaus/plexus/plexus-utils/2.0.5/plexus-utils-2.0.5.jar
(218 KB at 8071.9 KB/sec)
[INFO] Using 'UTF-8' encoding to copy filtered resources.
[INFO] skip non existing resourceDirectory <https://jclouds.ci.cloudbees.com/job/jclouds-labs-1.9.x-branch/ws/azurecompute/src/main/clojure>
[INFO] skip non existing resourceDirectory <https://jclouds.ci.cloudbees.com/job/jclouds-labs-1.9.x-branch/ws/azurecompute/src/main/resources>
[INFO] skip non existing resourceDirectory <https://jclouds.ci.cloudbees.com/job/jclouds-labs-1.9.x-branch/ws/azurecompute/target/classes>
[INFO] Copying 3 resources
[INFO] 
[INFO] --- maven-compiler-plugin:3.1:compile (default-compile) @ azurecompute ---
Downloading: https://repository-jclouds.forge.cloudbees.com/release/org/apache/maven/maven-toolchain/1.0/maven-toolchain-1.0.pom
Downloading: http://repo.cloudbees.com/content/repositories/central/org/apache/maven/maven-toolchain/1.0/maven-toolchain-1.0.pom
Downloaded: http://repo.cloudbees.com/content/repositories/central/org/apache/maven/maven-toolchain/1.0/maven-toolchain-1.0.pom
(4 KB at 196.1 KB/sec)
Downloading: https://repository-jclouds.forge.cloudbees.com/release/org/apache/maven/shared/maven-shared-utils/0.1/maven-shared-utils-0.1.pom
Downloading: http://repo.cloudbees.com/content/repositories/central/org/apache/maven/shared/maven-shared-utils/0.1/maven-shared-utils-0.1.pom
Downloaded: http://repo.cloudbees.com/content/repositories/central/org/apache/maven/shared/maven-shared-utils/0.1/maven-shared-utils-0.1.pom
(4 KB at 263.5 KB/sec)
Downloading: https://repository-jclouds.forge.cloudbees.com/release/org/apache/maven/shared/maven-shared-incremental/1.1/maven-shared-incremental-1.1.pom
Downloading: http://repo.cloudbees.com/content/repositories/central/org/apache/maven/shared/maven-shared-incremental/1.1/maven-shared-incremental-1.1.pom
Downloaded: http://repo.cloudbees.com/content/repositories/central/org/apache/maven/shared/maven-shared-incremental/1.1/maven-shared-incremental-1.1.pom
(5 KB at 231.5 KB/sec)
Downloading: https://repository-jclouds.forge.cloudbees.com/release/org/codehaus/plexus/plexus-compiler-api/2.2/plexus-compiler-api-2.2.pom
Downloading: http://repo.cloudbees.com/content/repositories/central/org/codehaus/plexus/plexus-compiler-api/2.2/plexus-compiler-api-2.2.pom
Downloaded: http://repo.cloudbees.com/content/repositories/central/org/codehaus/plexus/plexus-compiler-api/2.2/plexus-compiler-api-2.2.pom
(865 B at 60.3 KB/sec)
Downloading: https://repository-jclouds.forge.cloudbees.com/release/org/codehaus/plexus/plexus-compiler/2.2/plexus-compiler-2.2.pom
Downloading: http://repo.cloudbees.com/content/repositories/central/org/codehaus/plexus/plexus-compiler/2.2/plexus-compiler-2.2.pom
Downloaded: http://repo.cloudbees.com/content/repositories/central/org/codehaus/plexus/plexus-compiler/2.2/plexus-compiler-2.2.pom
(4 KB at 220.6 KB/sec)
Downloading: https://repository-jclouds.forge.cloudbees.com/release/org/codehaus/plexus/plexus-compiler-manager/2.2/plexus-compiler-manager-2.2.pom
Downloading: http://repo.cloudbees.com/content/repositories/central/org/codehaus/plexus/plexus-compiler-manager/2.2/plexus-compiler-manager-2.2.pom
Downloaded: http://repo.cloudbees.com/content/repositories/central/org/codehaus/plexus/plexus-compiler-manager/2.2/plexus-compiler-manager-2.2.pom
(690 B at 44.9 KB/sec)
Downloading: https://repository-jclouds.forge.cloudbees.com/release/org/codehaus/plexus/plexus-compiler-javac/2.2/plexus-compiler-javac-2.2.pom
Downloading: http://repo.cloudbees.com/content/repositories/central/org/codehaus/plexus/plexus-compiler-javac/2.2/plexus-compiler-javac-2.2.pom
Downloaded: http://repo.cloudbees.com/content/repositories/central/org/codehaus/plexus/plexus-compiler-javac/2.2/plexus-compiler-javac-2.2.pom
(769 B at 46.9 KB/sec)
Downloading: https://repository-jclouds.forge.cloudbees.com/release/org/codehaus/plexus/plexus-compilers/2.2/plexus-compilers-2.2.pom
Downloading: http://repo.cloudbees.com/content/repositories/central/org/codehaus/plexus/plexus-compilers/2.2/plexus-compilers-2.2.pom
Downloaded: http://repo.cloudbees.com/content/repositories/central/org/codehaus/plexus/plexus-compilers/2.2/plexus-compilers-2.2.pom
(2 KB at 75.7 KB/sec)
Downloading: https://repository-jclouds.forge.cloudbees.com/release/org/apache/maven/shared/maven-shared-utils/0.1/maven-shared-utils-0.1.jar
Downloading: https://repository-jclouds.forge.cloudbees.com/release/org/apache/maven/shared/maven-shared-incremental/1.1/maven-shared-incremental-1.1.jar
Downloading: https://repository-jclouds.forge.cloudbees.com/release/org/codehaus/plexus/plexus-compiler-api/2.2/plexus-compiler-api-2.2.jar
Downloading: https://repository-jclouds.forge.cloudbees.com/release/org/codehaus/plexus/plexus-compiler-manager/2.2/plexus-compiler-manager-2.2.jar
Downloading: https://repository-jclouds.forge.cloudbees.com/release/org/codehaus/plexus/plexus-compiler-javac/2.2/plexus-compiler-javac-2.2.jar
Downloading: https://repository-jclouds.forge.cloudbees.com/release/org/apache/xbean/xbean-reflect/3.4/xbean-reflect-3.4.jar
Downloading: https://repository-jclouds.forge.cloudbees.com/release/commons-logging/commons-logging-api/1.1/commons-logging-api-1.1.jar
Downloading: https://repository-jclouds.forge.cloudbees.com/release/log4j/log4j/1.2.12/log4j-1.2.12.jar
Downloading: https://repository-jclouds.forge.cloudbees.com/release/com/google/collections/google-collections/1.0/google-collections-1.0.jar
Downloading: https://repository-jclouds.forge.cloudbees.com/release/junit/junit/3.8.2/junit-3.8.2.jar
Downloading: http://repo.cloudbees.com/content/repositories/central/org/apache/maven/shared/maven-shared-utils/0.1/maven-shared-utils-0.1.jar
Downloading: http://repo.cloudbees.com/content/repositories/central/org/apache/maven/shared/maven-shared-incremental/1.1/maven-shared-incremental-1.1.jar
Downloading: http://repo.cloudbees.com/content/repositories/central/org/codehaus/plexus/plexus-compiler-api/2.2/plexus-compiler-api-2.2.jar
Downloading: http://repo.cloudbees.com/content/repositories/central/org/codehaus/plexus/plexus-compiler-manager/2.2/plexus-compiler-manager-2.2.jar
Downloading: http://repo.cloudbees.com/content/repositories/central/org/codehaus/plexus/plexus-compiler-javac/2.2/plexus-compiler-javac-2.2.jar
Downloaded: http://repo.cloudbees.com/content/repositories/central/org/codehaus/plexus/plexus-compiler-manager/2.2/plexus-compiler-manager-2.2.jar
(5 KB at 193.7 KB/sec)
Downloading: http://repo.cloudbees.com/content/repositories/central/org/apache/xbean/xbean-reflect/3.4/xbean-reflect-3.4.jar
Downloaded: http://repo.cloudbees.com/content/repositories/central/org/codehaus/plexus/plexus-compiler-api/2.2/plexus-compiler-api-2.2.jar
(25 KB at 871.6 KB/sec)
Downloading: http://repo.cloudbees.com/content/repositories/central/log4j/log4j/1.2.12/log4j-1.2.12.jar
Downloaded: http://repo.cloudbees.com/content/repositories/central/org/apache/maven/shared/maven-shared-incremental/1.1/maven-shared-incremental-1.1.jar
(14 KB at 455.9 KB/sec)
Downloading: http://repo.cloudbees.com/content/repositories/central/commons-logging/commons-logging-api/1.1/commons-logging-api-1.1.jar
Downloaded: http://repo.cloudbees.com/content/repositories/central/org/codehaus/plexus/plexus-compiler-javac/2.2/plexus-compiler-javac-2.2.jar
(19 KB at 638.8 KB/sec)
Downloading: http://repo.cloudbees.com/content/repositories/central/com/google/collections/google-collections/1.0/google-collections-1.0.jar
Downloaded: http://repo.cloudbees.com/content/repositories/central/org/apache/xbean/xbean-reflect/3.4/xbean-reflect-3.4.jar
(131 KB at 4356.3 KB/sec)
Downloaded: http://repo.cloudbees.com/content/repositories/central/commons-logging/commons-logging-api/1.1/commons-logging-api-1.1.jar
(44 KB at 1814.7 KB/sec)
Downloading: http://repo.cloudbees.com/content/repositories/central/junit/junit/3.8.2/junit-3.8.2.jar
Downloaded: http://repo.cloudbees.com/content/repositories/central/org/apache/maven/shared/maven-shared-utils/0.1/maven-shared-utils-0.1.jar
(151 KB at 2694.6 KB/sec)
Downloaded: http://repo.cloudbees.com/content/repositories/central/log4j/log4j/1.2.12/log4j-1.2.12.jar
(350 KB at 9451.1 KB/sec)
Downloaded: http://repo.cloudbees.com/content/repositories/central/com/google/collections/google-collections/1.0/google-collections-1.0.jar
(625 KB at 14195.5 KB/sec)
Downloaded: http://repo.cloudbees.com/content/repositories/central/junit/junit/3.8.2/junit-3.8.2.jar
(118 KB at 5355.1 KB/sec)
[INFO] Changes detected - recompiling the module!
[INFO] Compiling 160 source files to <https://jclouds.ci.cloudbees.com/job/jclouds-labs-1.9.x-branch/ws/azurecompute/target/classes>
[WARNING] bootstrap class path not set in conjunction with -source 1.6
[WARNING] No processor claimed any of these annotations: org.jclouds.rest.annotations.ResponseParser,com.google.inject.Singleton,javax.ws.rs.PUT,javax.ws.rs.Path,org.jclouds.rest.annotations.PayloadParam,javax.ws.rs.GET,javax.inject.Inject,org.jclouds.rest.annotations.Payload,org.jclouds.rest.annotations.ParamParser,javax.inject.Named,com.google.inject.Provides,javax.annotation.Resource,javax.ws.rs.POST,javax.ws.rs.PathParam,org.jclouds.rest.annotations.Delegate,javax.inject.Singleton,org.jclouds.rest.annotations.Headers,org.jclouds.location.Provider,org.jclouds.rest.annotations.BinderParam,com.google.inject.Inject,org.jclouds.rest.annotations.QueryParams,org.jclouds.rest.annotations.XMLResponseParser,com.google.auto.value.AutoValue,org.jclouds.collect.Memoized,org.jclouds.javax.annotation.Nullable,javax.ws.rs.Consumes,org.jclouds.rest.annotations.SinceApiVersion,com.google.common.annotations.VisibleForTesting,org.jclouds.rest.ConfiguresHttpApi,org.jclouds.rest.annotations.Fallback,javax.ws.rs.Produces,javax.ws.rs.DELETE
[WARNING] No processor claimed any of these annotations: org.jclouds.rest.annotations.SinceApiVersion,org.jclouds.javax.annotation.Nullable,javax.annotation.Generated
[WARNING] <https://jclouds.ci.cloudbees.com/job/jclouds-labs-1.9.x-branch/ws/azurecompute/src/main/java/org/jclouds/azurecompute/binders/CaptureVMImageParamsToXML.java>:
Some input files use unchecked or unsafe operations.
[WARNING] <https://jclouds.ci.cloudbees.com/job/jclouds-labs-1.9.x-branch/ws/azurecompute/src/main/java/org/jclouds/azurecompute/binders/CaptureVMImageParamsToXML.java>:
Recompile with -Xlint:unchecked for details.
[INFO] 
[INFO] --- maven-resources-plugin:2.6:testResources (default-testResources) @ azurecompute
---
[INFO] Using 'UTF-8' encoding to copy filtered resources.
[INFO] skip non existing resourceDirectory <https://jclouds.ci.cloudbees.com/job/jclouds-labs-1.9.x-branch/ws/azurecompute/src/test/clojure>
[INFO] Copying 57 resources
[INFO] Copying 3 resources
[INFO] 
[INFO] --- maven-compiler-plugin:3.1:testCompile (default-testCompile) @ azurecompute ---
[INFO] Changes detected - recompiling the module!
[INFO] Compiling 70 source files to <https://jclouds.ci.cloudbees.com/job/jclouds-labs-1.9.x-branch/ws/azurecompute/target/test-classes>
[INFO] -------------------------------------------------------------
[WARNING] COMPILATION WARNING : 
[INFO] -------------------------------------------------------------
[WARNING] bootstrap class path not set in conjunction with -source 1.6
[INFO] 1 warning
[INFO] -------------------------------------------------------------
[INFO] -------------------------------------------------------------
[ERROR] COMPILATION ERROR : 
[INFO] -------------------------------------------------------------
[ERROR] <https://jclouds.ci.cloudbees.com/job/jclouds-labs-1.9.x-branch/ws/azurecompute/src/test/java/org/jclouds/azurecompute/compute/AzureComputeServiceContextLiveTest.java>:[25,1]
class, interface, or enum expected
[ERROR] <https://jclouds.ci.cloudbees.com/job/jclouds-labs-1.9.x-branch/ws/azurecompute/src/test/java/org/jclouds/azurecompute/compute/AzureComputeServiceContextLiveTest.java>:[32,1]
class, interface, or enum expected
[ERROR] <https://jclouds.ci.cloudbees.com/job/jclouds-labs-1.9.x-branch/ws/azurecompute/src/test/java/org/jclouds/azurecompute/compute/AzureComputeServiceContextLiveTest.java>:[36,1]
class, interface, or enum expected
[ERROR] <https://jclouds.ci.cloudbees.com/job/jclouds-labs-1.9.x-branch/ws/azurecompute/src/test/java/org/jclouds/azurecompute/compute/AzureComputeServiceContextLiveTest.java>:[44,1]
class, interface, or enum expected
[INFO] 4 errors 
[INFO] -------------------------------------------------------------
Started calculate disk usage of build
Finished Calculation of disk usage of build in 0 seconds
Started calculate disk usage of workspace
Finished Calculation of disk usage of workspace in 0 seconds
[INFO] ------------------------------------------------------------------------
[INFO] Reactor Summary:
[INFO] 
[INFO] Apache jclouds labs ............................... SUCCESS [1:51.480s]
[INFO] jclouds azure compute API ......................... FAILURE [10.278s]
[INFO] jclouds docker API ................................ SKIPPED
[INFO] jclouds cdmi api .................................. SKIPPED
[INFO] jclouds CloudSigma v2 API ......................... SKIPPED
[INFO] jclouds CloudSigma v2 Honolulu Provider ........... SKIPPED
[INFO] jclouds CloudSigma v2 Las Vegas Provider .......... SKIPPED
[INFO] jclouds CloudSigma v2 San Jose Provider ........... SKIPPED
[INFO] jclouds CloudSigma v2 Washington DC Provider ...... SKIPPED
[INFO] jclouds CloudSigma v2 Zurich Provider ............. SKIPPED
[INFO] jclouds DigitalOcean Provider ..................... SKIPPED
[INFO] jclouds joyent-cloudapi api ....................... SKIPPED
[INFO] jclouds joyentcloud provider ...................... SKIPPED
[INFO] jclouds Abiquo api ................................ SKIPPED
[INFO] jclouds ProfitBricks api .......................... SKIPPED
[INFO] jclouds shipyard API .............................. SKIPPED
[INFO] ------------------------------------------------------------------------
[INFO] BUILD FAILURE
[INFO] ------------------------------------------------------------------------
[INFO] Total time: 2:09.871s
[INFO] Finished at: Wed Jul 01 12:35:49 EDT 2015
[INFO] Final Memory: 39M/154M
[INFO] ------------------------------------------------------------------------
Waiting for Jenkins to finish collecting data
[ERROR] Failed to execute goal org.apache.maven.plugins:maven-compiler-plugin:3.1:testCompile
(default-testCompile) on project azurecompute: Compilation failure: Compilation failure:
[ERROR] <https://jclouds.ci.cloudbees.com/job/jclouds-labs-1.9.x-branch/ws/azurecompute/src/test/java/org/jclouds/azurecompute/compute/AzureComputeServiceContextLiveTest.java>:[25,1]
class, interface, or enum expected
[ERROR] <https://jclouds.ci.cloudbees.com/job/jclouds-labs-1.9.x-branch/ws/azurecompute/src/test/java/org/jclouds/azurecompute/compute/AzureComputeServiceContextLiveTest.java>:[32,1]
class, interface, or enum expected
[ERROR] <https://jclouds.ci.cloudbees.com/job/jclouds-labs-1.9.x-branch/ws/azurecompute/src/test/java/org/jclouds/azurecompute/compute/AzureComputeServiceContextLiveTest.java>:[36,1]
class, interface, or enum expected
[ERROR] <https://jclouds.ci.cloudbees.com/job/jclouds-labs-1.9.x-branch/ws/azurecompute/src/test/java/org/jclouds/azurecompute/compute/AzureComputeServiceContextLiveTest.java>:[44,1]
class, interface, or enum expected
[ERROR] -> [Help 1]
org.apache.maven.lifecycle.LifecycleExecutionException: Failed to execute goal org.apache.maven.plugins:maven-compiler-plugin:3.1:testCompile
(default-testCompile) on project azurecompute: Compilation failure
	at org.apache.maven.lifecycle.internal.MojoExecutor.execute(MojoExecutor.java:213)
	at org.apache.maven.lifecycle.internal.MojoExecutor.execute(MojoExecutor.java:153)
	at org.apache.maven.lifecycle.internal.MojoExecutor.execute(MojoExecutor.java:145)
	at org.apache.maven.lifecycle.internal.LifecycleModuleBuilder.buildProject(LifecycleModuleBuilder.java:84)
	at org.apache.maven.lifecycle.internal.LifecycleModuleBuilder.buildProject(LifecycleModuleBuilder.java:59)
	at org.apache.maven.lifecycle.internal.LifecycleStarter.singleThreadedBuild(LifecycleStarter.java:183)
	at org.apache.maven.lifecycle.internal.LifecycleStarter.execute(LifecycleStarter.java:161)
	at org.apache.maven.DefaultMaven.doExecute(DefaultMaven.java:320)
	at org.apache.maven.DefaultMaven.execute(DefaultMaven.java:156)
	at org.jvnet.hudson.maven3.launcher.Maven3Launcher.main(Maven3Launcher.java:117)
	at sun.reflect.NativeMethodAccessorImpl.invoke0(Native Method)
	at sun.reflect.NativeMethodAccessorImpl.invoke(NativeMethodAccessorImpl.java:57)
	at sun.reflect.DelegatingMethodAccessorImpl.invoke(DelegatingMethodAccessorImpl.java:43)
	at java.lang.reflect.Method.invoke(Method.java:606)
	at org.codehaus.plexus.classworlds.launcher.Launcher.launchStandard(Launcher.java:329)
	at org.codehaus.plexus.classworlds.launcher.Launcher.launch(Launcher.java:239)
	at org.jvnet.hudson.maven3.agent.Maven3Main.launch(Maven3Main.java:178)
	at sun.reflect.NativeMethodAccessorImpl.invoke0(Native Method)
	at sun.reflect.NativeMethodAccessorImpl.invoke(NativeMethodAccessorImpl.java:57)
	at sun.reflect.DelegatingMethodAccessorImpl.invoke(DelegatingMethodAccessorImpl.java:43)
	at java.lang.reflect.Method.invoke(Method.java:606)
	at hudson.maven.Maven3Builder.call(Maven3Builder.java:136)
	at hudson.maven.Maven3Builder.call(Maven3Builder.java:71)
	at hudson.remoting.UserRequest.perform(UserRequest.java:121)
	at hudson.remoting.UserRequest.perform(UserRequest.java:49)
	at hudson.remoting.Request$2.run(Request.java:324)
	at hudson.remoting.InterceptingExecutorService$1.call(InterceptingExecutorService.java:68)
	at java.util.concurrent.FutureTask.run(FutureTask.java:262)
	at java.util.concurrent.ThreadPoolExecutor.runWorker(ThreadPoolExecutor.java:1145)
	at java.util.concurrent.ThreadPoolExecutor$Worker.run(ThreadPoolExecutor.java:615)
	at java.lang.Thread.run(Thread.java:745)
Caused by: org.apache.maven.plugin.compiler.CompilationFailureException: Compilation failure
	at org.apache.maven.plugin.compiler.AbstractCompilerMojo.execute(AbstractCompilerMojo.java:858)
	at org.apache.maven.plugin.compiler.TestCompilerMojo.execute(TestCompilerMojo.java:152)
	at org.apache.maven.plugin.DefaultBuildPluginManager.executeMojo(DefaultBuildPluginManager.java:101)
	at org.apache.maven.lifecycle.internal.MojoExecutor.execute(MojoExecutor.java:209)
	... 30 more
[ERROR] 
[ERROR] Re-run Maven using the -X switch to enable full debug logging.
[ERROR] 
[ERROR] For more information about the errors and possible solutions, please read the following
articles:
[ERROR] [Help 1] http://cwiki.apache.org/confluence/display/MAVEN/MojoFailureException
[ERROR] 
[ERROR] After correcting the problems, you can resume the build with the command
[ERROR]   mvn <goals> -rf :azurecompute
[JENKINS] Archiving <https://jclouds.ci.cloudbees.com/job/jclouds-labs-1.9.x-branch/ws/cloudsigma2/pom.xml>
to org.apache.jclouds.labs/cloudsigma2/1.9.1-SNAPSHOT/cloudsigma2-1.9.1-SNAPSHOT.pom
[JENKINS] Archiving <https://jclouds.ci.cloudbees.com/job/jclouds-labs-1.9.x-branch/ws/cloudsigma2-zrh/pom.xml>
to org.apache.jclouds.labs/cloudsigma2-zrh/1.9.1-SNAPSHOT/cloudsigma2-zrh-1.9.1-SNAPSHOT.pom
[JENKINS] Archiving <https://jclouds.ci.cloudbees.com/job/jclouds-labs-1.9.x-branch/ws/joyent-cloudapi/pom.xml>
to org.apache.jclouds.labs/joyent-cloudapi/1.9.1-SNAPSHOT/joyent-cloudapi-1.9.1-SNAPSHOT.pom
[JENKINS] Archiving <https://jclouds.ci.cloudbees.com/job/jclouds-labs-1.9.x-branch/ws/pom.xml>
to org.apache.jclouds.labs/jclouds-labs/1.9.1-SNAPSHOT/jclouds-labs-1.9.1-SNAPSHOT.pom
[JENKINS] Archiving <https://jclouds.ci.cloudbees.com/job/jclouds-labs-1.9.x-branch/ws/target/jclouds-labs-1.9.1-SNAPSHOT-tests.jar>
to org.apache.jclouds.labs/jclouds-labs/1.9.1-20150701.163526-99/jclouds-labs-1.9.1-20150701.163526-99-tests.jar
[JENKINS] Archiving <https://jclouds.ci.cloudbees.com/job/jclouds-labs-1.9.x-branch/ws/target/jclouds-labs-1.9.1-SNAPSHOT-javadoc.jar>
to org.apache.jclouds.labs/jclouds-labs/1.9.1-20150701.163526-99/jclouds-labs-1.9.1-20150701.163526-99-javadoc.jar
[JENKINS] Archiving <https://jclouds.ci.cloudbees.com/job/jclouds-labs-1.9.x-branch/ws/docker/pom.xml>
to org.apache.jclouds.labs/docker/1.9.1-SNAPSHOT/docker-1.9.1-SNAPSHOT.pom
[JENKINS] Archiving <https://jclouds.ci.cloudbees.com/job/jclouds-labs-1.9.x-branch/ws/cloudsigma2-wdc/pom.xml>
to org.apache.jclouds.labs/cloudsigma2-wdc/1.9.1-SNAPSHOT/cloudsigma2-wdc-1.9.1-SNAPSHOT.pom
[JENKINS] Archiving <https://jclouds.ci.cloudbees.com/job/jclouds-labs-1.9.x-branch/ws/profitbricks/pom.xml>
to org.apache.jclouds.labs/profitbricks/1.9.1-SNAPSHOT/profitbricks-1.9.1-SNAPSHOT.pom
[JENKINS] Archiving <https://jclouds.ci.cloudbees.com/job/jclouds-labs-1.9.x-branch/ws/cloudsigma2-sjc/pom.xml>
to org.apache.jclouds.labs/cloudsigma2-sjc/1.9.1-SNAPSHOT/cloudsigma2-sjc-1.9.1-SNAPSHOT.pom
[JENKINS] Archiving <https://jclouds.ci.cloudbees.com/job/jclouds-labs-1.9.x-branch/ws/digitalocean/pom.xml>
to org.apache.jclouds.labs/digitalocean/1.9.1-SNAPSHOT/digitalocean-1.9.1-SNAPSHOT.pom
[JENKINS] Archiving <https://jclouds.ci.cloudbees.com/job/jclouds-labs-1.9.x-branch/ws/azurecompute/pom.xml>
to org.apache.jclouds.labs/azurecompute/1.9.1-SNAPSHOT/azurecompute-1.9.1-SNAPSHOT.pom
[JENKINS] Archiving <https://jclouds.ci.cloudbees.com/job/jclouds-labs-1.9.x-branch/ws/joyentcloud/pom.xml>
to org.apache.jclouds.labs/joyentcloud/1.9.1-SNAPSHOT/joyentcloud-1.9.1-SNAPSHOT.pom
[JENKINS] Archiving <https://jclouds.ci.cloudbees.com/job/jclouds-labs-1.9.x-branch/ws/shipyard/pom.xml>
to org.apache.jclouds.labs/shipyard/1.9.1-SNAPSHOT/shipyard-1.9.1-SNAPSHOT.pom
[JENKINS] Archiving <https://jclouds.ci.cloudbees.com/job/jclouds-labs-1.9.x-branch/ws/cloudsigma2-lvs/pom.xml>
to org.apache.jclouds.labs/cloudsigma2-lvs/1.9.1-SNAPSHOT/cloudsigma2-lvs-1.9.1-SNAPSHOT.pom
[JENKINS] Archiving <https://jclouds.ci.cloudbees.com/job/jclouds-labs-1.9.x-branch/ws/abiquo/pom.xml>
to org.apache.jclouds.labs/abiquo/1.9.1-SNAPSHOT/abiquo-1.9.1-SNAPSHOT.pom
[JENKINS] Archiving <https://jclouds.ci.cloudbees.com/job/jclouds-labs-1.9.x-branch/ws/cloudsigma2-hnl/pom.xml>
to org.apache.jclouds.labs/cloudsigma2-hnl/1.9.1-SNAPSHOT/cloudsigma2-hnl-1.9.1-SNAPSHOT.pom
[JENKINS] Archiving <https://jclouds.ci.cloudbees.com/job/jclouds-labs-1.9.x-branch/ws/cdmi/pom.xml>
to org.apache.jclouds.labs/cdmi/1.9.1-SNAPSHOT/cdmi-1.9.1-SNAPSHOT.pom
Sending e-mails to: notifications@jclouds.apache.org
channel stopped

Mime
View raw message