jclouds-notifications mailing list archives

Site index · List index
Message view « Date » · « Thread »
Top « Date » · « Thread »
From jenkins-no-re...@cloudbees.com
Subject Build failed in Jenkins: jclouds-labs-1.9.x-branch » jclouds azure compute API #108
Date Wed, 01 Jul 2015 16:35:54 GMT
See <https://jclouds.ci.cloudbees.com/job/jclouds-labs-1.9.x-branch/org.apache.jclouds.labs$azurecompute/108/changes>

Changes:

[Andrea Turli] [azurecompute] fix JCLOUDS-952

------------------------------------------
Started calculate disk usage of build
Finished Calculation of disk usage of build in 0 seconds
Started calculate disk usage of workspace
Finished Calculation of disk usage of workspace in  1 second
[INFO]                                                                         
[INFO] ------------------------------------------------------------------------
[INFO] Building jclouds azure compute API 1.9.1-SNAPSHOT
[INFO] ------------------------------------------------------------------------
Downloading: https://repository-jclouds.forge.cloudbees.com/release/org/apache/maven/plugins/maven-resources-plugin/2.6/maven-resources-plugin-2.6.pom
Downloading: http://repo.cloudbees.com/content/repositories/central/org/apache/maven/plugins/maven-resources-plugin/2.6/maven-resources-plugin-2.6.pom
Downloaded: http://repo.cloudbees.com/content/repositories/central/org/apache/maven/plugins/maven-resources-plugin/2.6/maven-resources-plugin-2.6.pom
(8 KB at 440.3 KB/sec)
Downloading: https://repository-jclouds.forge.cloudbees.com/release/org/apache/maven/plugins/maven-resources-plugin/2.6/maven-resources-plugin-2.6.jar
Downloading: http://repo.cloudbees.com/content/repositories/central/org/apache/maven/plugins/maven-resources-plugin/2.6/maven-resources-plugin-2.6.jar
Downloaded: http://repo.cloudbees.com/content/repositories/central/org/apache/maven/plugins/maven-resources-plugin/2.6/maven-resources-plugin-2.6.jar
(29 KB at 1695.7 KB/sec)
Downloading: https://repository-jclouds.forge.cloudbees.com/release/org/apache/maven/plugins/maven-compiler-plugin/3.1/maven-compiler-plugin-3.1.pom
Downloading: http://repo.cloudbees.com/content/repositories/central/org/apache/maven/plugins/maven-compiler-plugin/3.1/maven-compiler-plugin-3.1.pom
Downloaded: http://repo.cloudbees.com/content/repositories/central/org/apache/maven/plugins/maven-compiler-plugin/3.1/maven-compiler-plugin-3.1.pom
(10 KB at 415.4 KB/sec)
Downloading: https://repository-jclouds.forge.cloudbees.com/release/org/apache/maven/plugins/maven-compiler-plugin/3.1/maven-compiler-plugin-3.1.jar
Downloading: http://repo.cloudbees.com/content/repositories/central/org/apache/maven/plugins/maven-compiler-plugin/3.1/maven-compiler-plugin-3.1.jar
Downloaded: http://repo.cloudbees.com/content/repositories/central/org/apache/maven/plugins/maven-compiler-plugin/3.1/maven-compiler-plugin-3.1.jar
(42 KB at 2330.1 KB/sec)
[INFO] 
[INFO] --- maven-clean-plugin:2.5:clean (default-clean) @ azurecompute ---
[INFO] 
[INFO] --- maven-enforcer-plugin:1.1.1:enforce (enforce-banned-dependencies) @ azurecompute
---
[INFO] 
[INFO] --- maven-enforcer-plugin:1.1.1:enforce (enforce-java) @ azurecompute ---
[INFO] 
[INFO] --- maven-remote-resources-plugin:1.5:process (default) @ azurecompute ---
[INFO] artifact net.schmizz:sshj: checking for updates from central
[INFO] artifact net.schmizz:sshj: checking for updates from cloudbees-private-release-repository
[INFO] artifact net.schmizz:sshj: checking for updates from jclouds-sona-snapshots-nexus
[INFO] 
[INFO] --- maven-resources-plugin:2.6:resources (default-resources) @ azurecompute ---
Downloading: https://repository-jclouds.forge.cloudbees.com/release/org/codehaus/plexus/plexus-utils/2.0.5/plexus-utils-2.0.5.jar
Downloading: http://repo.cloudbees.com/content/repositories/central/org/codehaus/plexus/plexus-utils/2.0.5/plexus-utils-2.0.5.jar
Downloaded: http://repo.cloudbees.com/content/repositories/central/org/codehaus/plexus/plexus-utils/2.0.5/plexus-utils-2.0.5.jar
(218 KB at 8071.9 KB/sec)
[INFO] Using 'UTF-8' encoding to copy filtered resources.
[INFO] skip non existing resourceDirectory <https://jclouds.ci.cloudbees.com/job/jclouds-labs-1.9.x-branch/org.apache.jclouds.labs$azurecompute/ws/src/main/clojure>
[INFO] skip non existing resourceDirectory <https://jclouds.ci.cloudbees.com/job/jclouds-labs-1.9.x-branch/org.apache.jclouds.labs$azurecompute/ws/src/main/resources>
[INFO] skip non existing resourceDirectory <https://jclouds.ci.cloudbees.com/job/jclouds-labs-1.9.x-branch/org.apache.jclouds.labs$azurecompute/ws/target/classes>
[INFO] Copying 3 resources
[INFO] 
[INFO] --- maven-compiler-plugin:3.1:compile (default-compile) @ azurecompute ---
Downloading: https://repository-jclouds.forge.cloudbees.com/release/org/apache/maven/maven-toolchain/1.0/maven-toolchain-1.0.pom
Downloading: http://repo.cloudbees.com/content/repositories/central/org/apache/maven/maven-toolchain/1.0/maven-toolchain-1.0.pom
Downloaded: http://repo.cloudbees.com/content/repositories/central/org/apache/maven/maven-toolchain/1.0/maven-toolchain-1.0.pom
(4 KB at 196.1 KB/sec)
Downloading: https://repository-jclouds.forge.cloudbees.com/release/org/apache/maven/shared/maven-shared-utils/0.1/maven-shared-utils-0.1.pom
Downloading: http://repo.cloudbees.com/content/repositories/central/org/apache/maven/shared/maven-shared-utils/0.1/maven-shared-utils-0.1.pom
Downloaded: http://repo.cloudbees.com/content/repositories/central/org/apache/maven/shared/maven-shared-utils/0.1/maven-shared-utils-0.1.pom
(4 KB at 263.5 KB/sec)
Downloading: https://repository-jclouds.forge.cloudbees.com/release/org/apache/maven/shared/maven-shared-incremental/1.1/maven-shared-incremental-1.1.pom
Downloading: http://repo.cloudbees.com/content/repositories/central/org/apache/maven/shared/maven-shared-incremental/1.1/maven-shared-incremental-1.1.pom
Downloaded: http://repo.cloudbees.com/content/repositories/central/org/apache/maven/shared/maven-shared-incremental/1.1/maven-shared-incremental-1.1.pom
(5 KB at 231.5 KB/sec)
Downloading: https://repository-jclouds.forge.cloudbees.com/release/org/codehaus/plexus/plexus-compiler-api/2.2/plexus-compiler-api-2.2.pom
Downloading: http://repo.cloudbees.com/content/repositories/central/org/codehaus/plexus/plexus-compiler-api/2.2/plexus-compiler-api-2.2.pom
Downloaded: http://repo.cloudbees.com/content/repositories/central/org/codehaus/plexus/plexus-compiler-api/2.2/plexus-compiler-api-2.2.pom
(865 B at 60.3 KB/sec)
Downloading: https://repository-jclouds.forge.cloudbees.com/release/org/codehaus/plexus/plexus-compiler/2.2/plexus-compiler-2.2.pom
Downloading: http://repo.cloudbees.com/content/repositories/central/org/codehaus/plexus/plexus-compiler/2.2/plexus-compiler-2.2.pom
Downloaded: http://repo.cloudbees.com/content/repositories/central/org/codehaus/plexus/plexus-compiler/2.2/plexus-compiler-2.2.pom
(4 KB at 220.6 KB/sec)
Downloading: https://repository-jclouds.forge.cloudbees.com/release/org/codehaus/plexus/plexus-compiler-manager/2.2/plexus-compiler-manager-2.2.pom
Downloading: http://repo.cloudbees.com/content/repositories/central/org/codehaus/plexus/plexus-compiler-manager/2.2/plexus-compiler-manager-2.2.pom
Downloaded: http://repo.cloudbees.com/content/repositories/central/org/codehaus/plexus/plexus-compiler-manager/2.2/plexus-compiler-manager-2.2.pom
(690 B at 44.9 KB/sec)
Downloading: https://repository-jclouds.forge.cloudbees.com/release/org/codehaus/plexus/plexus-compiler-javac/2.2/plexus-compiler-javac-2.2.pom
Downloading: http://repo.cloudbees.com/content/repositories/central/org/codehaus/plexus/plexus-compiler-javac/2.2/plexus-compiler-javac-2.2.pom
Downloaded: http://repo.cloudbees.com/content/repositories/central/org/codehaus/plexus/plexus-compiler-javac/2.2/plexus-compiler-javac-2.2.pom
(769 B at 46.9 KB/sec)
Downloading: https://repository-jclouds.forge.cloudbees.com/release/org/codehaus/plexus/plexus-compilers/2.2/plexus-compilers-2.2.pom
Downloading: http://repo.cloudbees.com/content/repositories/central/org/codehaus/plexus/plexus-compilers/2.2/plexus-compilers-2.2.pom
Downloaded: http://repo.cloudbees.com/content/repositories/central/org/codehaus/plexus/plexus-compilers/2.2/plexus-compilers-2.2.pom
(2 KB at 75.7 KB/sec)
Downloading: https://repository-jclouds.forge.cloudbees.com/release/org/apache/maven/shared/maven-shared-utils/0.1/maven-shared-utils-0.1.jar
Downloading: https://repository-jclouds.forge.cloudbees.com/release/org/apache/maven/shared/maven-shared-incremental/1.1/maven-shared-incremental-1.1.jar
Downloading: https://repository-jclouds.forge.cloudbees.com/release/org/codehaus/plexus/plexus-compiler-api/2.2/plexus-compiler-api-2.2.jar
Downloading: https://repository-jclouds.forge.cloudbees.com/release/org/codehaus/plexus/plexus-compiler-manager/2.2/plexus-compiler-manager-2.2.jar
Downloading: https://repository-jclouds.forge.cloudbees.com/release/org/codehaus/plexus/plexus-compiler-javac/2.2/plexus-compiler-javac-2.2.jar
Downloading: https://repository-jclouds.forge.cloudbees.com/release/org/apache/xbean/xbean-reflect/3.4/xbean-reflect-3.4.jar
Downloading: https://repository-jclouds.forge.cloudbees.com/release/commons-logging/commons-logging-api/1.1/commons-logging-api-1.1.jar
Downloading: https://repository-jclouds.forge.cloudbees.com/release/log4j/log4j/1.2.12/log4j-1.2.12.jar
Downloading: https://repository-jclouds.forge.cloudbees.com/release/com/google/collections/google-collections/1.0/google-collections-1.0.jar
Downloading: https://repository-jclouds.forge.cloudbees.com/release/junit/junit/3.8.2/junit-3.8.2.jar
Downloading: http://repo.cloudbees.com/content/repositories/central/org/apache/maven/shared/maven-shared-utils/0.1/maven-shared-utils-0.1.jar
Downloading: http://repo.cloudbees.com/content/repositories/central/org/apache/maven/shared/maven-shared-incremental/1.1/maven-shared-incremental-1.1.jar
Downloading: http://repo.cloudbees.com/content/repositories/central/org/codehaus/plexus/plexus-compiler-api/2.2/plexus-compiler-api-2.2.jar
Downloading: http://repo.cloudbees.com/content/repositories/central/org/codehaus/plexus/plexus-compiler-manager/2.2/plexus-compiler-manager-2.2.jar
Downloading: http://repo.cloudbees.com/content/repositories/central/org/codehaus/plexus/plexus-compiler-javac/2.2/plexus-compiler-javac-2.2.jar
Downloaded: http://repo.cloudbees.com/content/repositories/central/org/codehaus/plexus/plexus-compiler-manager/2.2/plexus-compiler-manager-2.2.jar
(5 KB at 193.7 KB/sec)
Downloading: http://repo.cloudbees.com/content/repositories/central/org/apache/xbean/xbean-reflect/3.4/xbean-reflect-3.4.jar
Downloaded: http://repo.cloudbees.com/content/repositories/central/org/codehaus/plexus/plexus-compiler-api/2.2/plexus-compiler-api-2.2.jar
(25 KB at 871.6 KB/sec)
Downloading: http://repo.cloudbees.com/content/repositories/central/log4j/log4j/1.2.12/log4j-1.2.12.jar
Downloaded: http://repo.cloudbees.com/content/repositories/central/org/apache/maven/shared/maven-shared-incremental/1.1/maven-shared-incremental-1.1.jar
(14 KB at 455.9 KB/sec)
Downloading: http://repo.cloudbees.com/content/repositories/central/commons-logging/commons-logging-api/1.1/commons-logging-api-1.1.jar
Downloaded: http://repo.cloudbees.com/content/repositories/central/org/codehaus/plexus/plexus-compiler-javac/2.2/plexus-compiler-javac-2.2.jar
(19 KB at 638.8 KB/sec)
Downloading: http://repo.cloudbees.com/content/repositories/central/com/google/collections/google-collections/1.0/google-collections-1.0.jar
Downloaded: http://repo.cloudbees.com/content/repositories/central/org/apache/xbean/xbean-reflect/3.4/xbean-reflect-3.4.jar
(131 KB at 4356.3 KB/sec)
Downloaded: http://repo.cloudbees.com/content/repositories/central/commons-logging/commons-logging-api/1.1/commons-logging-api-1.1.jar
(44 KB at 1814.7 KB/sec)
Downloading: http://repo.cloudbees.com/content/repositories/central/junit/junit/3.8.2/junit-3.8.2.jar
Downloaded: http://repo.cloudbees.com/content/repositories/central/org/apache/maven/shared/maven-shared-utils/0.1/maven-shared-utils-0.1.jar
(151 KB at 2694.6 KB/sec)
Downloaded: http://repo.cloudbees.com/content/repositories/central/log4j/log4j/1.2.12/log4j-1.2.12.jar
(350 KB at 9451.1 KB/sec)
Downloaded: http://repo.cloudbees.com/content/repositories/central/com/google/collections/google-collections/1.0/google-collections-1.0.jar
(625 KB at 14195.5 KB/sec)
Downloaded: http://repo.cloudbees.com/content/repositories/central/junit/junit/3.8.2/junit-3.8.2.jar
(118 KB at 5355.1 KB/sec)
[INFO] Changes detected - recompiling the module!
[INFO] Compiling 160 source files to <https://jclouds.ci.cloudbees.com/job/jclouds-labs-1.9.x-branch/org.apache.jclouds.labs$azurecompute/ws/target/classes>
[WARNING] bootstrap class path not set in conjunction with -source 1.6
[WARNING] No processor claimed any of these annotations: org.jclouds.rest.annotations.ResponseParser,com.google.inject.Singleton,javax.ws.rs.PUT,javax.ws.rs.Path,org.jclouds.rest.annotations.PayloadParam,javax.ws.rs.GET,javax.inject.Inject,org.jclouds.rest.annotations.Payload,org.jclouds.rest.annotations.ParamParser,javax.inject.Named,com.google.inject.Provides,javax.annotation.Resource,javax.ws.rs.POST,javax.ws.rs.PathParam,org.jclouds.rest.annotations.Delegate,javax.inject.Singleton,org.jclouds.rest.annotations.Headers,org.jclouds.location.Provider,org.jclouds.rest.annotations.BinderParam,com.google.inject.Inject,org.jclouds.rest.annotations.QueryParams,org.jclouds.rest.annotations.XMLResponseParser,com.google.auto.value.AutoValue,org.jclouds.collect.Memoized,org.jclouds.javax.annotation.Nullable,javax.ws.rs.Consumes,org.jclouds.rest.annotations.SinceApiVersion,com.google.common.annotations.VisibleForTesting,org.jclouds.rest.ConfiguresHttpApi,org.jclouds.rest.annotations.Fallback,javax.ws.rs.Produces,javax.ws.rs.DELETE
[WARNING] No processor claimed any of these annotations: org.jclouds.rest.annotations.SinceApiVersion,org.jclouds.javax.annotation.Nullable,javax.annotation.Generated
[WARNING] <https://jclouds.ci.cloudbees.com/job/jclouds-labs-1.9.x-branch/org.apache.jclouds.labs$azurecompute/ws/src/main/java/org/jclouds/azurecompute/binders/CaptureVMImageParamsToXML.java>:
Some input files use unchecked or unsafe operations.
[WARNING] <https://jclouds.ci.cloudbees.com/job/jclouds-labs-1.9.x-branch/org.apache.jclouds.labs$azurecompute/ws/src/main/java/org/jclouds/azurecompute/binders/CaptureVMImageParamsToXML.java>:
Recompile with -Xlint:unchecked for details.
[INFO] 
[INFO] --- maven-resources-plugin:2.6:testResources (default-testResources) @ azurecompute
---
[INFO] Using 'UTF-8' encoding to copy filtered resources.
[INFO] skip non existing resourceDirectory <https://jclouds.ci.cloudbees.com/job/jclouds-labs-1.9.x-branch/org.apache.jclouds.labs$azurecompute/ws/src/test/clojure>
[INFO] Copying 57 resources
[INFO] Copying 3 resources
[INFO] 
[INFO] --- maven-compiler-plugin:3.1:testCompile (default-testCompile) @ azurecompute ---
[INFO] Changes detected - recompiling the module!
[INFO] Compiling 70 source files to <https://jclouds.ci.cloudbees.com/job/jclouds-labs-1.9.x-branch/org.apache.jclouds.labs$azurecompute/ws/target/test-classes>
[INFO] -------------------------------------------------------------
[WARNING] COMPILATION WARNING : 
[INFO] -------------------------------------------------------------
[WARNING] bootstrap class path not set in conjunction with -source 1.6
[INFO] 1 warning
[INFO] -------------------------------------------------------------
[INFO] -------------------------------------------------------------
[ERROR] COMPILATION ERROR : 
[INFO] -------------------------------------------------------------
[ERROR] <https://jclouds.ci.cloudbees.com/job/jclouds-labs-1.9.x-branch/org.apache.jclouds.labs$azurecompute/ws/src/test/java/org/jclouds/azurecompute/compute/AzureComputeServiceContextLiveTest.java>:[25,1]
class, interface, or enum expected
[ERROR] <https://jclouds.ci.cloudbees.com/job/jclouds-labs-1.9.x-branch/org.apache.jclouds.labs$azurecompute/ws/src/test/java/org/jclouds/azurecompute/compute/AzureComputeServiceContextLiveTest.java>:[32,1]
class, interface, or enum expected
[ERROR] <https://jclouds.ci.cloudbees.com/job/jclouds-labs-1.9.x-branch/org.apache.jclouds.labs$azurecompute/ws/src/test/java/org/jclouds/azurecompute/compute/AzureComputeServiceContextLiveTest.java>:[36,1]
class, interface, or enum expected
[ERROR] <https://jclouds.ci.cloudbees.com/job/jclouds-labs-1.9.x-branch/org.apache.jclouds.labs$azurecompute/ws/src/test/java/org/jclouds/azurecompute/compute/AzureComputeServiceContextLiveTest.java>:[44,1]
class, interface, or enum expected
[INFO] 4 errors 
[INFO] -------------------------------------------------------------

Mime
View raw message