jclouds-notifications mailing list archives

Site index · List index
Message view « Date » · « Thread »
Top « Date » · « Thread »
From jenkins-no-re...@cloudbees.com
Subject Build failed in Jenkins: jclouds-labs-1.9.x-branch #109
Date Wed, 01 Jul 2015 20:35:29 GMT
See <https://jclouds.ci.cloudbees.com/job/jclouds-labs-1.9.x-branch/109/changes>

Changes:

[Andrea Turli] fix bad commit 8d45b07

------------------------------------------
[...truncated 4098 lines...]
Jul 01, 2015 4:34:54 PM com.squareup.okhttp.mockwebserver.MockWebServer$2 acceptConnections
INFO: MockWebServer[47500] done accepting connections: Socket closed
Jul 01, 2015 4:34:54 PM com.squareup.okhttp.mockwebserver.MockWebServer$2 acceptConnections
INFO: MockWebServer[35284] done accepting connections: Socket closed
[pool-45-thread-2] Test testList(org.jclouds.azurecompute.features.VirtualNetworkApiMockTest)
succeeded: 75ms
Test suite progress: tests succeeded: 137, failed: 0, skipped: 0.
[pool-45-thread-1] Test testGetNetworkConfiguration(org.jclouds.azurecompute.features.VirtualNetworkApiMockTest)
succeeded: 75ms
Test suite progress: tests succeeded: 138, failed: 0, skipped: 0.
Jul 01, 2015 4:34:55 PM com.squareup.okhttp.mockwebserver.MockWebServer$2 acceptConnections
INFO: MockWebServer[50442] done accepting connections: Socket closed
Jul 01, 2015 4:34:55 PM com.squareup.okhttp.mockwebserver.MockWebServer$3 processOneRequest
INFO: MockWebServer[50442] received request: PUT /services/networking/media HTTP/1.1 and responded:
HTTP/1.1 200 OK
[pool-45-thread-3] Test testSet(org.jclouds.azurecompute.features.VirtualNetworkApiMockTest)
succeeded: 110ms
Test suite progress: tests succeeded: 139, failed: 0, skipped: 0.
Tests run: 139, Failures: 0, Errors: 0, Skipped: 0, Time elapsed: 15.705 sec - in TestSuite

Results :

Tests run: 139, Failures: 0, Errors: 0, Skipped: 0

[JENKINS] Recording test results
log4j:WARN No appenders could be found for logger (org.apache.commons.beanutils.converters.BooleanConverter).
log4j:WARN Please initialize the log4j system properly.
[INFO] 
[INFO] --- animal-sniffer-maven-plugin:1.11:check (default) @ azurecompute ---
[INFO] Checking unresolved references to org.codehaus.mojo.signature:java16:1.1
[INFO] 
[INFO] --- maven-bundle-plugin:2.3.7:bundle (default-bundle) @ azurecompute ---
[INFO] 
[INFO] --- maven-site-plugin:3.3:attach-descriptor (attach-descriptor) @ azurecompute ---
[INFO] 
[INFO] --- apache-rat-plugin:0.10:check (default) @ azurecompute ---
[INFO] 51 implicit excludes (use -debug for more details).
[INFO] Exclude: **/src/test/resources/**/*.sh
[INFO] Exclude: **/src/test/resources/**/*.bat
[INFO] Exclude: **/src/test/resources/**/*.cmd
[INFO] Exclude: **/src/test/resources/**/*.txt
[INFO] Exclude: **/src/test/resources/**/*.gz
[INFO] Exclude: **/src/test/resources/**/*.xml
[INFO] Exclude: **/src/test/resources/**/*.html
[INFO] Exclude: **/src/test/resources/**/*.iso
[INFO] Exclude: **/LICENSE.txt
[INFO] Exclude: **/header.txt
[INFO] Exclude: **/NOTICE.txt
[INFO] Exclude: **/DISCLAIMER
[INFO] Exclude: **/BUILD.txt
[INFO] Exclude: **/CHANGES.txt
[INFO] Exclude: **/README.md
[INFO] Exclude: **/README.txt
[INFO] Exclude: **/DEPENDENCIES
[INFO] Exclude: **/CONTRIBUTING.md
[INFO] Exclude: **/*json
[INFO] Exclude: **/*readme
[INFO] Exclude: **/*ProviderMetadata
[INFO] Exclude: **/*ApiMetadata
[INFO] Exclude: **/*LoggingModule
[INFO] Exclude: **/*ViewMBeanFactory
[INFO] Exclude: **/target/**
[INFO] Exclude: **/test-output/**
[INFO] Exclude: **/bin/**
[INFO] Exclude: **/.settings/**
[INFO] Exclude: **/.classpath
[INFO] Exclude: **/.dir-locals.el
[INFO] Exclude: **/.project
[INFO] Exclude: **/.idea/**
[INFO] Exclude: **/*.iml
[INFO] Exclude: **/*.eml
[INFO] Exclude: **/*.ipr
[INFO] Exclude: **/*.iws
[INFO] Exclude: **/*.DS_STORE
[INFO] Exclude: **/TAGS
[INFO] Exclude: **/.metadata/**
[INFO] Exclude: **/atlassian-ide-plugin.xml
[INFO] Exclude: **/.DS_Store
[INFO] Exclude: .mailmap
[INFO] Exclude: .git/**
[INFO] Exclude: **/.gitignore
[INFO] Exclude: **/.gitattributes
[INFO] Exclude: .repository/**
[INFO] Exclude: .java-version
[INFO] Exclude: nb-configuration.xml
[INFO] Exclude: nbactions.xml
[INFO] Exclude: .repository/**
[INFO] Exclude: gc.log
[INFO] 232 resources included (use -debug for more details)
Warning:  org.apache.xerces.jaxp.SAXParserImpl$JAXPSAXParser: Property 'http://www.oracle.com/xml/jaxp/properties/entityExpansionLimit'
is not recognized.
Compiler warnings:
  WARNING:  'org.apache.xerces.jaxp.SAXParserImpl: Property 'http://javax.xml.XMLConstants/property/accessExternalDTD'
is not recognized.'
Warning:  org.apache.xerces.parsers.SAXParser: Feature 'http://javax.xml.XMLConstants/feature/secure-processing'
is not recognized.
Warning:  org.apache.xerces.parsers.SAXParser: Property 'http://javax.xml.XMLConstants/property/accessExternalDTD'
is not recognized.
Warning:  org.apache.xerces.parsers.SAXParser: Property 'http://www.oracle.com/xml/jaxp/properties/entityExpansionLimit'
is not recognized.
[INFO] Rat check: Summary of files. Unapproved: 0 unknown: 0 generated: 0 approved: 231 licence.
[INFO] 
[INFO] --- maven-jar-plugin:2.4:test-jar (default) @ azurecompute ---
[INFO] Building jar: <https://jclouds.ci.cloudbees.com/job/jclouds-labs-1.9.x-branch/ws/azurecompute/target/azurecompute-1.9.1-SNAPSHOT-tests.jar>
[INFO] 
[INFO] --- maven-javadoc-plugin:2.9:aggregate-jar (javadoc) @ azurecompute ---
[INFO] 
[INFO] --- maven-javadoc-plugin:2.9:jar (javadoc) @ azurecompute ---
[INFO] 
14 warnings
[WARNING] Javadoc Warnings
[WARNING] <https://jclouds.ci.cloudbees.com/job/jclouds-labs-1.9.x-branch/ws/azurecompute/src/main/java/org/jclouds/azurecompute/xml/DeploymentHandler.java>:40:
warning - Tag @see: missing final '>': "<a href="http://msdn.microsoft.com/en-us/library/ee460804"
>Response body description</a>."
[WARNING] <https://jclouds.ci.cloudbees.com/job/jclouds-labs-1.9.x-branch/ws/azurecompute/src/main/java/org/jclouds/azurecompute/features/NetworkSecurityGroupApi.java>:59:
warning - Tag @see:illegal character: "58" in "https://msdn.microsoft.com/en-us/library/azure/dn913824.aspx."
[WARNING] <https://jclouds.ci.cloudbees.com/job/jclouds-labs-1.9.x-branch/ws/azurecompute/src/main/java/org/jclouds/azurecompute/features/NetworkSecurityGroupApi.java>:59:
warning - Tag @see:illegal character: "47" in "https://msdn.microsoft.com/en-us/library/azure/dn913824.aspx."
[WARNING] <https://jclouds.ci.cloudbees.com/job/jclouds-labs-1.9.x-branch/ws/azurecompute/src/main/java/org/jclouds/azurecompute/features/NetworkSecurityGroupApi.java>:59:
warning - Tag @see:illegal character: "47" in "https://msdn.microsoft.com/en-us/library/azure/dn913824.aspx."
[WARNING] <https://jclouds.ci.cloudbees.com/job/jclouds-labs-1.9.x-branch/ws/azurecompute/src/main/java/org/jclouds/azurecompute/features/NetworkSecurityGroupApi.java>:59:
warning - Tag @see:illegal character: "47" in "https://msdn.microsoft.com/en-us/library/azure/dn913824.aspx."
[WARNING] <https://jclouds.ci.cloudbees.com/job/jclouds-labs-1.9.x-branch/ws/azurecompute/src/main/java/org/jclouds/azurecompute/features/NetworkSecurityGroupApi.java>:59:
warning - Tag @see:illegal character: "45" in "https://msdn.microsoft.com/en-us/library/azure/dn913824.aspx."
[WARNING] <https://jclouds.ci.cloudbees.com/job/jclouds-labs-1.9.x-branch/ws/azurecompute/src/main/java/org/jclouds/azurecompute/features/NetworkSecurityGroupApi.java>:59:
warning - Tag @see:illegal character: "47" in "https://msdn.microsoft.com/en-us/library/azure/dn913824.aspx."
[WARNING] <https://jclouds.ci.cloudbees.com/job/jclouds-labs-1.9.x-branch/ws/azurecompute/src/main/java/org/jclouds/azurecompute/features/NetworkSecurityGroupApi.java>:59:
warning - Tag @see:illegal character: "47" in "https://msdn.microsoft.com/en-us/library/azure/dn913824.aspx."
[WARNING] <https://jclouds.ci.cloudbees.com/job/jclouds-labs-1.9.x-branch/ws/azurecompute/src/main/java/org/jclouds/azurecompute/features/NetworkSecurityGroupApi.java>:59:
warning - Tag @see:illegal character: "47" in "https://msdn.microsoft.com/en-us/library/azure/dn913824.aspx."
[WARNING] <https://jclouds.ci.cloudbees.com/job/jclouds-labs-1.9.x-branch/ws/azurecompute/src/main/java/org/jclouds/azurecompute/xml/ResultHandler.java>:26:
warning - Tag @see: reference not found: for example <a href="https://msdn.microsoft.com/en-us/library/azure/dn510368.aspx">Check
DNS Prefix
[WARNING] Availability</a>
[WARNING] <https://jclouds.ci.cloudbees.com/job/jclouds-labs-1.9.x-branch/ws/azurecompute/src/main/java/org/jclouds/azurecompute/domain/ProfileDefinition.java>:174:
warning - Tag @see: reference not found: EndpointParams
[WARNING] <https://jclouds.ci.cloudbees.com/job/jclouds-labs-1.9.x-branch/ws/azurecompute/src/main/java/org/jclouds/azurecompute/domain/ProfileDefinitionEndpoint.java>:124:
warning - @return tag has no arguments.
[WARNING] <https://jclouds.ci.cloudbees.com/job/jclouds-labs-1.9.x-branch/ws/azurecompute/src/main/java/org/jclouds/azurecompute/domain/Rule.java>:130:
warning - @return tag has no arguments.
[WARNING] <https://jclouds.ci.cloudbees.com/job/jclouds-labs-1.9.x-branch/ws/azurecompute/src/main/java/org/jclouds/azurecompute/features/NetworkSecurityGroupApi.java>:59:
warning - Tag @see: reference not found: https://msdn.microsoft.com/en-us/library/azure/dn913824.aspx.
[INFO] Building jar: <https://jclouds.ci.cloudbees.com/job/jclouds-labs-1.9.x-branch/ws/azurecompute/target/azurecompute-1.9.1-SNAPSHOT-javadoc.jar>
[INFO] 
[INFO] --- maven-source-plugin:2.2:jar-no-fork (attach-sources) @ azurecompute ---
[INFO] Building jar: <https://jclouds.ci.cloudbees.com/job/jclouds-labs-1.9.x-branch/ws/azurecompute/target/azurecompute-1.9.1-SNAPSHOT-sources.jar>
[INFO] 
[INFO] --- maven-surefire-plugin:2.17:test (integration) @ azurecompute ---
[JENKINS] Recording test results
[INFO] 
[INFO] --- duplicate-finder-maven-plugin:1.1.1:check (default) @ azurecompute ---
[WARNING] <ignoreResources> has been deprecated and replaced with <ignoreResourcePatterns>.
It will go away in version 1.2.0. Please update your POM accordingly!
[INFO] Checking compile classpath
[INFO] Checking runtime classpath
[INFO] Checking test classpath
[INFO] 
[INFO] --- maven-checkstyle-plugin:2.13:check (default) @ azurecompute ---
[INFO] 
[WARNING] AzureComputeServiceContextLiveTest.java[28:1] (imports) RedundantImport: Duplicate
import to line 25 - org.jclouds.azurecompute.AzureComputeApi.
[WARNING] AzureComputeServiceContextLiveTest.java[29:1] (imports) RedundantImport: Duplicate
import to line 26 - org.jclouds.azurecompute.internal.BaseAzureComputeApiLiveTest.
[WARNING] AzureComputeServiceContextLiveTest.java[30:1] (imports) RedundantImport: Duplicate
import to line 25 - org.jclouds.azurecompute.AzureComputeApi.
[WARNING] AzureComputeServiceContextLiveTest.java[30:1] (imports) RedundantImport: Duplicate
import to line 28 - org.jclouds.azurecompute.AzureComputeApi.
[WARNING] AzureComputeServiceContextLiveTest.java[31:1] (imports) RedundantImport: Duplicate
import to line 26 - org.jclouds.azurecompute.internal.BaseAzureComputeApiLiveTest.
[WARNING] AzureComputeServiceContextLiveTest.java[31:1] (imports) RedundantImport: Duplicate
import to line 29 - org.jclouds.azurecompute.internal.BaseAzureComputeApiLiveTest.
[WARNING] AzureComputeServiceContextLiveTest.java[32:1] (imports) RedundantImport: Duplicate
import to line 27 - org.jclouds.azurecompute.options.AzureComputeTemplateOptions.
[WARNING] AzureComputeServiceContextLiveTest.java[33:1] (imports) RedundantImport: Duplicate
import to line 25 - org.jclouds.azurecompute.AzureComputeApi.
[WARNING] AzureComputeServiceContextLiveTest.java[33:1] (imports) RedundantImport: Duplicate
import to line 28 - org.jclouds.azurecompute.AzureComputeApi.
[WARNING] AzureComputeServiceContextLiveTest.java[33:1] (imports) RedundantImport: Duplicate
import to line 30 - org.jclouds.azurecompute.AzureComputeApi.
[WARNING] AzureComputeServiceContextLiveTest.java[34:1] (imports) RedundantImport: Duplicate
import to line 26 - org.jclouds.azurecompute.internal.BaseAzureComputeApiLiveTest.
[WARNING] AzureComputeServiceContextLiveTest.java[34:1] (imports) RedundantImport: Duplicate
import to line 29 - org.jclouds.azurecompute.internal.BaseAzureComputeApiLiveTest.
[WARNING] AzureComputeServiceContextLiveTest.java[34:1] (imports) RedundantImport: Duplicate
import to line 31 - org.jclouds.azurecompute.internal.BaseAzureComputeApiLiveTest.
[WARNING] AzureComputeServiceContextLiveTest.java[35:1] (imports) RedundantImport: Duplicate
import to line 27 - org.jclouds.azurecompute.options.AzureComputeTemplateOptions.
[WARNING] AzureComputeServiceContextLiveTest.java[35:1] (imports) RedundantImport: Duplicate
import to line 32 - org.jclouds.azurecompute.options.AzureComputeTemplateOptions.
Started calculate disk usage of build
Finished Calculation of disk usage of build in 0 seconds
Started calculate disk usage of workspace
Finished Calculation of disk usage of workspace in 0 seconds
[INFO] ------------------------------------------------------------------------
[INFO] Reactor Summary:
[INFO] 
[INFO] Apache jclouds labs ............................... SUCCESS [1:43.673s]
[INFO] jclouds azure compute API ......................... FAILURE [53.950s]
[INFO] jclouds docker API ................................ SKIPPED
[INFO] jclouds cdmi api .................................. SKIPPED
[INFO] jclouds CloudSigma v2 API ......................... SKIPPED
[INFO] jclouds CloudSigma v2 Honolulu Provider ........... SKIPPED
[INFO] jclouds CloudSigma v2 Las Vegas Provider .......... SKIPPED
[INFO] jclouds CloudSigma v2 San Jose Provider ........... SKIPPED
[INFO] jclouds CloudSigma v2 Washington DC Provider ...... SKIPPED
[INFO] jclouds CloudSigma v2 Zurich Provider ............. SKIPPED
[INFO] jclouds DigitalOcean Provider ..................... SKIPPED
[INFO] jclouds joyent-cloudapi api ....................... SKIPPED
[INFO] jclouds joyentcloud provider ...................... SKIPPED
[INFO] jclouds Abiquo api ................................ SKIPPED
[INFO] jclouds ProfitBricks api .......................... SKIPPED
[INFO] jclouds shipyard API .............................. SKIPPED
[INFO] ------------------------------------------------------------------------
[INFO] BUILD FAILURE
[INFO] ------------------------------------------------------------------------
[INFO] Total time: 2:48.051s
[INFO] Finished at: Wed Jul 01 16:35:22 EDT 2015
[INFO] Final Memory: 43M/197M
[INFO] ------------------------------------------------------------------------
Waiting for Jenkins to finish collecting data
[ERROR] Failed to execute goal org.apache.maven.plugins:maven-checkstyle-plugin:2.13:check
(default) on project azurecompute: You have 15 Checkstyle violations. -> [Help 1]
org.apache.maven.lifecycle.LifecycleExecutionException: Failed to execute goal org.apache.maven.plugins:maven-checkstyle-plugin:2.13:check
(default) on project azurecompute: You have 15 Checkstyle violations.
	at org.apache.maven.lifecycle.internal.MojoExecutor.execute(MojoExecutor.java:213)
	at org.apache.maven.lifecycle.internal.MojoExecutor.execute(MojoExecutor.java:153)
	at org.apache.maven.lifecycle.internal.MojoExecutor.execute(MojoExecutor.java:145)
	at org.apache.maven.lifecycle.internal.LifecycleModuleBuilder.buildProject(LifecycleModuleBuilder.java:84)
	at org.apache.maven.lifecycle.internal.LifecycleModuleBuilder.buildProject(LifecycleModuleBuilder.java:59)
	at org.apache.maven.lifecycle.internal.LifecycleStarter.singleThreadedBuild(LifecycleStarter.java:183)
	at org.apache.maven.lifecycle.internal.LifecycleStarter.execute(LifecycleStarter.java:161)
	at org.apache.maven.DefaultMaven.doExecute(DefaultMaven.java:320)
	at org.apache.maven.DefaultMaven.execute(DefaultMaven.java:156)
	at org.jvnet.hudson.maven3.launcher.Maven3Launcher.main(Maven3Launcher.java:117)
	at sun.reflect.NativeMethodAccessorImpl.invoke0(Native Method)
	at sun.reflect.NativeMethodAccessorImpl.invoke(NativeMethodAccessorImpl.java:57)
	at sun.reflect.DelegatingMethodAccessorImpl.invoke(DelegatingMethodAccessorImpl.java:43)
	at java.lang.reflect.Method.invoke(Method.java:606)
	at org.codehaus.plexus.classworlds.launcher.Launcher.launchStandard(Launcher.java:329)
	at org.codehaus.plexus.classworlds.launcher.Launcher.launch(Launcher.java:239)
	at org.jvnet.hudson.maven3.agent.Maven3Main.launch(Maven3Main.java:178)
	at sun.reflect.NativeMethodAccessorImpl.invoke0(Native Method)
	at sun.reflect.NativeMethodAccessorImpl.invoke(NativeMethodAccessorImpl.java:57)
	at sun.reflect.DelegatingMethodAccessorImpl.invoke(DelegatingMethodAccessorImpl.java:43)
	at java.lang.reflect.Method.invoke(Method.java:606)
	at hudson.maven.Maven3Builder.call(Maven3Builder.java:136)
	at hudson.maven.Maven3Builder.call(Maven3Builder.java:71)
	at hudson.remoting.UserRequest.perform(UserRequest.java:121)
	at hudson.remoting.UserRequest.perform(UserRequest.java:49)
	at hudson.remoting.Request$2.run(Request.java:324)
	at hudson.remoting.InterceptingExecutorService$1.call(InterceptingExecutorService.java:68)
	at java.util.concurrent.FutureTask.run(FutureTask.java:262)
	at java.util.concurrent.ThreadPoolExecutor.runWorker(ThreadPoolExecutor.java:1145)
	at java.util.concurrent.ThreadPoolExecutor$Worker.run(ThreadPoolExecutor.java:615)
	at java.lang.Thread.run(Thread.java:745)
Caused by: org.apache.maven.plugin.MojoFailureException: You have 15 Checkstyle violations.
	at org.apache.maven.plugin.checkstyle.CheckstyleViolationCheckMojo.execute(CheckstyleViolationCheckMojo.java:582)
	at org.apache.maven.plugin.DefaultBuildPluginManager.executeMojo(DefaultBuildPluginManager.java:101)
	at org.apache.maven.lifecycle.internal.MojoExecutor.execute(MojoExecutor.java:209)
	... 30 more
[ERROR] 
[ERROR] Re-run Maven using the -X switch to enable full debug logging.
[ERROR] 
[ERROR] For more information about the errors and possible solutions, please read the following
articles:
[ERROR] [Help 1] http://cwiki.apache.org/confluence/display/MAVEN/MojoFailureException
[ERROR] 
[ERROR] After correcting the problems, you can resume the build with the command
[ERROR]   mvn <goals> -rf :azurecompute
[JENKINS] Archiving <https://jclouds.ci.cloudbees.com/job/jclouds-labs-1.9.x-branch/ws/cloudsigma2/pom.xml>
to org.apache.jclouds.labs/cloudsigma2/1.9.1-SNAPSHOT/cloudsigma2-1.9.1-SNAPSHOT.pom
[JENKINS] Archiving <https://jclouds.ci.cloudbees.com/job/jclouds-labs-1.9.x-branch/ws/cloudsigma2-zrh/pom.xml>
to org.apache.jclouds.labs/cloudsigma2-zrh/1.9.1-SNAPSHOT/cloudsigma2-zrh-1.9.1-SNAPSHOT.pom
[JENKINS] Archiving <https://jclouds.ci.cloudbees.com/job/jclouds-labs-1.9.x-branch/ws/joyent-cloudapi/pom.xml>
to org.apache.jclouds.labs/joyent-cloudapi/1.9.1-SNAPSHOT/joyent-cloudapi-1.9.1-SNAPSHOT.pom
[JENKINS] Archiving <https://jclouds.ci.cloudbees.com/job/jclouds-labs-1.9.x-branch/ws/pom.xml>
to org.apache.jclouds.labs/jclouds-labs/1.9.1-SNAPSHOT/jclouds-labs-1.9.1-SNAPSHOT.pom
[JENKINS] Archiving <https://jclouds.ci.cloudbees.com/job/jclouds-labs-1.9.x-branch/ws/target/jclouds-labs-1.9.1-SNAPSHOT-tests.jar>
to org.apache.jclouds.labs/jclouds-labs/1.9.1-20150701.203415-100/jclouds-labs-1.9.1-20150701.203415-100-tests.jar
[JENKINS] Archiving <https://jclouds.ci.cloudbees.com/job/jclouds-labs-1.9.x-branch/ws/target/jclouds-labs-1.9.1-SNAPSHOT-javadoc.jar>
to org.apache.jclouds.labs/jclouds-labs/1.9.1-20150701.203415-100/jclouds-labs-1.9.1-20150701.203415-100-javadoc.jar
[JENKINS] Archiving <https://jclouds.ci.cloudbees.com/job/jclouds-labs-1.9.x-branch/ws/docker/pom.xml>
to org.apache.jclouds.labs/docker/1.9.1-SNAPSHOT/docker-1.9.1-SNAPSHOT.pom
[JENKINS] Archiving <https://jclouds.ci.cloudbees.com/job/jclouds-labs-1.9.x-branch/ws/cloudsigma2-wdc/pom.xml>
to org.apache.jclouds.labs/cloudsigma2-wdc/1.9.1-SNAPSHOT/cloudsigma2-wdc-1.9.1-SNAPSHOT.pom
[JENKINS] Archiving <https://jclouds.ci.cloudbees.com/job/jclouds-labs-1.9.x-branch/ws/profitbricks/pom.xml>
to org.apache.jclouds.labs/profitbricks/1.9.1-SNAPSHOT/profitbricks-1.9.1-SNAPSHOT.pom
[JENKINS] Archiving <https://jclouds.ci.cloudbees.com/job/jclouds-labs-1.9.x-branch/ws/cloudsigma2-sjc/pom.xml>
to org.apache.jclouds.labs/cloudsigma2-sjc/1.9.1-SNAPSHOT/cloudsigma2-sjc-1.9.1-SNAPSHOT.pom
[JENKINS] Archiving <https://jclouds.ci.cloudbees.com/job/jclouds-labs-1.9.x-branch/ws/digitalocean/pom.xml>
to org.apache.jclouds.labs/digitalocean/1.9.1-SNAPSHOT/digitalocean-1.9.1-SNAPSHOT.pom
[JENKINS] Archiving <https://jclouds.ci.cloudbees.com/job/jclouds-labs-1.9.x-branch/ws/azurecompute/pom.xml>
to org.apache.jclouds.labs/azurecompute/1.9.1-SNAPSHOT/azurecompute-1.9.1-SNAPSHOT.pom
[JENKINS] Archiving <https://jclouds.ci.cloudbees.com/job/jclouds-labs-1.9.x-branch/ws/azurecompute/target/azurecompute-1.9.1-SNAPSHOT.jar>
to org.apache.jclouds.labs/azurecompute/1.9.1-SNAPSHOT/azurecompute-1.9.1-SNAPSHOT.jar
[JENKINS] Archiving <https://jclouds.ci.cloudbees.com/job/jclouds-labs-1.9.x-branch/ws/azurecompute/target/azurecompute-1.9.1-SNAPSHOT-tests.jar>
to org.apache.jclouds.labs/azurecompute/1.9.1-SNAPSHOT/azurecompute-1.9.1-SNAPSHOT-tests.jar
[JENKINS] Archiving <https://jclouds.ci.cloudbees.com/job/jclouds-labs-1.9.x-branch/ws/azurecompute/target/azurecompute-1.9.1-SNAPSHOT-javadoc.jar>
to org.apache.jclouds.labs/azurecompute/1.9.1-SNAPSHOT/azurecompute-1.9.1-SNAPSHOT-javadoc.jar
[JENKINS] Archiving <https://jclouds.ci.cloudbees.com/job/jclouds-labs-1.9.x-branch/ws/azurecompute/target/azurecompute-1.9.1-SNAPSHOT-sources.jar>
to org.apache.jclouds.labs/azurecompute/1.9.1-SNAPSHOT/azurecompute-1.9.1-SNAPSHOT-sources.jar
[JENKINS] Archiving <https://jclouds.ci.cloudbees.com/job/jclouds-labs-1.9.x-branch/ws/joyentcloud/pom.xml>
to org.apache.jclouds.labs/joyentcloud/1.9.1-SNAPSHOT/joyentcloud-1.9.1-SNAPSHOT.pom
[JENKINS] Archiving <https://jclouds.ci.cloudbees.com/job/jclouds-labs-1.9.x-branch/ws/shipyard/pom.xml>
to org.apache.jclouds.labs/shipyard/1.9.1-SNAPSHOT/shipyard-1.9.1-SNAPSHOT.pom
[JENKINS] Archiving <https://jclouds.ci.cloudbees.com/job/jclouds-labs-1.9.x-branch/ws/cloudsigma2-lvs/pom.xml>
to org.apache.jclouds.labs/cloudsigma2-lvs/1.9.1-SNAPSHOT/cloudsigma2-lvs-1.9.1-SNAPSHOT.pom
[JENKINS] Archiving <https://jclouds.ci.cloudbees.com/job/jclouds-labs-1.9.x-branch/ws/abiquo/pom.xml>
to org.apache.jclouds.labs/abiquo/1.9.1-SNAPSHOT/abiquo-1.9.1-SNAPSHOT.pom
[JENKINS] Archiving <https://jclouds.ci.cloudbees.com/job/jclouds-labs-1.9.x-branch/ws/cloudsigma2-hnl/pom.xml>
to org.apache.jclouds.labs/cloudsigma2-hnl/1.9.1-SNAPSHOT/cloudsigma2-hnl-1.9.1-SNAPSHOT.pom
[JENKINS] Archiving <https://jclouds.ci.cloudbees.com/job/jclouds-labs-1.9.x-branch/ws/cdmi/pom.xml>
to org.apache.jclouds.labs/cdmi/1.9.1-SNAPSHOT/cdmi-1.9.1-SNAPSHOT.pom
Sending e-mails to: notifications@jclouds.apache.org
channel stopped

Mime
View raw message