jclouds-notifications mailing list archives

Site index · List index
Message view « Date » · « Thread »
Top « Date » · « Thread »
From jenkins-no-re...@cloudbees.com
Subject Build failed in Jenkins: jclouds-labs #1032
Date Wed, 01 Jul 2015 16:36:44 GMT
See <https://jclouds.ci.cloudbees.com/job/jclouds-labs/1032/changes>

Changes:

[Andrea Turli] [azurecompute] fix RoleInstanceHandler when Role is suspended

[Andrea Turli] [azurecompute] fix JCLOUDS-952

------------------------------------------
[...truncated 3394 lines...]
Downloading: https://repository-jclouds.forge.cloudbees.com/release/org/pcollections/pcollections/2.1.2/pcollections-2.1.2.pom
Downloading: http://repo.cloudbees.com/content/repositories/central/org/pcollections/pcollections/2.1.2/pcollections-2.1.2.pom
Downloaded: http://repo.cloudbees.com/content/repositories/central/org/pcollections/pcollections/2.1.2/pcollections-2.1.2.pom
(3 KB at 6.5 KB/sec)
Downloading: https://repository-jclouds.forge.cloudbees.com/release/com/google/code/findbugs/jFormatString/3.0.0/jFormatString-3.0.0.pom
Downloading: http://repo.cloudbees.com/content/repositories/central/com/google/code/findbugs/jFormatString/3.0.0/jFormatString-3.0.0.pom
Downloaded: http://repo.cloudbees.com/content/repositories/central/com/google/code/findbugs/jFormatString/3.0.0/jFormatString-3.0.0.pom
(4 KB at 10.0 KB/sec)
Downloading: https://repository-jclouds.forge.cloudbees.com/release/com/google/code/findbugs/jsr305/3.0.0/jsr305-3.0.0.pom
Downloading: http://repo.cloudbees.com/content/repositories/central/com/google/code/findbugs/jsr305/3.0.0/jsr305-3.0.0.pom
Downloaded: http://repo.cloudbees.com/content/repositories/central/com/google/code/findbugs/jsr305/3.0.0/jsr305-3.0.0.pom
(4 KB at 235.2 KB/sec)
Downloading: https://repository-jclouds.forge.cloudbees.com/release/org/checkerframework/dataflow/1.8.10/dataflow-1.8.10.pom
Downloading: http://repo.cloudbees.com/content/repositories/central/org/checkerframework/dataflow/1.8.10/dataflow-1.8.10.pom
Downloaded: http://repo.cloudbees.com/content/repositories/central/org/checkerframework/dataflow/1.8.10/dataflow-1.8.10.pom
(5 KB at 74.5 KB/sec)
Downloading: https://repository-jclouds.forge.cloudbees.com/release/org/checkerframework/javacutil/1.8.10/javacutil-1.8.10.pom
Downloading: http://repo.cloudbees.com/content/repositories/central/org/checkerframework/javacutil/1.8.10/javacutil-1.8.10.pom
Downloaded: http://repo.cloudbees.com/content/repositories/central/org/checkerframework/javacutil/1.8.10/javacutil-1.8.10.pom
(4 KB at 70.4 KB/sec)
Downloading: https://repository-jclouds.forge.cloudbees.com/release/com/google/errorprone/javac/1.8.0-u20/javac-1.8.0-u20.pom
Downloading: http://repo.cloudbees.com/content/repositories/central/com/google/errorprone/javac/1.8.0-u20/javac-1.8.0-u20.pom
Downloaded: http://repo.cloudbees.com/content/repositories/central/com/google/errorprone/javac/1.8.0-u20/javac-1.8.0-u20.pom
(2 KB at 17.3 KB/sec)
Downloading: https://repository-jclouds.forge.cloudbees.com/release/com/google/errorprone/error_prone_annotations/2.0.1/error_prone_annotations-2.0.1.pom
Downloading: http://repo.cloudbees.com/content/repositories/central/com/google/errorprone/error_prone_annotations/2.0.1/error_prone_annotations-2.0.1.pom
Downloaded: http://repo.cloudbees.com/content/repositories/central/com/google/errorprone/error_prone_annotations/2.0.1/error_prone_annotations-2.0.1.pom
(2 KB at 8.5 KB/sec)
Downloading: https://repository-jclouds.forge.cloudbees.com/release/org/apache/maven/maven-toolchain/1.0/maven-toolchain-1.0.pom
Downloading: http://repo.cloudbees.com/content/repositories/central/org/apache/maven/maven-toolchain/1.0/maven-toolchain-1.0.pom
Downloaded: http://repo.cloudbees.com/content/repositories/central/org/apache/maven/maven-toolchain/1.0/maven-toolchain-1.0.pom
(4 KB at 138.9 KB/sec)
Downloading: https://repository-jclouds.forge.cloudbees.com/release/org/apache/maven/shared/maven-shared-utils/0.1/maven-shared-utils-0.1.pom
Downloading: http://repo.cloudbees.com/content/repositories/central/org/apache/maven/shared/maven-shared-utils/0.1/maven-shared-utils-0.1.pom
Downloaded: http://repo.cloudbees.com/content/repositories/central/org/apache/maven/shared/maven-shared-utils/0.1/maven-shared-utils-0.1.pom
(4 KB at 232.5 KB/sec)
Downloading: https://repository-jclouds.forge.cloudbees.com/release/org/apache/maven/shared/maven-shared-incremental/1.1/maven-shared-incremental-1.1.pom
Downloading: http://repo.cloudbees.com/content/repositories/central/org/apache/maven/shared/maven-shared-incremental/1.1/maven-shared-incremental-1.1.pom
Downloaded: http://repo.cloudbees.com/content/repositories/central/org/apache/maven/shared/maven-shared-incremental/1.1/maven-shared-incremental-1.1.pom
(5 KB at 92.6 KB/sec)
Downloading: https://repository-jclouds.forge.cloudbees.com/release/org/codehaus/plexus/plexus-compiler-api/2.2/plexus-compiler-api-2.2.pom
Downloading: http://repo.cloudbees.com/content/repositories/central/org/codehaus/plexus/plexus-compiler-api/2.2/plexus-compiler-api-2.2.pom
Downloaded: http://repo.cloudbees.com/content/repositories/central/org/codehaus/plexus/plexus-compiler-api/2.2/plexus-compiler-api-2.2.pom
(865 B at 7.3 KB/sec)
Downloading: https://repository-jclouds.forge.cloudbees.com/release/org/codehaus/plexus/plexus-compiler/2.2/plexus-compiler-2.2.pom
Downloading: http://repo.cloudbees.com/content/repositories/central/org/codehaus/plexus/plexus-compiler/2.2/plexus-compiler-2.2.pom
Downloaded: http://repo.cloudbees.com/content/repositories/central/org/codehaus/plexus/plexus-compiler/2.2/plexus-compiler-2.2.pom
(4 KB at 29.4 KB/sec)
Downloading: https://repository-jclouds.forge.cloudbees.com/release/org/codehaus/plexus/plexus-compiler-manager/2.2/plexus-compiler-manager-2.2.pom
Downloading: http://repo.cloudbees.com/content/repositories/central/org/codehaus/plexus/plexus-compiler-manager/2.2/plexus-compiler-manager-2.2.pom
Downloaded: http://repo.cloudbees.com/content/repositories/central/org/codehaus/plexus/plexus-compiler-manager/2.2/plexus-compiler-manager-2.2.pom
(690 B at 39.6 KB/sec)
Downloading: https://repository-jclouds.forge.cloudbees.com/release/org/codehaus/plexus/plexus-compiler-javac/2.2/plexus-compiler-javac-2.2.pom
Downloading: http://repo.cloudbees.com/content/repositories/central/org/codehaus/plexus/plexus-compiler-javac/2.2/plexus-compiler-javac-2.2.pom
Downloaded: http://repo.cloudbees.com/content/repositories/central/org/codehaus/plexus/plexus-compiler-javac/2.2/plexus-compiler-javac-2.2.pom
(769 B at 46.9 KB/sec)
Downloading: https://repository-jclouds.forge.cloudbees.com/release/org/codehaus/plexus/plexus-compilers/2.2/plexus-compilers-2.2.pom
Downloading: http://repo.cloudbees.com/content/repositories/central/org/codehaus/plexus/plexus-compilers/2.2/plexus-compilers-2.2.pom
Downloaded: http://repo.cloudbees.com/content/repositories/central/org/codehaus/plexus/plexus-compilers/2.2/plexus-compilers-2.2.pom
(2 KB at 75.7 KB/sec)
Downloading: https://repository-jclouds.forge.cloudbees.com/release/org/codehaus/plexus/plexus-compiler-javac-errorprone/2.5/plexus-compiler-javac-errorprone-2.5.jar
Downloading: https://repository-jclouds.forge.cloudbees.com/release/org/codehaus/plexus/plexus-utils/3.0.10/plexus-utils-3.0.10.jar
Downloading: https://repository-jclouds.forge.cloudbees.com/release/com/google/errorprone/error_prone_core/2.0.1/error_prone_core-2.0.1.jar
Downloading: https://repository-jclouds.forge.cloudbees.com/release/com/github/stephenc/jcip/jcip-annotations/1.0-1/jcip-annotations-1.0-1.jar
Downloading: https://repository-jclouds.forge.cloudbees.com/release/com/google/errorprone/error_prone_annotation/2.0.1/error_prone_annotation-2.0.1.jar
Downloading: https://repository-jclouds.forge.cloudbees.com/release/org/pcollections/pcollections/2.1.2/pcollections-2.1.2.jar
Downloading: https://repository-jclouds.forge.cloudbees.com/release/com/google/code/findbugs/jFormatString/3.0.0/jFormatString-3.0.0.jar
Downloading: https://repository-jclouds.forge.cloudbees.com/release/org/checkerframework/dataflow/1.8.10/dataflow-1.8.10.jar
Downloading: https://repository-jclouds.forge.cloudbees.com/release/org/checkerframework/javacutil/1.8.10/javacutil-1.8.10.jar
Downloading: https://repository-jclouds.forge.cloudbees.com/release/com/google/errorprone/javac/1.8.0-u20/javac-1.8.0-u20.jar
Downloading: https://repository-jclouds.forge.cloudbees.com/release/com/google/errorprone/error_prone_annotations/2.0.1/error_prone_annotations-2.0.1.jar
Downloading: https://repository-jclouds.forge.cloudbees.com/release/org/apache/maven/shared/maven-shared-utils/0.1/maven-shared-utils-0.1.jar
Downloading: https://repository-jclouds.forge.cloudbees.com/release/org/apache/maven/shared/maven-shared-incremental/1.1/maven-shared-incremental-1.1.jar
Downloading: https://repository-jclouds.forge.cloudbees.com/release/org/codehaus/plexus/plexus-compiler-api/2.2/plexus-compiler-api-2.2.jar
Downloading: https://repository-jclouds.forge.cloudbees.com/release/org/codehaus/plexus/plexus-compiler-manager/2.2/plexus-compiler-manager-2.2.jar
Downloading: https://repository-jclouds.forge.cloudbees.com/release/org/codehaus/plexus/plexus-compiler-javac/2.2/plexus-compiler-javac-2.2.jar
Downloading: https://repository-jclouds.forge.cloudbees.com/release/org/apache/xbean/xbean-reflect/3.4/xbean-reflect-3.4.jar
Downloading: https://repository-jclouds.forge.cloudbees.com/release/log4j/log4j/1.2.12/log4j-1.2.12.jar
Downloading: https://repository-jclouds.forge.cloudbees.com/release/commons-logging/commons-logging-api/1.1/commons-logging-api-1.1.jar
Downloading: https://repository-jclouds.forge.cloudbees.com/release/com/google/collections/google-collections/1.0/google-collections-1.0.jar
Downloading: https://repository-jclouds.forge.cloudbees.com/release/junit/junit/3.8.2/junit-3.8.2.jar
Downloading: http://repo.cloudbees.com/content/repositories/central/org/codehaus/plexus/plexus-compiler-javac-errorprone/2.5/plexus-compiler-javac-errorprone-2.5.jar
Downloading: http://repo.cloudbees.com/content/repositories/central/org/codehaus/plexus/plexus-utils/3.0.10/plexus-utils-3.0.10.jar
Downloading: http://repo.cloudbees.com/content/repositories/central/com/google/errorprone/error_prone_core/2.0.1/error_prone_core-2.0.1.jar
Downloading: http://repo.cloudbees.com/content/repositories/central/com/google/errorprone/error_prone_annotation/2.0.1/error_prone_annotation-2.0.1.jar
Downloading: http://repo.cloudbees.com/content/repositories/central/com/github/stephenc/jcip/jcip-annotations/1.0-1/jcip-annotations-1.0-1.jar
Downloaded: http://repo.cloudbees.com/content/repositories/central/org/codehaus/plexus/plexus-utils/3.0.10/plexus-utils-3.0.10.jar
(226 KB at 5636.8 KB/sec)
Downloading: http://repo.cloudbees.com/content/repositories/central/org/pcollections/pcollections/2.1.2/pcollections-2.1.2.jar
Downloaded: http://repo.cloudbees.com/content/repositories/central/com/github/stephenc/jcip/jcip-annotations/1.0-1/jcip-annotations-1.0-1.jar
(5 KB at 47.5 KB/sec)
Downloading: http://repo.cloudbees.com/content/repositories/central/com/google/code/findbugs/jFormatString/3.0.0/jFormatString-3.0.0.jar
Downloaded: http://repo.cloudbees.com/content/repositories/central/org/codehaus/plexus/plexus-compiler-javac-errorprone/2.5/plexus-compiler-javac-errorprone-2.5.jar
(10 KB at 58.0 KB/sec)
Downloading: http://repo.cloudbees.com/content/repositories/central/org/checkerframework/dataflow/1.8.10/dataflow-1.8.10.jar
Downloaded: http://repo.cloudbees.com/content/repositories/central/com/google/errorprone/error_prone_annotation/2.0.1/error_prone_annotation-2.0.1.jar
(13 KB at 35.6 KB/sec)
Downloading: http://repo.cloudbees.com/content/repositories/central/org/checkerframework/javacutil/1.8.10/javacutil-1.8.10.jar
Downloaded: http://repo.cloudbees.com/content/repositories/central/org/pcollections/pcollections/2.1.2/pcollections-2.1.2.jar
(39 KB at 115.8 KB/sec)
Downloading: http://repo.cloudbees.com/content/repositories/central/com/google/errorprone/javac/1.8.0-u20/javac-1.8.0-u20.jar
Downloaded: http://repo.cloudbees.com/content/repositories/central/com/google/code/findbugs/jFormatString/3.0.0/jFormatString-3.0.0.jar
(34 KB at 119.0 KB/sec)
Downloading: http://repo.cloudbees.com/content/repositories/central/com/google/errorprone/error_prone_annotations/2.0.1/error_prone_annotations-2.0.1.jar
Downloaded: http://repo.cloudbees.com/content/repositories/central/org/checkerframework/dataflow/1.8.10/dataflow-1.8.10.jar
(283 KB at 946.3 KB/sec)
Downloading: http://repo.cloudbees.com/content/repositories/central/org/apache/maven/shared/maven-shared-utils/0.1/maven-shared-utils-0.1.jar
Downloaded: http://repo.cloudbees.com/content/repositories/central/org/apache/maven/shared/maven-shared-utils/0.1/maven-shared-utils-0.1.jar
(151 KB at 3017.9 KB/sec)
Downloading: http://repo.cloudbees.com/content/repositories/central/org/apache/maven/shared/maven-shared-incremental/1.1/maven-shared-incremental-1.1.jar
Downloaded: http://repo.cloudbees.com/content/repositories/central/com/google/errorprone/error_prone_annotations/2.0.1/error_prone_annotations-2.0.1.jar
(7 KB at 39.4 KB/sec)
Downloading: http://repo.cloudbees.com/content/repositories/central/org/codehaus/plexus/plexus-compiler-api/2.2/plexus-compiler-api-2.2.jar
Downloaded: http://repo.cloudbees.com/content/repositories/central/org/checkerframework/javacutil/1.8.10/javacutil-1.8.10.jar
(85 KB at 281.3 KB/sec)
Downloading: http://repo.cloudbees.com/content/repositories/central/org/codehaus/plexus/plexus-compiler-manager/2.2/plexus-compiler-manager-2.2.jar
Downloaded: http://repo.cloudbees.com/content/repositories/central/org/apache/maven/shared/maven-shared-incremental/1.1/maven-shared-incremental-1.1.jar
(14 KB at 97.2 KB/sec)
Downloading: http://repo.cloudbees.com/content/repositories/central/org/codehaus/plexus/plexus-compiler-javac/2.2/plexus-compiler-javac-2.2.jar
Downloaded: http://repo.cloudbees.com/content/repositories/central/org/codehaus/plexus/plexus-compiler-javac/2.2/plexus-compiler-javac-2.2.jar
(19 KB at 1029.2 KB/sec)
Downloading: http://repo.cloudbees.com/content/repositories/central/org/apache/xbean/xbean-reflect/3.4/xbean-reflect-3.4.jar
Downloaded: http://repo.cloudbees.com/content/repositories/central/org/apache/xbean/xbean-reflect/3.4/xbean-reflect-3.4.jar
(131 KB at 2376.2 KB/sec)
Downloading: http://repo.cloudbees.com/content/repositories/central/log4j/log4j/1.2.12/log4j-1.2.12.jar
Downloaded: http://repo.cloudbees.com/content/repositories/central/org/codehaus/plexus/plexus-compiler-api/2.2/plexus-compiler-api-2.2.jar
(25 KB at 134.1 KB/sec)
Downloading: http://repo.cloudbees.com/content/repositories/central/commons-logging/commons-logging-api/1.1/commons-logging-api-1.1.jar
Downloaded: http://repo.cloudbees.com/content/repositories/central/org/codehaus/plexus/plexus-compiler-manager/2.2/plexus-compiler-manager-2.2.jar
(5 KB at 54.3 KB/sec)
Downloading: http://repo.cloudbees.com/content/repositories/central/com/google/collections/google-collections/1.0/google-collections-1.0.jar
Downloaded: http://repo.cloudbees.com/content/repositories/central/commons-logging/commons-logging-api/1.1/commons-logging-api-1.1.jar
(44 KB at 1893.6 KB/sec)
Downloading: http://repo.cloudbees.com/content/repositories/central/junit/junit/3.8.2/junit-3.8.2.jar
Downloaded: http://repo.cloudbees.com/content/repositories/central/log4j/log4j/1.2.12/log4j-1.2.12.jar
(350 KB at 4264.5 KB/sec)
Downloaded: http://repo.cloudbees.com/content/repositories/central/com/google/errorprone/error_prone_core/2.0.1/error_prone_core-2.0.1.jar
(2921 KB at 3468.7 KB/sec)
Downloaded: http://repo.cloudbees.com/content/repositories/central/com/google/collections/google-collections/1.0/google-collections-1.0.jar
(625 KB at 4768.0 KB/sec)
Downloaded: http://repo.cloudbees.com/content/repositories/central/junit/junit/3.8.2/junit-3.8.2.jar
(118 KB at 630.0 KB/sec)
Downloaded: http://repo.cloudbees.com/content/repositories/central/com/google/errorprone/javac/1.8.0-u20/javac-1.8.0-u20.jar
(2105 KB at 3388.8 KB/sec)
[INFO] Changes detected - recompiling the module!
[INFO] Compiling 160 source files to <https://jclouds.ci.cloudbees.com/job/jclouds-labs/ws/azurecompute/target/classes>
warning: No processor claimed any of these annotations: org.jclouds.rest.annotations.ResponseParser,com.google.inject.Singleton,javax.ws.rs.PUT,javax.ws.rs.Path,org.jclouds.rest.annotations.PayloadParam,javax.ws.rs.GET,javax.inject.Inject,org.jclouds.rest.annotations.Payload,org.jclouds.rest.annotations.ParamParser,javax.inject.Named,javax.annotation.Resource,com.google.inject.Provides,javax.ws.rs.POST,javax.ws.rs.PathParam,org.jclouds.rest.annotations.Delegate,javax.inject.Singleton,org.jclouds.rest.annotations.Headers,org.jclouds.location.Provider,org.jclouds.rest.annotations.BinderParam,com.google.inject.Inject,org.jclouds.rest.annotations.QueryParams,org.jclouds.rest.annotations.XMLResponseParser,org.jclouds.collect.Memoized,com.google.auto.value.AutoValue,org.jclouds.javax.annotation.Nullable,javax.ws.rs.Consumes,org.jclouds.rest.annotations.SinceApiVersion,com.google.common.annotations.VisibleForTesting,org.jclouds.rest.ConfiguresHttpApi,org.jclouds.rest.annotations.Fallback,javax.ws.rs.Produces,javax.ws.rs.DELETE
warning: No processor claimed any of these annotations: org.jclouds.rest.annotations.SinceApiVersion,org.jclouds.javax.annotation.Nullable,javax.annotation.Generated
Note: Some input files use unchecked or unsafe operations.
Note: Recompile with -Xlint:unchecked for details.
2 warnings
[INFO] 
[INFO] --- maven-resources-plugin:2.6:testResources (default-testResources) @ azurecompute
---
[INFO] Using 'UTF-8' encoding to copy filtered resources.
[INFO] skip non existing resourceDirectory <https://jclouds.ci.cloudbees.com/job/jclouds-labs/ws/azurecompute/src/test/clojure>
[INFO] Copying 57 resources
[INFO] Copying 3 resources
[INFO] 
[INFO] --- maven-compiler-plugin:3.1:testCompile (default-testCompile) @ azurecompute ---
[INFO] Changes detected - recompiling the module!
[INFO] Compiling 70 source files to <https://jclouds.ci.cloudbees.com/job/jclouds-labs/ws/azurecompute/target/test-classes>
<https://jclouds.ci.cloudbees.com/job/jclouds-labs/ws/azurecompute/src/test/java/org/jclouds/azurecompute/compute/AzureComputeServiceContextLiveTest.java>:20:
error: class, interface, or enum expected
<<<<<<< HEAD
^
<https://jclouds.ci.cloudbees.com/job/jclouds-labs/ws/azurecompute/src/test/java/org/jclouds/azurecompute/compute/AzureComputeServiceContextLiveTest.java>:23:
error: class, interface, or enum expected
=======
^
<https://jclouds.ci.cloudbees.com/job/jclouds-labs/ws/azurecompute/src/test/java/org/jclouds/azurecompute/compute/AzureComputeServiceContextLiveTest.java>:27:
error: class, interface, or enum expected
>>>>>>> 0e31d0a... [azurecompute] fix RoleInstanceHandler when Role is
suspended
^
<https://jclouds.ci.cloudbees.com/job/jclouds-labs/ws/azurecompute/src/test/java/org/jclouds/azurecompute/compute/AzureComputeServiceContextLiveTest.java>:31:
error: class, interface, or enum expected
<<<<<<< HEAD
^
<https://jclouds.ci.cloudbees.com/job/jclouds-labs/ws/azurecompute/src/test/java/org/jclouds/azurecompute/compute/AzureComputeServiceContextLiveTest.java>:37:
error: class, interface, or enum expected
<<<<<<< HEAD
^
<https://jclouds.ci.cloudbees.com/job/jclouds-labs/ws/azurecompute/src/test/java/org/jclouds/azurecompute/compute/AzureComputeServiceContextLiveTest.java>:40:
error: class, interface, or enum expected
=======
^
<https://jclouds.ci.cloudbees.com/job/jclouds-labs/ws/azurecompute/src/test/java/org/jclouds/azurecompute/compute/AzureComputeServiceContextLiveTest.java>:46:
error: class, interface, or enum expected
>>>>>>> 5ff5bb2... [azurecompute] fix JCLOUDS-952
^
7 errors
Started calculate disk usage of build
Finished Calculation of disk usage of build in 0 seconds
Started calculate disk usage of workspace
Finished Calculation of disk usage of workspace in 0 seconds
[INFO] ------------------------------------------------------------------------
[INFO] Reactor Summary:
[INFO] 
[INFO] Apache jclouds labs ............................... SUCCESS [2:17.167s]
[INFO] jclouds azure compute API ......................... FAILURE [13.885s]
[INFO] jclouds docker API ................................ SKIPPED
[INFO] jclouds cdmi api .................................. SKIPPED
[INFO] jclouds CloudSigma v2 API ......................... SKIPPED
[INFO] jclouds CloudSigma v2 Honolulu Provider ........... SKIPPED
[INFO] jclouds CloudSigma v2 Las Vegas Provider .......... SKIPPED
[INFO] jclouds CloudSigma v2 San Jose Provider ........... SKIPPED
[INFO] jclouds CloudSigma v2 Washington DC Provider ...... SKIPPED
[INFO] jclouds CloudSigma v2 Zurich Provider ............. SKIPPED
[INFO] jclouds DigitalOcean Provider ..................... SKIPPED
[INFO] jclouds DigitalOcean v2 API Provider .............. SKIPPED
[INFO] jclouds jdbc core ................................. SKIPPED
[INFO] jclouds joyent-cloudapi api ....................... SKIPPED
[INFO] jclouds joyentcloud provider ...................... SKIPPED
[INFO] jclouds Abiquo api ................................ SKIPPED
[INFO] jclouds ProfitBricks api .......................... SKIPPED
[INFO] jclouds shipyard API .............................. SKIPPED
[INFO] ------------------------------------------------------------------------
[INFO] BUILD FAILURE
[INFO] ------------------------------------------------------------------------
[INFO] Total time: 2:47.100s
[INFO] Finished at: Wed Jul 01 12:36:26 EDT 2015
[INFO] Final Memory: 72M/182M
[INFO] ------------------------------------------------------------------------
Waiting for Jenkins to finish collecting data
[ERROR] Failed to execute goal org.apache.maven.plugins:maven-compiler-plugin:3.1:testCompile
(default-testCompile) on project azurecompute: Compilation failure -> [Help 1]
org.apache.maven.lifecycle.LifecycleExecutionException: Failed to execute goal org.apache.maven.plugins:maven-compiler-plugin:3.1:testCompile
(default-testCompile) on project azurecompute: Compilation failure
	at org.apache.maven.lifecycle.internal.MojoExecutor.execute(MojoExecutor.java:213)
	at org.apache.maven.lifecycle.internal.MojoExecutor.execute(MojoExecutor.java:153)
	at org.apache.maven.lifecycle.internal.MojoExecutor.execute(MojoExecutor.java:145)
	at org.apache.maven.lifecycle.internal.LifecycleModuleBuilder.buildProject(LifecycleModuleBuilder.java:84)
	at org.apache.maven.lifecycle.internal.LifecycleModuleBuilder.buildProject(LifecycleModuleBuilder.java:59)
	at org.apache.maven.lifecycle.internal.LifecycleStarter.singleThreadedBuild(LifecycleStarter.java:183)
	at org.apache.maven.lifecycle.internal.LifecycleStarter.execute(LifecycleStarter.java:161)
	at org.apache.maven.DefaultMaven.doExecute(DefaultMaven.java:320)
	at org.apache.maven.DefaultMaven.execute(DefaultMaven.java:156)
	at org.jvnet.hudson.maven3.launcher.Maven3Launcher.main(Maven3Launcher.java:117)
	at sun.reflect.NativeMethodAccessorImpl.invoke0(Native Method)
	at sun.reflect.NativeMethodAccessorImpl.invoke(NativeMethodAccessorImpl.java:57)
	at sun.reflect.DelegatingMethodAccessorImpl.invoke(DelegatingMethodAccessorImpl.java:43)
	at java.lang.reflect.Method.invoke(Method.java:606)
	at org.codehaus.plexus.classworlds.launcher.Launcher.launchStandard(Launcher.java:329)
	at org.codehaus.plexus.classworlds.launcher.Launcher.launch(Launcher.java:239)
	at org.jvnet.hudson.maven3.agent.Maven3Main.launch(Maven3Main.java:178)
	at sun.reflect.NativeMethodAccessorImpl.invoke0(Native Method)
	at sun.reflect.NativeMethodAccessorImpl.invoke(NativeMethodAccessorImpl.java:57)
	at sun.reflect.DelegatingMethodAccessorImpl.invoke(DelegatingMethodAccessorImpl.java:43)
	at java.lang.reflect.Method.invoke(Method.java:606)
	at hudson.maven.Maven3Builder.call(Maven3Builder.java:136)
	at hudson.maven.Maven3Builder.call(Maven3Builder.java:71)
	at hudson.remoting.UserRequest.perform(UserRequest.java:121)
	at hudson.remoting.UserRequest.perform(UserRequest.java:49)
	at hudson.remoting.Request$2.run(Request.java:324)
	at hudson.remoting.InterceptingExecutorService$1.call(InterceptingExecutorService.java:68)
	at java.util.concurrent.FutureTask.run(FutureTask.java:262)
	at java.util.concurrent.ThreadPoolExecutor.runWorker(ThreadPoolExecutor.java:1145)
	at java.util.concurrent.ThreadPoolExecutor$Worker.run(ThreadPoolExecutor.java:615)
	at java.lang.Thread.run(Thread.java:745)
Caused by: org.apache.maven.plugin.compiler.CompilationFailureException: Compilation failure
	at org.apache.maven.plugin.compiler.AbstractCompilerMojo.execute(AbstractCompilerMojo.java:862)
	at org.apache.maven.plugin.compiler.TestCompilerMojo.execute(TestCompilerMojo.java:152)
	at org.apache.maven.plugin.DefaultBuildPluginManager.executeMojo(DefaultBuildPluginManager.java:101)
	at org.apache.maven.lifecycle.internal.MojoExecutor.execute(MojoExecutor.java:209)
	... 30 more
[ERROR] 
[ERROR] Re-run Maven using the -X switch to enable full debug logging.
[ERROR] 
[ERROR] For more information about the errors and possible solutions, please read the following
articles:
[ERROR] [Help 1] http://cwiki.apache.org/confluence/display/MAVEN/MojoFailureException
[ERROR] 
[ERROR] After correcting the problems, you can resume the build with the command
[ERROR]   mvn <goals> -rf :azurecompute
[JENKINS] Archiving <https://jclouds.ci.cloudbees.com/job/jclouds-labs/ws/cloudsigma2/pom.xml>
to org.apache.jclouds.labs/cloudsigma2/2.0.0-SNAPSHOT/cloudsigma2-2.0.0-SNAPSHOT.pom
[JENKINS] Archiving <https://jclouds.ci.cloudbees.com/job/jclouds-labs/ws/joyent-cloudapi/pom.xml>
to org.apache.jclouds.labs/joyent-cloudapi/2.0.0-SNAPSHOT/joyent-cloudapi-2.0.0-SNAPSHOT.pom
[JENKINS] Archiving <https://jclouds.ci.cloudbees.com/job/jclouds-labs/ws/cloudsigma2-zrh/pom.xml>
to org.apache.jclouds.labs/cloudsigma2-zrh/2.0.0-SNAPSHOT/cloudsigma2-zrh-2.0.0-SNAPSHOT.pom
[JENKINS] Archiving <https://jclouds.ci.cloudbees.com/job/jclouds-labs/ws/pom.xml> to
org.apache.jclouds.labs/jclouds-labs/2.0.0-SNAPSHOT/jclouds-labs-2.0.0-SNAPSHOT.pom
[JENKINS] Archiving <https://jclouds.ci.cloudbees.com/job/jclouds-labs/ws/target/jclouds-labs-2.0.0-SNAPSHOT-tests.jar>
to org.apache.jclouds.labs/jclouds-labs/2.0.0-20150701.163549-475/jclouds-labs-2.0.0-20150701.163549-475-tests.jar
[JENKINS] Archiving <https://jclouds.ci.cloudbees.com/job/jclouds-labs/ws/target/jclouds-labs-2.0.0-SNAPSHOT-javadoc.jar>
to org.apache.jclouds.labs/jclouds-labs/2.0.0-20150701.163549-475/jclouds-labs-2.0.0-20150701.163549-475-javadoc.jar
[JENKINS] Archiving <https://jclouds.ci.cloudbees.com/job/jclouds-labs/ws/docker/pom.xml>
to org.apache.jclouds.labs/docker/2.0.0-SNAPSHOT/docker-2.0.0-SNAPSHOT.pom
[JENKINS] Archiving <https://jclouds.ci.cloudbees.com/job/jclouds-labs/ws/cloudsigma2-wdc/pom.xml>
to org.apache.jclouds.labs/cloudsigma2-wdc/2.0.0-SNAPSHOT/cloudsigma2-wdc-2.0.0-SNAPSHOT.pom
[JENKINS] Archiving <https://jclouds.ci.cloudbees.com/job/jclouds-labs/ws/digitalocean2/pom.xml>
to org.apache.jclouds.labs/digitalocean2/2.0.0-SNAPSHOT/digitalocean2-2.0.0-SNAPSHOT.pom
[JENKINS] Archiving <https://jclouds.ci.cloudbees.com/job/jclouds-labs/ws/profitbricks/pom.xml>
to org.apache.jclouds.labs/profitbricks/2.0.0-SNAPSHOT/profitbricks-2.0.0-SNAPSHOT.pom
[JENKINS] Archiving <https://jclouds.ci.cloudbees.com/job/jclouds-labs/ws/jdbc/pom.xml>
to org.apache.jclouds.labs/jdbc/2.0.0-SNAPSHOT/jdbc-2.0.0-SNAPSHOT.pom
[JENKINS] Archiving <https://jclouds.ci.cloudbees.com/job/jclouds-labs/ws/cloudsigma2-sjc/pom.xml>
to org.apache.jclouds.labs/cloudsigma2-sjc/2.0.0-SNAPSHOT/cloudsigma2-sjc-2.0.0-SNAPSHOT.pom
[JENKINS] Archiving <https://jclouds.ci.cloudbees.com/job/jclouds-labs/ws/digitalocean/pom.xml>
to org.apache.jclouds.labs/digitalocean/2.0.0-SNAPSHOT/digitalocean-2.0.0-SNAPSHOT.pom
[JENKINS] Archiving <https://jclouds.ci.cloudbees.com/job/jclouds-labs/ws/azurecompute/pom.xml>
to org.apache.jclouds.labs/azurecompute/2.0.0-SNAPSHOT/azurecompute-2.0.0-SNAPSHOT.pom
[JENKINS] Archiving <https://jclouds.ci.cloudbees.com/job/jclouds-labs/ws/joyentcloud/pom.xml>
to org.apache.jclouds.labs/joyentcloud/2.0.0-SNAPSHOT/joyentcloud-2.0.0-SNAPSHOT.pom
[JENKINS] Archiving <https://jclouds.ci.cloudbees.com/job/jclouds-labs/ws/shipyard/pom.xml>
to org.apache.jclouds.labs/shipyard/2.0.0-SNAPSHOT/shipyard-2.0.0-SNAPSHOT.pom
[JENKINS] Archiving <https://jclouds.ci.cloudbees.com/job/jclouds-labs/ws/cloudsigma2-lvs/pom.xml>
to org.apache.jclouds.labs/cloudsigma2-lvs/2.0.0-SNAPSHOT/cloudsigma2-lvs-2.0.0-SNAPSHOT.pom
[JENKINS] Archiving <https://jclouds.ci.cloudbees.com/job/jclouds-labs/ws/abiquo/pom.xml>
to org.apache.jclouds.labs/abiquo/2.0.0-SNAPSHOT/abiquo-2.0.0-SNAPSHOT.pom
[JENKINS] Archiving <https://jclouds.ci.cloudbees.com/job/jclouds-labs/ws/cloudsigma2-hnl/pom.xml>
to org.apache.jclouds.labs/cloudsigma2-hnl/2.0.0-SNAPSHOT/cloudsigma2-hnl-2.0.0-SNAPSHOT.pom
[JENKINS] Archiving <https://jclouds.ci.cloudbees.com/job/jclouds-labs/ws/cdmi/pom.xml>
to org.apache.jclouds.labs/cdmi/2.0.0-SNAPSHOT/cdmi-2.0.0-SNAPSHOT.pom
Sending e-mails to: notifications@jclouds.apache.org
channel stopped

Mime
View raw message