jclouds-notifications mailing list archives

Site index · List index
Message view « Date » · « Thread »
Top « Date » · « Thread »
From jenkins-no-re...@cloudbees.com
Subject Build failed in Jenkins: jclouds-guava-17-18 » 17.0,OpenJDK 7 (latest) #322
Date Fri, 03 Jul 2015 06:15:43 GMT
See <https://jclouds.ci.cloudbees.com/job/jclouds-guava-17-18/GUAVA_VERSION=17.0,jdk=OpenJDK%207%20(latest)/322/changes>

Changes:

[Andrew Gaul] JCLOUDS-894: Skip multipart tests on Atmos

------------------------------------------
[...truncated 15219 lines...]
Test suite progress: tests succeeded: 57, failed: 0, skipped: 2.
Starting test testClearWhenContentsUnderPath(org.jclouds.blobstore.integration.TransientContainerIntegrationTest)
[TestNG] Test testClearWhenContentsUnderPath(org.jclouds.blobstore.integration.TransientContainerIntegrationTest)
succeeded: 6ms
Test suite progress: tests succeeded: 58, failed: 0, skipped: 2.
[TestNG] Test testDelimiter(org.jclouds.blobstore.integration.TransientContainerIntegrationTest)
skipped.
Test suite progress: tests succeeded: 58, failed: 0, skipped: 3.
Starting test testDirectory(org.jclouds.blobstore.integration.TransientContainerIntegrationTest)
[TestNG] Test testDirectory(org.jclouds.blobstore.integration.TransientContainerIntegrationTest)
failed.
Test suite progress: tests succeeded: 58, failed: 1, skipped: 3.
Starting test testListContainer(org.jclouds.blobstore.integration.TransientContainerIntegrationTest)
[TestNG] Test testListContainer(org.jclouds.blobstore.integration.TransientContainerIntegrationTest)
succeeded: 3ms
Test suite progress: tests succeeded: 59, failed: 1, skipped: 3.
Starting test testListContainerGetBlobSize(org.jclouds.blobstore.integration.TransientContainerIntegrationTest)
[TestNG] Test testListContainerGetBlobSize(org.jclouds.blobstore.integration.TransientContainerIntegrationTest)
succeeded: 0ms
Test suite progress: tests succeeded: 60, failed: 1, skipped: 3.
Starting test testListContainerMarker(org.jclouds.blobstore.integration.TransientContainerIntegrationTest)
[TestNG] Test testListContainerMarker(org.jclouds.blobstore.integration.TransientContainerIntegrationTest)
succeeded: 10ms
Test suite progress: tests succeeded: 61, failed: 1, skipped: 3.
Starting test testListContainerMaxResults(org.jclouds.blobstore.integration.TransientContainerIntegrationTest)
[TestNG] Test testListContainerMaxResults(org.jclouds.blobstore.integration.TransientContainerIntegrationTest)
succeeded: 9ms
Test suite progress: tests succeeded: 62, failed: 1, skipped: 3.
Starting test testListContainerPrefix(org.jclouds.blobstore.integration.TransientContainerIntegrationTest)
[TestNG] Test testListContainerPrefix(org.jclouds.blobstore.integration.TransientContainerIntegrationTest)
succeeded: 9ms
Test suite progress: tests succeeded: 63, failed: 1, skipped: 3.
Starting test testListContainerWithZeroMaxResults(org.jclouds.blobstore.integration.TransientContainerIntegrationTest)
[TestNG] Test testListContainerWithZeroMaxResults(org.jclouds.blobstore.integration.TransientContainerIntegrationTest)
succeeded: 1ms
Test suite progress: tests succeeded: 64, failed: 1, skipped: 3.
Starting test testListMarkerAfterLastKey(org.jclouds.blobstore.integration.TransientContainerIntegrationTest)
[TestNG] Test testListMarkerAfterLastKey(org.jclouds.blobstore.integration.TransientContainerIntegrationTest)
succeeded: 1ms
Test suite progress: tests succeeded: 65, failed: 1, skipped: 3.
Starting test testListRootUsesDelimiter(org.jclouds.blobstore.integration.TransientContainerIntegrationTest)
[TestNG] Test testListRootUsesDelimiter(org.jclouds.blobstore.integration.TransientContainerIntegrationTest)
succeeded: 7ms
Test suite progress: tests succeeded: 66, failed: 1, skipped: 3.
Starting test testPutTwiceIsOkAndDoesntOverwrite(org.jclouds.blobstore.integration.TransientContainerIntegrationTest)
[TestNG] Test testPutTwiceIsOkAndDoesntOverwrite(org.jclouds.blobstore.integration.TransientContainerIntegrationTest)
succeeded: 0ms
Test suite progress: tests succeeded: 67, failed: 1, skipped: 3.
Starting test testSetContainerAccess(org.jclouds.blobstore.integration.TransientContainerIntegrationTest)
*** allocated new container jenkins-blobstore6949900321514899503...
[TestNG] Test testSetContainerAccess(org.jclouds.blobstore.integration.TransientContainerIntegrationTest)
succeeded: 3ms
Test suite progress: tests succeeded: 68, failed: 1, skipped: 3.
Starting test testWithDetails(org.jclouds.blobstore.integration.TransientContainerIntegrationTest)
[TestNG] Test testWithDetails(org.jclouds.blobstore.integration.TransientContainerIntegrationTest)
succeeded: 5ms
Test suite progress: tests succeeded: 69, failed: 1, skipped: 3.
Starting test containerDoesntExist(org.jclouds.blobstore.integration.TransientServiceIntegrationTest)
[TestNG] Test containerDoesntExist(org.jclouds.blobstore.integration.TransientServiceIntegrationTest)
succeeded: 0ms
Test suite progress: tests succeeded: 70, failed: 1, skipped: 3.
Starting test testAllLocations(org.jclouds.blobstore.integration.TransientServiceIntegrationTest)
*** allocated new container jenkins-blobstore6858385816309227423...
 >> creating container in location {scope=PROVIDER, id=transient, description=http://localhost}
 << call complete.. checking
*** allocated new container jenkins-blobstore-153818368598936124...
[TestNG] Test testAllLocations(org.jclouds.blobstore.integration.TransientServiceIntegrationTest)
succeeded: 9ms
Test suite progress: tests succeeded: 71, failed: 1, skipped: 3.
Starting test testGetAssignableLocations(org.jclouds.blobstore.integration.TransientServiceIntegrationTest)
location {scope=PROVIDER, id=transient, description=http://localhost}
[TestNG] Test testGetAssignableLocations(org.jclouds.blobstore.integration.TransientServiceIntegrationTest)
succeeded: 1ms
Test suite progress: tests succeeded: 72, failed: 1, skipped: 3.
Starting test testDuplicateCreateContainer(org.jclouds.blobstore.integration.TransientContainerIntegrationTest)
[TestNG] Test testDuplicateCreateContainer(org.jclouds.blobstore.integration.TransientContainerIntegrationTest)
succeeded: 0ms
Test suite progress: tests succeeded: 73, failed: 1, skipped: 3.
Starting test testNotWithDetails(org.jclouds.blobstore.integration.TransientContainerIntegrationTest)
[TestNG] Test testNotWithDetails(org.jclouds.blobstore.integration.TransientContainerIntegrationTest)
succeeded: 8ms
Test suite progress: tests succeeded: 74, failed: 1, skipped: 3.
Tests run: 78, Failures: 1, Errors: 0, Skipped: 3, Time elapsed: 7.748 sec <<< FAILURE!
- in TestSuite
testDirectory(org.jclouds.blobstore.integration.TransientContainerIntegrationTest)  Time elapsed:
0.006 sec  <<< FAILURE!
java.lang.AssertionError: []
	at org.jclouds.blobstore.integration.internal.BaseContainerIntegrationTest.testDirectory(BaseContainerIntegrationTest.java:224)
	at sun.reflect.NativeMethodAccessorImpl.invoke0(Native Method)
	at sun.reflect.NativeMethodAccessorImpl.invoke(NativeMethodAccessorImpl.java:57)
	at sun.reflect.DelegatingMethodAccessorImpl.invoke(DelegatingMethodAccessorImpl.java:43)
	at java.lang.reflect.Method.invoke(Method.java:606)
	at org.testng.internal.MethodInvocationHelper.invokeMethod(MethodInvocationHelper.java:84)
	at org.testng.internal.Invoker.invokeMethod(Invoker.java:714)
	at org.testng.internal.Invoker.invokeTestMethod(Invoker.java:901)
	at org.testng.internal.Invoker.invokeTestMethods(Invoker.java:1231)
	at org.testng.internal.TestMethodWorker.invokeTestMethods(TestMethodWorker.java:127)
	at org.testng.internal.TestMethodWorker.run(TestMethodWorker.java:111)
	at org.testng.TestRunner.privateRun(TestRunner.java:767)
	at org.testng.TestRunner.run(TestRunner.java:617)
	at org.testng.SuiteRunner.runTest(SuiteRunner.java:348)
	at org.testng.SuiteRunner.access$000(SuiteRunner.java:38)
	at org.testng.SuiteRunner$SuiteWorker.run(SuiteRunner.java:382)
	at org.testng.internal.thread.ThreadUtil$2.call(ThreadUtil.java:64)
	at java.util.concurrent.FutureTask.run(FutureTask.java:262)
	at java.util.concurrent.ThreadPoolExecutor.runWorker(ThreadPoolExecutor.java:1145)
	at java.util.concurrent.ThreadPoolExecutor$Worker.run(ThreadPoolExecutor.java:615)
	at java.lang.Thread.run(Thread.java:744)


Results :

Failed tests: 
  TransientContainerIntegrationTest>BaseContainerIntegrationTest.testDirectory:224 []

Tests run: 78, Failures: 1, Errors: 0, Skipped: 3

[INFO] ------------------------------------------------------------------------
[INFO] Reactor Summary:
[INFO] 
[INFO] Apache jclouds Project ............................ SUCCESS [15.214s]
[INFO] jclouds shared Maven resources .................... SUCCESS [5.360s]
[INFO] jclouds Components Core ........................... SUCCESS [1:27.612s]
[INFO] jclouds SLF4J Logging Module ...................... SUCCESS [3.214s]
[INFO] jclouds OAuth core ................................ SUCCESS [5.286s]
[INFO] jclouds Google Cloud Core ......................... SUCCESS [2.655s]
[INFO] jclouds OpenStack Components Core ................. SUCCESS [20.791s]
[INFO] jclouds commons project ........................... SUCCESS [0.948s]
[INFO] jclouds script builder ............................ SUCCESS [6.481s]
[INFO] jclouds compute core .............................. SUCCESS [48.701s]
[INFO] jclouds Log4J Logging Module ...................... SUCCESS [2.568s]
[INFO] jclouds loadbalancer core ......................... SUCCESS [2.504s]
[INFO] jclouds sts api ................................... SUCCESS [7.150s]
[INFO] jclouds cloudwatch api ............................ SUCCESS [8.180s]
[INFO] jclouds bouncycastle EncryptionService Module ..... SUCCESS [4.491s]
[INFO] jclouds sshj ssh client ........................... SUCCESS [7.116s]
[INFO] jclouds cloudstack core ........................... SUCCESS [1:04.216s]
[INFO] jclouds blobstore core ............................ FAILURE [28.412s]
[INFO] jclouds filesystem core ........................... SKIPPED
[INFO] jclouds bring your own node provider .............. SKIPPED
[INFO] jclouds OkHttp Driver ............................. SKIPPED
[INFO] jclouds s3 api .................................... SKIPPED
[INFO] jclouds ec2 api ................................... SKIPPED
[INFO] jclouds sqs api ................................... SKIPPED
[INFO] jclouds elasticstack core ......................... SKIPPED
[INFO] jclouds atmos components .......................... SKIPPED
[INFO] jclouds openstack-keystone api .................... SKIPPED
[INFO] jclouds swift api ................................. SKIPPED
[INFO] jclouds openstack-cinder api ...................... SKIPPED
[INFO] Apache jclouds :: OpenStack :: Nova API ........... SKIPPED
[INFO] jclouds openstack-nova-ec2 api .................... SKIPPED
[INFO] jclouds openstack-swift api ....................... SKIPPED
[INFO] jclouds openstack-trove api ....................... SKIPPED
[INFO] jclouds rackspace cloudidentity api ............... SKIPPED
[INFO] jclouds Rackspace Cloud Load Balancers API ........ SKIPPED
[INFO] jclouds Rackspace Next Generation Cloud Block Storage US provider  SKIPPED
[INFO] jclouds Rackspace Next Generation Cloud Servers US provider  SKIPPED
[INFO] jclouds rackspace clouddns api .................... SKIPPED
[INFO] jclouds rackspace-cloudfiles api .................. SKIPPED
[INFO] jclouds route53 api ............................... SKIPPED
[INFO] jclouds Chef api .................................. SKIPPED
[INFO] jclouds apis project .............................. SKIPPED
[INFO] jclouds GoGrid provider ........................... SKIPPED
[INFO] jclouds Azure Storage provider .................... SKIPPED
[INFO] jclouds Apache Http Components Client ............. SKIPPED
[INFO] jclouds joda DateService Module ................... SKIPPED
[INFO] jclouds netty payload module ...................... SKIPPED
[INFO] jclouds enterprise Module ......................... SKIPPED
[INFO] jclouds Amazon Simple Storage Service (S3) provider  SKIPPED
[INFO] jclouds Amazon Elastic Load Balancer provider ..... SKIPPED
[INFO] jclouds Amazon EC2 provider ....................... SKIPPED
[INFO] jclouds Amazon Simple Queue Service provider ...... SKIPPED
[INFO] jclouds ElasticHosts Peer1 London provider ........ SKIPPED
[INFO] jclouds ElasticHosts Peer1 San Antonio provider ... SKIPPED
[INFO] jclouds ElasticHosts BlueSquare London provider ... SKIPPED
[INFO] jclouds ElasticHosts Peer1 Toronto provider ....... SKIPPED
[INFO] jclouds ElasticHosts Peer1 Los Angeles provider ... SKIPPED
[INFO] jclouds ElasticHosts Amsterdam provider ........... SKIPPED
[INFO] jclouds ElasticHosts San Jose provider ............ SKIPPED
[INFO] jclouds ElasticHosts Hong Kong provider ........... SKIPPED
[INFO] jclouds ElasticHosts Sydney provider .............. SKIPPED
[INFO] jclouds Open Hosting East1 provider ............... SKIPPED
[INFO] jclouds Serverlove Manchester provider ............ SKIPPED
[INFO] jclouds SkaliCloud Malaysia provider .............. SKIPPED
[INFO] jclouds Go2Cloud Johannesburg1 provider ........... SKIPPED
[INFO] jclouds Google Compute Engine provider ............ SKIPPED
[INFO] jclouds SoftLayer core ............................ SKIPPED
[INFO] jclouds HP Cloud Compute provider ................. SKIPPED
[INFO] jclouds HP Cloud Block Storage Provider ........... SKIPPED
[INFO] jclouds HP Cloud Object Storage ................... SKIPPED
[INFO] jclouds Rackspace Cloud Files US provider ......... SKIPPED
[INFO] jclouds Rackspace Cloud Files UK provider ......... SKIPPED
[INFO] jclouds Rackspace Next Generation Cloud DNS US provider  SKIPPED
[INFO] jclouds Rackspace Next Generation Cloud DNS UK provider  SKIPPED
[INFO] jclouds Rackspace Cloud Databases US provider ..... SKIPPED
[INFO] jclouds Rackspace Cloud Databases UK provider ..... SKIPPED
[INFO] jclouds Rackspace Cloud Load Balancers US provider  SKIPPED
[INFO] jclouds Rackspace Cloud Load Balancers UK provider  SKIPPED
[INFO] jclouds Rackspace Next Generation Cloud Block Storage UK provider  SKIPPED
[INFO] jclouds Rackspace Next Generation Cloud Servers provider  SKIPPED
[INFO] jclouds GleSYS core ............................... SKIPPED
[INFO] jclouds Amazon Identity and Access Management (STS) provider  SKIPPED
[INFO] jclouds Amazon Route 53 provider .................. SKIPPED
[INFO] jclouds ultradns-ws provider ...................... SKIPPED
[INFO] jclouds dynect api ................................ SKIPPED
[INFO] jclouds Enterprise Chef provider .................. SKIPPED
[INFO] jclouds providers project ......................... SKIPPED
[INFO] jclouds jsch ssh client ........................... SKIPPED
[INFO] jclouds example components for a standalone compute provider  SKIPPED
[INFO] jclouds skeletons project ......................... SKIPPED
[INFO] jclouds Google App Engine Components .............. SKIPPED
[INFO] jclouds drivers project ........................... SKIPPED
[INFO] allcompute ........................................ SKIPPED
[INFO] allblobstore ...................................... SKIPPED
[INFO] allloadbalancer ................................... SKIPPED
[INFO] all ............................................... SKIPPED
[INFO] Apache jclouds .................................... SKIPPED
[INFO] ------------------------------------------------------------------------
[INFO] BUILD FAILURE
[INFO] ------------------------------------------------------------------------
[INFO] Total time: 5:23.816s
[INFO] Finished at: Fri Jul 03 02:15:40 EDT 2015
[INFO] Final Memory: 120M/359M
[INFO] ------------------------------------------------------------------------
[ERROR] Failed to execute goal org.apache.maven.plugins:maven-surefire-plugin:2.17:test (integration)
on project jclouds-blobstore: There are test failures.
[ERROR] 
[ERROR] Please refer to <https://jclouds.ci.cloudbees.com/job/jclouds-guava-17-18/GUAVA_VERSION=17.0,jdk=OpenJDK%207%20(latest)/ws/blobstore/target/surefire-reports>
for the individual test results.
[ERROR] -> [Help 1]
org.apache.maven.lifecycle.LifecycleExecutionException: Failed to execute goal org.apache.maven.plugins:maven-surefire-plugin:2.17:test
(integration) on project jclouds-blobstore: There are test failures.

Please refer to <https://jclouds.ci.cloudbees.com/job/jclouds-guava-17-18/GUAVA_VERSION=17.0,jdk=OpenJDK%207%20(latest)/ws/blobstore/target/surefire-reports>
for the individual test results.
	at org.apache.maven.lifecycle.internal.MojoExecutor.execute(MojoExecutor.java:213)
	at org.apache.maven.lifecycle.internal.MojoExecutor.execute(MojoExecutor.java:153)
	at org.apache.maven.lifecycle.internal.MojoExecutor.execute(MojoExecutor.java:145)
	at org.apache.maven.lifecycle.internal.LifecycleModuleBuilder.buildProject(LifecycleModuleBuilder.java:84)
	at org.apache.maven.lifecycle.internal.LifecycleModuleBuilder.buildProject(LifecycleModuleBuilder.java:59)
	at org.apache.maven.lifecycle.internal.LifecycleStarter.singleThreadedBuild(LifecycleStarter.java:183)
	at org.apache.maven.lifecycle.internal.LifecycleStarter.execute(LifecycleStarter.java:161)
	at org.apache.maven.DefaultMaven.doExecute(DefaultMaven.java:320)
	at org.apache.maven.DefaultMaven.execute(DefaultMaven.java:156)
	at org.apache.maven.cli.MavenCli.execute(MavenCli.java:537)
	at org.apache.maven.cli.MavenCli.doMain(MavenCli.java:196)
	at org.apache.maven.cli.MavenCli.main(MavenCli.java:141)
	at sun.reflect.NativeMethodAccessorImpl.invoke0(Native Method)
	at sun.reflect.NativeMethodAccessorImpl.invoke(NativeMethodAccessorImpl.java:57)
	at sun.reflect.DelegatingMethodAccessorImpl.invoke(DelegatingMethodAccessorImpl.java:43)
	at java.lang.reflect.Method.invoke(Method.java:606)
	at org.codehaus.plexus.classworlds.launcher.Launcher.launchEnhanced(Launcher.java:290)
	at org.codehaus.plexus.classworlds.launcher.Launcher.launch(Launcher.java:230)
	at org.codehaus.plexus.classworlds.launcher.Launcher.mainWithExitCode(Launcher.java:409)
	at org.codehaus.plexus.classworlds.launcher.Launcher.main(Launcher.java:352)
Caused by: org.apache.maven.plugin.MojoFailureException: There are test failures.

Please refer to <https://jclouds.ci.cloudbees.com/job/jclouds-guava-17-18/GUAVA_VERSION=17.0,jdk=OpenJDK%207%20(latest)/ws/blobstore/target/surefire-reports>
for the individual test results.
	at org.apache.maven.plugin.surefire.SurefireHelper.reportExecution(SurefireHelper.java:82)
	at org.apache.maven.plugin.surefire.SurefirePlugin.handleSummary(SurefirePlugin.java:195)
	at org.apache.maven.plugin.surefire.AbstractSurefireMojo.executeAfterPreconditionsChecked(AbstractSurefireMojo.java:861)
	at org.apache.maven.plugin.surefire.AbstractSurefireMojo.execute(AbstractSurefireMojo.java:729)
	at org.apache.maven.plugin.DefaultBuildPluginManager.executeMojo(DefaultBuildPluginManager.java:101)
	at org.apache.maven.lifecycle.internal.MojoExecutor.execute(MojoExecutor.java:209)
	... 19 more
[ERROR] 
[ERROR] Re-run Maven using the -X switch to enable full debug logging.
[ERROR] 
[ERROR] For more information about the errors and possible solutions, please read the following
articles:
[ERROR] [Help 1] http://cwiki.apache.org/confluence/display/MAVEN/MojoFailureException
[ERROR] 
[ERROR] After correcting the problems, you can resume the build with the command
[ERROR]   mvn <goals> -rf :jclouds-blobstore
Build step 'Invoke top-level Maven targets' marked build as failure

Mime
View raw message