jclouds-notifications mailing list archives

Site index · List index
Message view « Date » · « Thread »
Top « Date » · « Thread »
From "Andrea Turli (JIRA)" <j...@apache.org>
Subject [jira] [Commented] (JCLOUDS-952) azure-compute cannot parse a suspended VM
Date Wed, 01 Jul 2015 15:39:04 GMT

    [ https://issues.apache.org/jira/browse/JCLOUDS-952?page=com.atlassian.jira.plugin.system.issuetabpanels:comment-tabpanel&focusedCommentId=14610484#comment-14610484
] 

Andrea Turli commented on JCLOUDS-952:
--------------------------------------

Here is the stacktrace of the error

-  Creating a cloud service with name 'andre-1242822577acsclt', label 'andre-1242822577acsclt'
in location 'West Europe'
-  >> "<CreateHostedService xmlns="http://schemas.microsoft.com/windowsazure"><ServiceName>andre-1242822577acsclt</ServiceName><Label>YW5kcmUtMTI0MjgyMjU3N2Fjc2NsdA==</Label><Location>West
Europe</Location></CreateHostedService>"
-  >> POST https://management.core.windows.net/341751b0-f348-45ce-9498-41cc68b4b45f/services/hostedservices
HTTP/1.1
-  >> x-ms-version: 2014-10-01
-  >> Accept: application/xml
-  >> Content-Type: application/xml
-  >> Content-Length: 221
-  << HTTP/1.1 409 Conflict
-  << x-ms-request-id: 7da1d0de23e2babdb0145185d50217a8
-  << Date: Wed, 01 Jul 2015 15:37:27 GMT
-  << x-ms-servedbyregion: ussouth3
-  << Server: 1.0.6198.243 (rd_rdfe_stable.150618-1025) Microsoft-HTTPAPI/2.0
-  << Cache-Control: no-cache
-  << Content-Type: application/xml; charset=utf-8
-  << Content-Length: 202
-  << "<Error xmlns="http://schemas.microsoft.com/windowsazure" xmlns:i="http://www.w3.org/2001/XMLSchema-instance"><Code>ConflictError</Code><Message>The
specified DNS name is already taken.</Message></Error>"
-  createNodesInGroup(andrea-1242822577-group-acsclt), completed: 0/1, errors: 1, rate: 2144ms/op
java.util.concurrent.ExecutionException: java.lang.IllegalStateException: <Error xmlns="http://schemas.microsoft.com/windowsazure"
xmlns:i="http://www.w3.org/2001/XMLSchema-instance"><Code>ConflictError</Code><Message>The
specified DNS name is already taken.</Message></Error>
	at com.google.common.util.concurrent.AbstractFuture$Sync.getValue(AbstractFuture.java:299)
~[guava-16.0.1.jar:na]
	at com.google.common.util.concurrent.AbstractFuture$Sync.get(AbstractFuture.java:286) ~[guava-16.0.1.jar:na]
	at com.google.common.util.concurrent.AbstractFuture.get(AbstractFuture.java:116) ~[guava-16.0.1.jar:na]
	at org.jclouds.concurrent.FutureIterables$1.run(FutureIterables.java:123) ~[jclouds-core-1.9.0.jar:1.9.0]
	at java.util.concurrent.ThreadPoolExecutor.runWorker(ThreadPoolExecutor.java:1145) [na:1.7.0_71]
	at java.util.concurrent.ThreadPoolExecutor$Worker.run(ThreadPoolExecutor.java:615) [na:1.7.0_71]
	at java.lang.Thread.run(Thread.java:745) [na:1.7.0_71]
Caused by: java.lang.IllegalStateException: <Error xmlns="http://schemas.microsoft.com/windowsazure"
xmlns:i="http://www.w3.org/2001/XMLSchema-instance"><Code>ConflictError</Code><Message>The
specified DNS name is already taken.</Message></Error>
	at org.jclouds.azurecompute.handlers.AzureComputeErrorHandler.handleError(AzureComputeErrorHandler.java:62)
~[classes/:na]
	at org.jclouds.http.handlers.DelegatingErrorHandler.handleError(DelegatingErrorHandler.java:65)
~[jclouds-core-1.9.0.jar:1.9.0]
	at org.jclouds.http.internal.BaseHttpCommandExecutorService.shouldContinue(BaseHttpCommandExecutorService.java:132)
~[jclouds-core-1.9.0.jar:1.9.0]
	at org.jclouds.http.internal.BaseHttpCommandExecutorService.invoke(BaseHttpCommandExecutorService.java:101)
~[jclouds-core-1.9.0.jar:1.9.0]
	at org.jclouds.rest.internal.InvokeHttpMethod.invoke(InvokeHttpMethod.java:90) ~[jclouds-core-1.9.0.jar:1.9.0]
	at org.jclouds.rest.internal.InvokeHttpMethod.apply(InvokeHttpMethod.java:73) ~[jclouds-core-1.9.0.jar:1.9.0]
	at org.jclouds.rest.internal.InvokeHttpMethod.apply(InvokeHttpMethod.java:44) ~[jclouds-core-1.9.0.jar:1.9.0]
	at org.jclouds.reflect.FunctionalReflection$FunctionalInvocationHandler.handleInvocation(FunctionalReflection.java:117)
~[jclouds-core-1.9.0.jar:1.9.0]
	at com.google.common.reflect.AbstractInvocationHandler.invoke(AbstractInvocationHandler.java:87)
~[guava-16.0.1.jar:na]
	at com.sun.proxy.$Proxy67.createWithLabelInLocation(Unknown Source) ~[na:na]
	at org.jclouds.azurecompute.compute.AzureComputeServiceAdapter.createNodeWithGroupEncodedIntoName(AzureComputeServiceAdapter.java:111)
~[classes/:na]
	at org.jclouds.compute.strategy.impl.AdaptingComputeServiceStrategies.createNodeWithGroupEncodedIntoName(AdaptingComputeServiceStrategies.java:195)
~[jclouds-compute-1.9.0.jar:1.9.0]
	at org.jclouds.compute.strategy.impl.CreateNodesWithGroupEncodedIntoNameThenAddToSet$AddNode.call(CreateNodesWithGroupEncodedIntoNameThenAddToSet.java:79)
~[jclouds-compute-1.9.0.jar:1.9.0]
	at org.jclouds.compute.strategy.impl.CreateNodesWithGroupEncodedIntoNameThenAddToSet$AddNode.call(CreateNodesWithGroupEncodedIntoNameThenAddToSet.java:63)
~[jclouds-compute-1.9.0.jar:1.9.0]
	at java.util.concurrent.FutureTask.run(FutureTask.java:262) ~[na:1.7.0_71]
	at java.util.concurrent.ThreadPoolExecutor.runWorker(ThreadPoolExecutor.java:1145) [na:1.7.0_71]
	at java.util.concurrent.ThreadPoolExecutor$Worker.run(ThreadPoolExecutor.java:615) [na:1.7.0_71]
	at java.lang.Thread.run(Thread.java:745) [na:1.7.0_71]
	at java.lang.Thread.getStackTrace(Thread.java:1589) [na:1.7.0_71]
	at org.jclouds.compute.strategy.impl.CreateNodesWithGroupEncodedIntoNameThenAddToSet.createNodeInGroupWithNameAndTemplate(CreateNodesWithGroupEncodedIntoNameThenAddToSet.java:167)
~[jclouds-compute-1.9.0.jar:1.9.0]
	at org.jclouds.azurecompute.compute.strategy.GetOrCreateStorageServiceAndVirtualNetworkThenCreateNodes.createNodeInGroupWithNameAndTemplate(GetOrCreateStorageServiceAndVirtualNetworkThenCreateNodes.java:113)
~[classes/:na]
	at org.jclouds.compute.strategy.impl.CreateNodesWithGroupEncodedIntoNameThenAddToSet.execute(CreateNodesWithGroupEncodedIntoNameThenAddToSet.java:122)
~[jclouds-compute-1.9.0.jar:1.9.0]
	at org.jclouds.azurecompute.compute.strategy.GetOrCreateStorageServiceAndVirtualNetworkThenCreateNodes.execute(GetOrCreateStorageServiceAndVirtualNetworkThenCreateNodes.java:186)
~[classes/:na]
	at org.jclouds.compute.internal.BaseComputeService.createNodesInGroup(BaseComputeService.java:210)
~[jclouds-compute-1.9.0.jar:1.9.0]
	at org.jclouds.azurecompute.compute.AzureComputeServiceContextLiveTest.testLaunchNode(AzureComputeServiceContextLiveTest.java:139)
~[test-classes/:na]
	at sun.reflect.NativeMethodAccessorImpl.invoke0(Native Method) ~[na:1.7.0_71]
	at sun.reflect.NativeMethodAccessorImpl.invoke(NativeMethodAccessorImpl.java:57) ~[na:1.7.0_71]
	at sun.reflect.DelegatingMethodAccessorImpl.invoke(DelegatingMethodAccessorImpl.java:43)
~[na:1.7.0_71]
	at java.lang.reflect.Method.invoke(Method.java:606) ~[na:1.7.0_71]
	at org.testng.internal.MethodInvocationHelper.invokeMethod(MethodInvocationHelper.java:84)
~[testng-6.8.8.jar:na]
	at org.testng.internal.Invoker.invokeMethod(Invoker.java:714) ~[testng-6.8.8.jar:na]
	at org.testng.internal.Invoker.invokeTestMethod(Invoker.java:901) ~[testng-6.8.8.jar:na]
	at org.testng.internal.Invoker.invokeTestMethods(Invoker.java:1231) ~[testng-6.8.8.jar:na]
	at org.testng.internal.TestMethodWorker.invokeTestMethods(TestMethodWorker.java:127) ~[testng-6.8.8.jar:na]
	at org.testng.internal.TestMethodWorker.run(TestMethodWorker.java:111) ~[testng-6.8.8.jar:na]
	at org.testng.TestRunner.privateRun(TestRunner.java:767) ~[testng-6.8.8.jar:na]
	at org.testng.TestRunner.run(TestRunner.java:617) ~[testng-6.8.8.jar:na]
	at org.testng.SuiteRunner.runTest(SuiteRunner.java:348) ~[testng-6.8.8.jar:na]
	at org.testng.SuiteRunner.runSequentially(SuiteRunner.java:343) ~[testng-6.8.8.jar:na]
	at org.testng.SuiteRunner.privateRun(SuiteRunner.java:305) ~[testng-6.8.8.jar:na]
	at org.testng.SuiteRunner.run(SuiteRunner.java:254) ~[testng-6.8.8.jar:na]
	at org.testng.SuiteRunnerWorker.runSuite(SuiteRunnerWorker.java:52) ~[testng-6.8.8.jar:na]
	at org.testng.SuiteRunnerWorker.run(SuiteRunnerWorker.java:86) ~[testng-6.8.8.jar:na]
	at org.testng.TestNG.runSuitesSequentially(TestNG.java:1224) ~[testng-6.8.8.jar:na]
	at org.testng.TestNG.runSuitesLocally(TestNG.java:1149) ~[testng-6.8.8.jar:na]
	at org.testng.TestNG.run(TestNG.java:1057) ~[testng-6.8.8.jar:na]
	at org.testng.remote.RemoteTestNG.run(RemoteTestNG.java:111) ~[testng-6.8.8.jar:na]
	at org.testng.remote.RemoteTestNG.initAndRun(RemoteTestNG.java:204) ~[testng-6.8.8.jar:na]
	at org.testng.remote.RemoteTestNG.main(RemoteTestNG.java:175) ~[testng-6.8.8.jar:na]
	at org.testng.RemoteTestNGStarter.main(RemoteTestNGStarter.java:125) ~[testng-plugin.jar:na]
	at sun.reflect.NativeMethodAccessorImpl.invoke0(Native Method) ~[na:1.7.0_71]
	at sun.reflect.NativeMethodAccessorImpl.invoke(NativeMethodAccessorImpl.java:57) ~[na:1.7.0_71]
	at sun.reflect.DelegatingMethodAccessorImpl.invoke(DelegatingMethodAccessorImpl.java:43)
~[na:1.7.0_71]
	at java.lang.reflect.Method.invoke(Method.java:606) ~[na:1.7.0_71]
	at com.intellij.rt.execution.application.AppMain.main(AppMain.java:134) ~[idea_rt.jar:na]
Caused by: org.jclouds.http.HttpResponseException: command: POST https://management.core.windows.net/341751b0-f348-45ce-9498-41cc68b4b45f/services/hostedservices
HTTP/1.1 failed with response: HTTP/1.1 409 Conflict; content: [<Error xmlns="http://schemas.microsoft.com/windowsazure"
xmlns:i="http://www.w3.org/2001/XMLSchema-instance"><Code>ConflictError</Code><Message>The
specified DNS name is already taken.</Message></Error>]
	at org.jclouds.azurecompute.handlers.AzureComputeErrorHandler.handleError(AzureComputeErrorHandler.java:44)
~[classes/:na]
	at org.jclouds.http.handlers.DelegatingErrorHandler.handleError(DelegatingErrorHandler.java:65)
~[jclouds-core-1.9.0.jar:1.9.0]
	at org.jclouds.http.internal.BaseHttpCommandExecutorService.shouldContinue(BaseHttpCommandExecutorService.java:132)
~[jclouds-core-1.9.0.jar:1.9.0]
	at org.jclouds.http.internal.BaseHttpCommandExecutorService.invoke(BaseHttpCommandExecutorService.java:101)
~[jclouds-core-1.9.0.jar:1.9.0]
	at org.jclouds.rest.internal.InvokeHttpMethod.invoke(InvokeHttpMethod.java:90) ~[jclouds-core-1.9.0.jar:1.9.0]
	at org.jclouds.rest.internal.InvokeHttpMethod.apply(InvokeHttpMethod.java:73) ~[jclouds-core-1.9.0.jar:1.9.0]
	at org.jclouds.rest.internal.InvokeHttpMethod.apply(InvokeHttpMethod.java:44) ~[jclouds-core-1.9.0.jar:1.9.0]
	at org.jclouds.reflect.FunctionalReflection$FunctionalInvocationHandler.handleInvocation(FunctionalReflection.java:117)
~[jclouds-core-1.9.0.jar:1.9.0]
	at com.google.common.reflect.AbstractInvocationHandler.invoke(AbstractInvocationHandler.java:87)
~[guava-16.0.1.jar:na]
	at com.sun.proxy.$Proxy67.createWithLabelInLocation(Unknown Source) ~[na:na]
	at org.jclouds.azurecompute.compute.AzureComputeServiceAdapter.createNodeWithGroupEncodedIntoName(AzureComputeServiceAdapter.java:111)
~[classes/:na]
	at org.jclouds.compute.strategy.impl.AdaptingComputeServiceStrategies.createNodeWithGroupEncodedIntoName(AdaptingComputeServiceStrategies.java:195)
~[jclouds-compute-1.9.0.jar:1.9.0]
	at org.jclouds.compute.strategy.impl.CreateNodesWithGroupEncodedIntoNameThenAddToSet$AddNode.call(CreateNodesWithGroupEncodedIntoNameThenAddToSet.java:79)
~[jclouds-compute-1.9.0.jar:1.9.0]
	at org.jclouds.compute.strategy.impl.CreateNodesWithGroupEncodedIntoNameThenAddToSet$AddNode.call(CreateNodesWithGroupEncodedIntoNameThenAddToSet.java:63)
~[jclouds-compute-1.9.0.jar:1.9.0]
	at java.util.concurrent.FutureTask.run(FutureTask.java:262) ~[na:1.7.0_71]
	at java.util.concurrent.ThreadPoolExecutor.runWorker(ThreadPoolExecutor.java:1145) [na:1.7.0_71]
	at java.util.concurrent.ThreadPoolExecutor$Worker.run(ThreadPoolExecutor.java:615) [na:1.7.0_71]
	at java.lang.Thread.run(Thread.java:745) [na:1.7.0_71]
-  createNodesInGroup(andrea-1242822577-group-acsclt), completed: 0/1, errors: 1, rate: 2150ms/op
java.lang.RuntimeException: createNodesInGroup(andrea-1242822577-group-acsclt), completed:
0/1, errors: 1, rate: 2150ms/op
	at org.jclouds.concurrent.FutureIterables.awaitCompletion(FutureIterables.java:153) ~[jclouds-core-1.9.0.jar:1.9.0]
	at org.jclouds.compute.internal.BaseComputeService.createNodesInGroup(BaseComputeService.java:214)
[jclouds-compute-1.9.0.jar:1.9.0]
	at org.jclouds.azurecompute.compute.AzureComputeServiceContextLiveTest.testLaunchNode(AzureComputeServiceContextLiveTest.java:139)
[test-classes/:na]
	at sun.reflect.NativeMethodAccessorImpl.invoke0(Native Method) ~[na:1.7.0_71]
	at sun.reflect.NativeMethodAccessorImpl.invoke(NativeMethodAccessorImpl.java:57) ~[na:1.7.0_71]
	at sun.reflect.DelegatingMethodAccessorImpl.invoke(DelegatingMethodAccessorImpl.java:43)
~[na:1.7.0_71]
	at java.lang.reflect.Method.invoke(Method.java:606) ~[na:1.7.0_71]
	at org.testng.internal.MethodInvocationHelper.invokeMethod(MethodInvocationHelper.java:84)
[testng-6.8.8.jar:na]
	at org.testng.internal.Invoker.invokeMethod(Invoker.java:714) [testng-6.8.8.jar:na]
	at org.testng.internal.Invoker.invokeTestMethod(Invoker.java:901) [testng-6.8.8.jar:na]
	at org.testng.internal.Invoker.invokeTestMethods(Invoker.java:1231) [testng-6.8.8.jar:na]
	at org.testng.internal.TestMethodWorker.invokeTestMethods(TestMethodWorker.java:127) [testng-6.8.8.jar:na]
	at org.testng.internal.TestMethodWorker.run(TestMethodWorker.java:111) [testng-6.8.8.jar:na]
	at org.testng.TestRunner.privateRun(TestRunner.java:767) [testng-6.8.8.jar:na]
	at org.testng.TestRunner.run(TestRunner.java:617) [testng-6.8.8.jar:na]
	at org.testng.SuiteRunner.runTest(SuiteRunner.java:348) [testng-6.8.8.jar:na]
	at org.testng.SuiteRunner.runSequentially(SuiteRunner.java:343) [testng-6.8.8.jar:na]
	at org.testng.SuiteRunner.privateRun(SuiteRunner.java:305) [testng-6.8.8.jar:na]
	at org.testng.SuiteRunner.run(SuiteRunner.java:254) [testng-6.8.8.jar:na]
	at org.testng.SuiteRunnerWorker.runSuite(SuiteRunnerWorker.java:52) [testng-6.8.8.jar:na]
	at org.testng.SuiteRunnerWorker.run(SuiteRunnerWorker.java:86) [testng-6.8.8.jar:na]
	at org.testng.TestNG.runSuitesSequentially(TestNG.java:1224) [testng-6.8.8.jar:na]
	at org.testng.TestNG.runSuitesLocally(TestNG.java:1149) [testng-6.8.8.jar:na]
	at org.testng.TestNG.run(TestNG.java:1057) [testng-6.8.8.jar:na]
	at org.testng.remote.RemoteTestNG.run(RemoteTestNG.java:111) [testng-6.8.8.jar:na]
	at org.testng.remote.RemoteTestNG.initAndRun(RemoteTestNG.java:204) [testng-6.8.8.jar:na]
	at org.testng.remote.RemoteTestNG.main(RemoteTestNG.java:175) [testng-6.8.8.jar:na]
	at org.testng.RemoteTestNGStarter.main(RemoteTestNGStarter.java:125) [testng-plugin.jar:na]
	at sun.reflect.NativeMethodAccessorImpl.invoke0(Native Method) ~[na:1.7.0_71]
	at sun.reflect.NativeMethodAccessorImpl.invoke(NativeMethodAccessorImpl.java:57) ~[na:1.7.0_71]
	at sun.reflect.DelegatingMethodAccessorImpl.invoke(DelegatingMethodAccessorImpl.java:43)
~[na:1.7.0_71]
	at java.lang.reflect.Method.invoke(Method.java:606) ~[na:1.7.0_71]
	at com.intellij.rt.execution.application.AppMain.main(AppMain.java:134) [idea_rt.jar:na]
org.jclouds.compute.RunNodesException: error running 1 node group(andrea-1242822577-group-acsclt)
location(West Europe) image(b39f27a8b8c64d52b05eac6a62ebad85__Ubuntu-14_04_1-LTS-amd64-server-20150123-en-us-30GB)
size(BASIC_A0) options({nodeNames=[andre-1242822577acsclt]})
Execution failures:

1) ExecutionException on andre-1242822577acsclt:
java.util.concurrent.ExecutionException: java.lang.IllegalStateException: <Error xmlns="http://schemas.microsoft.com/windowsazure"
xmlns:i="http://www.w3.org/2001/XMLSchema-instance"><Code>ConflictError</Code><Message>The
specified DNS name is already taken.</Message></Error>
	at com.google.common.util.concurrent.AbstractFuture$Sync.getValue(AbstractFuture.java:299)
	at com.google.common.util.concurrent.AbstractFuture$Sync.get(AbstractFuture.java:286)
	at com.google.common.util.concurrent.AbstractFuture.get(AbstractFuture.java:116)
	at org.jclouds.concurrent.FutureIterables$1.run(FutureIterables.java:123)
	at java.util.concurrent.ThreadPoolExecutor.runWorker(ThreadPoolExecutor.java:1145)
	at java.util.concurrent.ThreadPoolExecutor$Worker.run(ThreadPoolExecutor.java:615)
	at java.lang.Thread.run(Thread.java:745)
Caused by: java.lang.IllegalStateException: <Error xmlns="http://schemas.microsoft.com/windowsazure"
xmlns:i="http://www.w3.org/2001/XMLSchema-instance"><Code>ConflictError</Code><Message>The
specified DNS name is already taken.</Message></Error>
	at org.jclouds.azurecompute.handlers.AzureComputeErrorHandler.handleError(AzureComputeErrorHandler.java:62)
	at org.jclouds.http.handlers.DelegatingErrorHandler.handleError(DelegatingErrorHandler.java:65)
	at org.jclouds.http.internal.BaseHttpCommandExecutorService.shouldContinue(BaseHttpCommandExecutorService.java:132)
	at org.jclouds.http.internal.BaseHttpCommandExecutorService.invoke(BaseHttpCommandExecutorService.java:101)
	at org.jclouds.rest.internal.InvokeHttpMethod.invoke(InvokeHttpMethod.java:90)
	at org.jclouds.rest.internal.InvokeHttpMethod.apply(InvokeHttpMethod.java:73)
	at org.jclouds.rest.internal.InvokeHttpMethod.apply(InvokeHttpMethod.java:44)
	at org.jclouds.reflect.FunctionalReflection$FunctionalInvocationHandler.handleInvocation(FunctionalReflection.java:117)
	at com.google.common.reflect.AbstractInvocationHandler.invoke(AbstractInvocationHandler.java:87)
	at com.sun.proxy.$Proxy67.createWithLabelInLocation(Unknown Source)
	at org.jclouds.azurecompute.compute.AzureComputeServiceAdapter.createNodeWithGroupEncodedIntoName(AzureComputeServiceAdapter.java:111)
	at org.jclouds.compute.strategy.impl.AdaptingComputeServiceStrategies.createNodeWithGroupEncodedIntoName(AdaptingComputeServiceStrategies.java:195)
	at org.jclouds.compute.strategy.impl.CreateNodesWithGroupEncodedIntoNameThenAddToSet$AddNode.call(CreateNodesWithGroupEncodedIntoNameThenAddToSet.java:79)
	at org.jclouds.compute.strategy.impl.CreateNodesWithGroupEncodedIntoNameThenAddToSet$AddNode.call(CreateNodesWithGroupEncodedIntoNameThenAddToSet.java:63)
	at java.util.concurrent.FutureTask.run(FutureTask.java:262)
	at java.util.concurrent.ThreadPoolExecutor.runWorker(ThreadPoolExecutor.java:1145)
	at java.util.concurrent.ThreadPoolExecutor$Worker.run(ThreadPoolExecutor.java:615)
	at java.lang.Thread.run(Thread.java:745)
	at java.lang.Thread.getStackTrace(Thread.java:1589)
	at org.jclouds.compute.strategy.impl.CreateNodesWithGroupEncodedIntoNameThenAddToSet.createNodeInGroupWithNameAndTemplate(CreateNodesWithGroupEncodedIntoNameThenAddToSet.java:167)
	at org.jclouds.azurecompute.compute.strategy.GetOrCreateStorageServiceAndVirtualNetworkThenCreateNodes.createNodeInGroupWithNameAndTemplate(GetOrCreateStorageServiceAndVirtualNetworkThenCreateNodes.java:113)
	at org.jclouds.compute.strategy.impl.CreateNodesWithGroupEncodedIntoNameThenAddToSet.execute(CreateNodesWithGroupEncodedIntoNameThenAddToSet.java:122)
	at org.jclouds.azurecompute.compute.strategy.GetOrCreateStorageServiceAndVirtualNetworkThenCreateNodes.execute(GetOrCreateStorageServiceAndVirtualNetworkThenCreateNodes.java:186)
	at org.jclouds.compute.internal.BaseComputeService.createNodesInGroup(BaseComputeService.java:210)
	at org.jclouds.azurecompute.compute.AzureComputeServiceContextLiveTest.testLaunchNode(AzureComputeServiceContextLiveTest.java:139)
	at sun.reflect.NativeMethodAccessorImpl.invoke0(Native Method)
	at sun.reflect.NativeMethodAccessorImpl.invoke(NativeMethodAccessorImpl.java:57)
	at sun.reflect.DelegatingMethodAccessorImpl.invoke(DelegatingMethodAccessorImpl.java:43)
	at java.lang.reflect.Method.invoke(Method.java:606)
	at org.testng.internal.MethodInvocationHelper.invokeMethod(MethodInvocationHelper.java:84)
	at org.testng.internal.Invoker.invokeMethod(Invoker.java:714)
	at org.testng.internal.Invoker.invokeTestMethod(Invoker.java:901)
	at org.testng.internal.Invoker.invokeTestMethods(Invoker.java:1231)
	at org.testng.internal.TestMethodWorker.invokeTestMethods(TestMethodWorker.java:127)
	at org.testng.internal.TestMethodWorker.run(TestMethodWorker.java:111)
	at org.testng.TestRunner.privateRun(TestRunner.java:767)
	at org.testng.TestRunner.run(TestRunner.java:617)
	at org.testng.SuiteRunner.runTest(SuiteRunner.java:348)
	at org.testng.SuiteRunner.runSequentially(SuiteRunner.java:343)
	at org.testng.SuiteRunner.privateRun(SuiteRunner.java:305)
	at org.testng.SuiteRunner.run(SuiteRunner.java:254)
	at org.testng.SuiteRunnerWorker.runSuite(SuiteRunnerWorker.java:52)
	at org.testng.SuiteRunnerWorker.run(SuiteRunnerWorker.java:86)
	at org.testng.TestNG.runSuitesSequentially(TestNG.java:1224)
	at org.testng.TestNG.runSuitesLocally(TestNG.java:1149)
	at org.testng.TestNG.run(TestNG.java:1057)
	at org.testng.remote.RemoteTestNG.run(RemoteTestNG.java:111)
	at org.testng.remote.RemoteTestNG.initAndRun(RemoteTestNG.java:204)
	at org.testng.remote.RemoteTestNG.main(RemoteTestNG.java:175)
	at org.testng.RemoteTestNGStarter.main(RemoteTestNGStarter.java:125)
	at sun.reflect.NativeMethodAccessorImpl.invoke0(Native Method)
	at sun.reflect.NativeMethodAccessorImpl.invoke(NativeMethodAccessorImpl.java:57)
	at sun.reflect.DelegatingMethodAccessorImpl.invoke(DelegatingMethodAccessorImpl.java:43)
	at java.lang.reflect.Method.invoke(Method.java:606)
	at com.intellij.rt.execution.application.AppMain.main(AppMain.java:134)
Caused by: org.jclouds.http.HttpResponseException: command: POST https://management.core.windows.net/341751b0-f348-45ce-9498-41cc68b4b45f/services/hostedservices
HTTP/1.1 failed with response: HTTP/1.1 409 Conflict; content: [<Error xmlns="http://schemas.microsoft.com/windowsazure"
xmlns:i="http://www.w3.org/2001/XMLSchema-instance"><Code>ConflictError</Code><Message>The
specified DNS name is already taken.</Message></Error>]
	at org.jclouds.azurecompute.handlers.AzureComputeErrorHandler.handleError(AzureComputeErrorHandler.java:44)
	at org.jclouds.http.handlers.DelegatingErrorHandler.handleError(DelegatingErrorHandler.java:65)
	at org.jclouds.http.internal.BaseHttpCommandExecutorService.shouldContinue(BaseHttpCommandExecutorService.java:132)
	at org.jclouds.http.internal.BaseHttpCommandExecutorService.invoke(BaseHttpCommandExecutorService.java:101)
	at org.jclouds.rest.internal.InvokeHttpMethod.invoke(InvokeHttpMethod.java:90)
	at org.jclouds.rest.internal.InvokeHttpMethod.apply(InvokeHttpMethod.java:73)
	at org.jclouds.rest.internal.InvokeHttpMethod.apply(InvokeHttpMethod.java:44)
	at org.jclouds.reflect.FunctionalReflection$FunctionalInvocationHandler.handleInvocation(FunctionalReflection.java:117)
	at com.google.common.reflect.AbstractInvocationHandler.invoke(AbstractInvocationHandler.java:87)
	at com.sun.proxy.$Proxy67.createWithLabelInLocation(Unknown Source)
	at org.jclouds.azurecompute.compute.AzureComputeServiceAdapter.createNodeWithGroupEncodedIntoName(AzureComputeServiceAdapter.java:111)
	at org.jclouds.compute.strategy.impl.AdaptingComputeServiceStrategies.createNodeWithGroupEncodedIntoName(AdaptingComputeServiceStrategies.java:195)
	at org.jclouds.compute.strategy.impl.CreateNodesWithGroupEncodedIntoNameThenAddToSet$AddNode.call(CreateNodesWithGroupEncodedIntoNameThenAddToSet.java:79)
	at org.jclouds.compute.strategy.impl.CreateNodesWithGroupEncodedIntoNameThenAddToSet$AddNode.call(CreateNodesWithGroupEncodedIntoNameThenAddToSet.java:63)
	at java.util.concurrent.FutureTask.run(FutureTask.java:262)
	at java.util.concurrent.ThreadPoolExecutor.runWorker(ThreadPoolExecutor.java:1145)
	at java.util.concurrent.ThreadPoolExecutor$Worker.run(ThreadPoolExecutor.java:615)
	at java.lang.Thread.run(Thread.java:745)

> azure-compute cannot parse a suspended VM
> -----------------------------------------
>
>                 Key: JCLOUDS-952
>                 URL: https://issues.apache.org/jira/browse/JCLOUDS-952
>             Project: jclouds
>          Issue Type: Bug
>          Components: jclouds-labs
>    Affects Versions: 1.9.0
>            Reporter: Andrea Turli
>            Assignee: Andrea Turli
>              Labels: easyfix
>             Fix For: 2.0.0, 1.9.1
>
>
> listNodes fails when the Azure account contains a suspended VM



--
This message was sent by Atlassian JIRA
(v6.3.4#6332)

Mime
View raw message