jclouds-notifications mailing list archives

Site index · List index
Message view « Date » · « Thread »
Top « Date » · « Thread »
From "Ignasi Barrera (JIRA)" <j...@apache.org>
Subject [jira] [Created] (JCLOUDS-1009) JDBC tests fail on OSX
Date Thu, 01 Oct 2015 22:32:26 GMT
Ignasi Barrera created JCLOUDS-1009:
---------------------------------------

             Summary: JDBC tests fail on OSX
                 Key: JCLOUDS-1009
                 URL: https://issues.apache.org/jira/browse/JCLOUDS-1009
             Project: jclouds
          Issue Type: Bug
          Components: jclouds-labs
    Affects Versions: 1.9.1
         Environment: Apache Maven 3.2.3 (33f8c3e1027c3ddde99d3cdebad2656a31e8fdf4; 2014-08-11T22:58:10+02:00)
Java version: 1.7.0_51, vendor: Oracle Corporation
Default locale: en_US, platform encoding: UTF-8
OS name: "mac os x", version: "10.10.5", arch: "x86_64", family: "mac"
            Reporter: Ignasi Barrera


JDBC unit tests fails consistently in OSX (/cc [~rcoedo] [~gaul])

{code}
-------------------------------------------------------------------------------
Test set: TestSuite
-------------------------------------------------------------------------------
Tests run: 162, Failures: 3, Errors: 0, Skipped: 6, Time elapsed: 57.778 sec <<<
FAILURE! - in TestSuite
testDirectory(org.jclouds.jdbc.integration.EclipselinkH2ContainerIntegrationTest)  Time elapsed:
0.56 sec  <<< FAILURE!
java.lang.AssertionError:
Expecting:
 <true>
to be equal to:
 <false>
but was not.
        at org.jclouds.blobstore.integration.internal.BaseContainerIntegrationTest.testDirectory(BaseContainerIntegrationTest.java:260)
        at sun.reflect.NativeMethodAccessorImpl.invoke0(Native Method)
        at sun.reflect.NativeMethodAccessorImpl.invoke(NativeMethodAccessorImpl.java:57)
        at sun.reflect.DelegatingMethodAccessorImpl.invoke(DelegatingMethodAccessorImpl.java:43)
        at java.lang.reflect.Method.invoke(Method.java:606)
        at org.testng.internal.MethodInvocationHelper.invokeMethod(MethodInvocationHelper.java:84)
        at org.testng.internal.Invoker.invokeMethod(Invoker.java:714)
        at org.testng.internal.Invoker.invokeTestMethod(Invoker.java:901)
        at org.testng.internal.Invoker.invokeTestMethods(Invoker.java:1231)
        at org.testng.internal.TestMethodWorker.invokeTestMethods(TestMethodWorker.java:127)
        at org.testng.internal.TestMethodWorker.run(TestMethodWorker.java:111)
        at org.testng.TestRunner.privateRun(TestRunner.java:767)
        at org.testng.TestRunner.run(TestRunner.java:617)
        at org.testng.SuiteRunner.runTest(SuiteRunner.java:348)
        at org.testng.SuiteRunner.access$000(SuiteRunner.java:38)
        at org.testng.SuiteRunner$SuiteWorker.run(SuiteRunner.java:382)
        at org.testng.internal.thread.ThreadUtil$2.call(ThreadUtil.java:64)
        at java.util.concurrent.FutureTask.run(FutureTask.java:262)
        at java.util.concurrent.ThreadPoolExecutor.runWorker(ThreadPoolExecutor.java:1145)
        at java.util.concurrent.ThreadPoolExecutor$Worker.run(ThreadPoolExecutor.java:615)
        at java.lang.Thread.run(Thread.java:744)

testBlobNameEscaping(org.jclouds.jdbc.integration.HibernateHsqldbContainerIntegrationTest)
 Time elapsed: 0.025 sec  <<< FAILURE!
javax.persistence.RollbackException: Transaction marked as rollbackOnly
        at org.hibernate.jpa.internal.TransactionImpl.commit(TransactionImpl.java:74)
        at com.google.inject.persist.jpa.JpaLocalTxnInterceptor.invoke(JpaLocalTxnInterceptor.java:75)
        at org.jclouds.jdbc.strategy.JdbcStorageStrategy.putBlob(JdbcStorageStrategy.java:270)
        at org.jclouds.blobstore.config.LocalBlobStore.putBlob(LocalBlobStore.java:535)
        at sun.reflect.GeneratedMethodAccessor8.invoke(Unknown Source)
        at sun.reflect.DelegatingMethodAccessorImpl.invoke(DelegatingMethodAccessorImpl.java:43)
        at java.lang.reflect.Method.invoke(Method.java:606)
        at com.google.inject.internal.DelegatingInvocationHandler.invoke(DelegatingInvocationHandler.java:37)
        at com.sun.proxy.$Proxy48.putBlob(Unknown Source)
        at org.jclouds.blobstore.integration.internal.BaseContainerIntegrationTest.testBlobNameEscaping(BaseContainerIntegrationTest.java:581)
        at sun.reflect.NativeMethodAccessorImpl.invoke0(Native Method)
        at sun.reflect.NativeMethodAccessorImpl.invoke(NativeMethodAccessorImpl.java:57)
        at sun.reflect.DelegatingMethodAccessorImpl.invoke(DelegatingMethodAccessorImpl.java:43)
        at java.lang.reflect.Method.invoke(Method.java:606)
        at org.testng.internal.MethodInvocationHelper.invokeMethod(MethodInvocationHelper.java:84)
        at org.testng.internal.Invoker.invokeMethod(Invoker.java:714)
        at org.testng.internal.Invoker.invokeTestMethod(Invoker.java:901)
        at org.testng.internal.Invoker.invokeTestMethods(Invoker.java:1231)
        at org.testng.internal.TestMethodWorker.invokeTestMethods(TestMethodWorker.java:127)
        at org.testng.internal.TestMethodWorker.run(TestMethodWorker.java:111)
        at org.testng.TestRunner.privateRun(TestRunner.java:767)
        at org.testng.TestRunner.run(TestRunner.java:617)
        at org.testng.SuiteRunner.runTest(SuiteRunner.java:348)
        at org.testng.SuiteRunner.access$000(SuiteRunner.java:38)
        at org.testng.SuiteRunner$SuiteWorker.run(SuiteRunner.java:382)
        at org.testng.internal.thread.ThreadUtil$2.call(ThreadUtil.java:64)
        at java.util.concurrent.FutureTask.run(FutureTask.java:262)
        at java.util.concurrent.ThreadPoolExecutor.runWorker(ThreadPoolExecutor.java:1145)
        at java.util.concurrent.ThreadPoolExecutor$Worker.run(ThreadPoolExecutor.java:615)
        at java.lang.Thread.run(Thread.java:744)

testDirectory(org.jclouds.jdbc.integration.HibernateHsqldbContainerIntegrationTest)  Time
elapsed: 0.711 sec  <<< FAILURE!
java.lang.AssertionError:
Expecting:
 <true>
to be equal to:
 <false>
but was not.
        at org.jclouds.blobstore.integration.internal.BaseContainerIntegrationTest.testDirectory(BaseContainerIntegrationTest.java:260)
        at sun.reflect.NativeMethodAccessorImpl.invoke0(Native Method)
        at sun.reflect.NativeMethodAccessorImpl.invoke(NativeMethodAccessorImpl.java:57)
        at sun.reflect.DelegatingMethodAccessorImpl.invoke(DelegatingMethodAccessorImpl.java:43)
        at java.lang.reflect.Method.invoke(Method.java:606)
        at org.testng.internal.MethodInvocationHelper.invokeMethod(MethodInvocationHelper.java:84)
        at org.testng.internal.Invoker.invokeMethod(Invoker.java:714)
        at org.testng.internal.Invoker.invokeTestMethod(Invoker.java:901)
        at org.testng.internal.Invoker.invokeTestMethods(Invoker.java:1231)
        at org.testng.internal.TestMethodWorker.invokeTestMethods(TestMethodWorker.java:127)
        at org.testng.internal.TestMethodWorker.run(TestMethodWorker.java:111)
        at org.testng.TestRunner.privateRun(TestRunner.java:767)
        at org.testng.TestRunner.run(TestRunner.java:617)
        at org.testng.SuiteRunner.runTest(SuiteRunner.java:348)
        at org.testng.SuiteRunner.access$000(SuiteRunner.java:38)
        at org.testng.SuiteRunner$SuiteWorker.run(SuiteRunner.java:382)
        at org.testng.internal.thread.ThreadUtil$2.call(ThreadUtil.java:64)
        at java.util.concurrent.FutureTask.run(FutureTask.java:262)
        at java.util.concurrent.ThreadPoolExecutor.runWorker(ThreadPoolExecutor.java:1145)
        at java.util.concurrent.ThreadPoolExecutor$Worker.run(ThreadPoolExecutor.java:615)
        at java.lang.Thread.run(Thread.java:744)
{code}



--
This message was sent by Atlassian JIRA
(v6.3.4#6332)

Mime
View raw message