jclouds-notifications mailing list archives

Site index · List index
Message view « Date » · « Thread »
Top « Date » · « Thread »
From jenkins-no-re...@cloudbees.com
Subject Build failed in Jenkins: jclouds-guava-guice-compat » 17.0,4.0,OpenJDK 7 (latest) #210
Date Wed, 19 Oct 2016 05:11:07 GMT
See <https://jclouds.ci.cloudbees.com/job/jclouds-guava-guice-compat/GUAVA_VERSION=17.0,GUICE_VERSION=4.0,jdk=OpenJDK%207%20(latest)/210/changes>

Changes:

[Andrew Gaul] JCLOUDS-1161: Make AWSS3BlobRequestSignerV4 the default signer.

[Andrew Gaul] JCLOUDS-1182: Added Seoul and Mumbai regions to AWS

------------------------------------------
[...truncated 21312 lines...]
Test suite progress: tests succeeded: 819, failed: 2, skipped: 0.
Starting test testQueryParam(org.jclouds.rest.internal.RestAnnotationProcessorTest)
Starting test testRequestFilterStripExpect(org.jclouds.rest.internal.RestAnnotationProcessorTest)
[pool-90-thread-2] Test testQueryParam(org.jclouds.rest.internal.RestAnnotationProcessorTest)
succeeded: 1ms
Test suite progress: tests succeeded: 820, failed: 2, skipped: 0.
Starting test testQueryParam(org.jclouds.rest.internal.RestAnnotationProcessorTest)
[pool-90-thread-3] Test testRequestFilterOverrideOnRequest(org.jclouds.rest.internal.RestAnnotationProcessorTest)
succeeded: 3ms
Test suite progress: tests succeeded: 821, failed: 2, skipped: 0.
Starting test testSkipEncoding(org.jclouds.rest.internal.RestAnnotationProcessorTest)
[pool-90-thread-2] Test testQueryParam(org.jclouds.rest.internal.RestAnnotationProcessorTest)
succeeded: 1ms
Test suite progress: tests succeeded: 822, failed: 2, skipped: 0.
Starting test testQueryParam(org.jclouds.rest.internal.RestAnnotationProcessorTest)
[pool-90-thread-3] Test testSkipEncoding(org.jclouds.rest.internal.RestAnnotationProcessorTest)
succeeded: 1ms
Test suite progress: tests succeeded: 823, failed: 2, skipped: 0.
[pool-90-thread-1] Test testRequestFilterOverride(org.jclouds.rest.internal.RestAnnotationProcessorTest)
succeeded: 3ms
Test suite progress: tests succeeded: 824, failed: 2, skipped: 0.
Starting test testTwoDifferentEndpointParams(org.jclouds.rest.internal.RestAnnotationProcessorTest)
Starting test testTwoDifferentHeaders(org.jclouds.rest.internal.RestAnnotationProcessorTest)
[pool-90-thread-2] Test testQueryParam(org.jclouds.rest.internal.RestAnnotationProcessorTest)
succeeded: 1ms
Test suite progress: tests succeeded: 825, failed: 2, skipped: 0.
Starting test testQueryParam(org.jclouds.rest.internal.RestAnnotationProcessorTest)
[pool-90-thread-3] Test testTwoDifferentEndpointParams(org.jclouds.rest.internal.RestAnnotationProcessorTest)
succeeded: 1ms
Test suite progress: tests succeeded: 826, failed: 2, skipped: 0.
[pool-90-thread-2] Test testQueryParam(org.jclouds.rest.internal.RestAnnotationProcessorTest)
succeeded: 1ms
Test suite progress: tests succeeded: 827, failed: 2, skipped: 0.
Starting test testTwoSameHeaders(org.jclouds.rest.internal.RestAnnotationProcessorTest)
Starting test testQueryParam(org.jclouds.rest.internal.RestAnnotationProcessorTest)
[pool-90-thread-1] Test testTwoDifferentHeaders(org.jclouds.rest.internal.RestAnnotationProcessorTest)
succeeded: 2ms
Test suite progress: tests succeeded: 828, failed: 2, skipped: 0.
[pool-90-thread-2] Test testQueryParam(org.jclouds.rest.internal.RestAnnotationProcessorTest)
succeeded: 1ms
Test suite progress: tests succeeded: 829, failed: 2, skipped: 0.
Starting test testQueryParam(org.jclouds.rest.internal.RestAnnotationProcessorTest)
Starting test testURI(org.jclouds.rest.internal.RestAnnotationProcessorTest)
[pool-90-thread-1] Test testURI(org.jclouds.rest.internal.RestAnnotationProcessorTest) succeeded:
0ms
Test suite progress: tests succeeded: 830, failed: 2, skipped: 0.
[pool-90-thread-2] Test testQueryParam(org.jclouds.rest.internal.RestAnnotationProcessorTest)
succeeded: 1ms
Test suite progress: tests succeeded: 831, failed: 2, skipped: 0.
Starting test testUnwrap1(org.jclouds.rest.internal.RestAnnotationProcessorTest)
[pool-90-thread-3] Test testTwoSameHeaders(org.jclouds.rest.internal.RestAnnotationProcessorTest)
succeeded: 4ms
Test suite progress: tests succeeded: 832, failed: 2, skipped: 0.
Starting test testUnwrap3(org.jclouds.rest.internal.RestAnnotationProcessorTest)
Starting test testUnwrap2(org.jclouds.rest.internal.RestAnnotationProcessorTest)
[pool-90-thread-1] Test testUnwrap1(org.jclouds.rest.internal.RestAnnotationProcessorTest)
succeeded: 5ms
Test suite progress: tests succeeded: 833, failed: 2, skipped: 0.
[pool-90-thread-2] Test testUnwrap2(org.jclouds.rest.internal.RestAnnotationProcessorTest)
succeeded: 2ms
Test suite progress: tests succeeded: 834, failed: 2, skipped: 0.
[pool-90-thread-3] Test testUnwrap3(org.jclouds.rest.internal.RestAnnotationProcessorTest)
succeeded: 4ms
Test suite progress: tests succeeded: 835, failed: 2, skipped: 0.
Starting test testUnwrapValueNamed(org.jclouds.rest.internal.RestAnnotationProcessorTest)
Starting test testVirtualHost(org.jclouds.rest.internal.RestAnnotationProcessorTest)
Starting test testUnwrap4(org.jclouds.rest.internal.RestAnnotationProcessorTest)
[pool-90-thread-3] Test testVirtualHost(org.jclouds.rest.internal.RestAnnotationProcessorTest)
succeeded: 1ms
Test suite progress: tests succeeded: 836, failed: 2, skipped: 0.
[pool-90-thread-2] Test testUnwrapValueNamed(org.jclouds.rest.internal.RestAnnotationProcessorTest)
succeeded: 1ms
Test suite progress: tests succeeded: 837, failed: 2, skipped: 0.
Starting test testVirtualHostMethod(org.jclouds.rest.internal.RestAnnotationProcessorTest)
Starting test testWrapWith(org.jclouds.rest.internal.RestAnnotationProcessorTest)
[pool-90-thread-1] Test testUnwrap4(org.jclouds.rest.internal.RestAnnotationProcessorTest)
succeeded: 1ms
Test suite progress: tests succeeded: 838, failed: 2, skipped: 0.
[pool-90-thread-3] Test testVirtualHostMethod(org.jclouds.rest.internal.RestAnnotationProcessorTest)
succeeded: 2ms
Test suite progress: tests succeeded: 839, failed: 2, skipped: 0.
[pool-90-thread-2] Test testWrapWith(org.jclouds.rest.internal.RestAnnotationProcessorTest)
succeeded: 2ms
Test suite progress: tests succeeded: 840, failed: 2, skipped: 0.
[pool-90-thread-5] Test testRequestFilterAddConnection(org.jclouds.rest.internal.RestAnnotationProcessorTest)
succeeded: 51ms
Test suite progress: tests succeeded: 841, failed: 2, skipped: 0.
[pool-90-thread-4] Test testRequestFilterStripExpect(org.jclouds.rest.internal.RestAnnotationProcessorTest)
succeeded: 46ms
Test suite progress: tests succeeded: 842, failed: 2, skipped: 0.
Starting test testRandomByteSource(org.jclouds.utils.TestUtilsTest)
[pool-91-thread-1] Test testRandomByteSource(org.jclouds.utils.TestUtilsTest) succeeded: 2ms
Test suite progress: tests succeeded: 843, failed: 2, skipped: 0.
Tests run: 845, Failures: 2, Errors: 0, Skipped: 0, Time elapsed: 42.352 sec <<<
FAILURE! - in TestSuite
testExponentialBackoffDelaySmallInterval1(org.jclouds.http.handlers.BackoffLimitedRetryHandlerTest)
 Time elapsed: 0.023 sec  <<< FAILURE!
java.lang.AssertionError: expected [true] but found [false]
	at org.testng.Assert.fail(Assert.java:94)
	at org.testng.Assert.failNotEquals(Assert.java:494)
	at org.testng.Assert.assertTrue(Assert.java:42)
	at org.testng.Assert.assertTrue(Assert.java:52)
	at org.jclouds.http.handlers.BackoffLimitedRetryHandlerTest.testExponentialBackoffDelaySmallInterval1(BackoffLimitedRetryHandlerTest.java:105)

testExponentialBackoffDelaySmallInterval5(org.jclouds.http.handlers.BackoffLimitedRetryHandlerTest)
 Time elapsed: 0.024 sec  <<< FAILURE!
java.lang.AssertionError: expected [true] but found [false]
	at org.testng.Assert.fail(Assert.java:94)
	at org.testng.Assert.failNotEquals(Assert.java:494)
	at org.testng.Assert.assertTrue(Assert.java:42)
	at org.testng.Assert.assertTrue(Assert.java:52)
	at org.jclouds.http.handlers.BackoffLimitedRetryHandlerTest.testExponentialBackoffDelaySmallInterval5(BackoffLimitedRetryHandlerTest.java:93)


Results :

Failed tests: 
  BackoffLimitedRetryHandlerTest.testExponentialBackoffDelaySmallInterval1:105 expected [true]
but found [false]
  BackoffLimitedRetryHandlerTest.testExponentialBackoffDelaySmallInterval5:93 expected [true]
but found [false]

Tests run: 845, Failures: 2, Errors: 0, Skipped: 0

[INFO] ------------------------------------------------------------------------
[INFO] Reactor Summary:
[INFO] 
[INFO] Apache jclouds Project ............................ SUCCESS [13.785s]
[INFO] jclouds shared Maven resources .................... SUCCESS [4.788s]
[INFO] jclouds Components Core ........................... FAILURE [1:02.677s]
[INFO] jclouds SLF4J Logging Module ...................... SKIPPED
[INFO] jclouds OAuth core ................................ SKIPPED
[INFO] jclouds Google Cloud Core ......................... SKIPPED
[INFO] jclouds OpenStack Components Core ................. SKIPPED
[INFO] jclouds commons project ........................... SKIPPED
[INFO] jclouds script builder ............................ SKIPPED
[INFO] jclouds compute core .............................. SKIPPED
[INFO] jclouds Log4J Logging Module ...................... SKIPPED
[INFO] jclouds loadbalancer core ......................... SKIPPED
[INFO] jclouds sts api ................................... SKIPPED
[INFO] jclouds cloudwatch api ............................ SKIPPED
[INFO] jclouds bouncycastle EncryptionService Module ..... SKIPPED
[INFO] jclouds sshj ssh client ........................... SKIPPED
[INFO] jclouds cloudstack core ........................... SKIPPED
[INFO] jclouds blobstore core ............................ SKIPPED
[INFO] jclouds filesystem core ........................... SKIPPED
[INFO] jclouds bring your own node provider .............. SKIPPED
[INFO] jclouds OkHttp Driver ............................. SKIPPED
[INFO] jclouds s3 api .................................... SKIPPED
[INFO] jclouds ec2 api ................................... SKIPPED
[INFO] jclouds sqs api ................................... SKIPPED
[INFO] jclouds elasticstack core ......................... SKIPPED
[INFO] jclouds atmos components .......................... SKIPPED
[INFO] jclouds openstack-keystone api .................... SKIPPED
[INFO] jclouds openstack-cinder api ...................... SKIPPED
[INFO] Apache jclouds :: OpenStack :: Nova API ........... SKIPPED
[INFO] jclouds openstack-nova-ec2 api .................... SKIPPED
[INFO] jclouds openstack-swift api ....................... SKIPPED
[INFO] jclouds openstack-trove api ....................... SKIPPED
[INFO] jclouds rackspace cloudidentity api ............... SKIPPED
[INFO] jclouds Rackspace Cloud Load Balancers API ........ SKIPPED
[INFO] jclouds Rackspace Next Generation Cloud Block Storage US provider  SKIPPED
[INFO] jclouds Rackspace Next Generation Cloud Servers US provider  SKIPPED
[INFO] jclouds rackspace clouddns api .................... SKIPPED
[INFO] jclouds rackspace-cloudfiles api .................. SKIPPED
[INFO] jclouds route53 api ............................... SKIPPED
[INFO] jclouds Chef api .................................. SKIPPED
[INFO] jclouds docker API ................................ SKIPPED
[INFO] jclouds apis project .............................. SKIPPED
[INFO] jclouds GoGrid provider ........................... SKIPPED
[INFO] jclouds Azure Storage provider .................... SKIPPED
[INFO] jclouds Apache Http Components Client ............. SKIPPED
[INFO] jclouds joda DateService Module ................... SKIPPED
[INFO] jclouds netty payload module ...................... SKIPPED
[INFO] jclouds enterprise Module ......................... SKIPPED
[INFO] jclouds Amazon Simple Storage Service (S3) provider  SKIPPED
[INFO] jclouds Amazon Elastic Load Balancer provider ..... SKIPPED
[INFO] jclouds Amazon EC2 provider ....................... SKIPPED
[INFO] jclouds Amazon Simple Queue Service provider ...... SKIPPED
[INFO] jclouds DigitalOcean v2 API Provider .............. SKIPPED
[INFO] jclouds ElasticHosts Peer1 London provider ........ SKIPPED
[INFO] jclouds ElasticHosts Peer1 San Antonio provider ... SKIPPED
[INFO] jclouds ElasticHosts BlueSquare London provider ... SKIPPED
[INFO] jclouds ElasticHosts Peer1 Toronto provider ....... SKIPPED
[INFO] jclouds ElasticHosts Peer1 Los Angeles provider ... SKIPPED
[INFO] jclouds ElasticHosts Amsterdam provider ........... SKIPPED
[INFO] jclouds ElasticHosts San Jose provider ............ SKIPPED
[INFO] jclouds ElasticHosts Hong Kong provider ........... SKIPPED
[INFO] jclouds ElasticHosts Sydney provider .............. SKIPPED
[INFO] jclouds ElasticHosts Miami provider ............... SKIPPED
[INFO] jclouds ElasticHosts Dallas provider .............. SKIPPED
[INFO] jclouds Open Hosting East1 provider ............... SKIPPED
[INFO] jclouds Serverlove Manchester provider ............ SKIPPED
[INFO] jclouds SkaliCloud Malaysia provider .............. SKIPPED
[INFO] jclouds Go2Cloud Johannesburg1 provider ........... SKIPPED
[INFO] jclouds Google Compute Engine provider ............ SKIPPED
[INFO] jclouds SoftLayer core ............................ SKIPPED
[INFO] jclouds Rackspace Cloud Files US provider ......... SKIPPED
[INFO] jclouds Rackspace Cloud Files UK provider ......... SKIPPED
[INFO] jclouds Rackspace Next Generation Cloud DNS US provider  SKIPPED
[INFO] jclouds Rackspace Next Generation Cloud DNS UK provider  SKIPPED
[INFO] jclouds Rackspace Cloud Databases US provider ..... SKIPPED
[INFO] jclouds Rackspace Cloud Databases UK provider ..... SKIPPED
[INFO] jclouds Rackspace Cloud Load Balancers US provider  SKIPPED
[INFO] jclouds Rackspace Cloud Load Balancers UK provider  SKIPPED
[INFO] jclouds Rackspace Next Generation Cloud Block Storage UK provider  SKIPPED
[INFO] jclouds Rackspace Next Generation Cloud Servers provider  SKIPPED
[INFO] jclouds GleSYS core ............................... SKIPPED
[INFO] jclouds Amazon Identity and Access Management (STS) provider  SKIPPED
[INFO] jclouds Amazon Route 53 provider .................. SKIPPED
[INFO] jclouds ultradns-ws provider ...................... SKIPPED
[INFO] jclouds dynect api ................................ SKIPPED
[INFO] jclouds ProfitBricks api .......................... SKIPPED
[INFO] jclouds providers project ......................... SKIPPED
[INFO] jclouds jsch ssh client ........................... SKIPPED
[INFO] jclouds example components for a standalone compute provider  SKIPPED
[INFO] jclouds skeletons project ......................... SKIPPED
[INFO] jclouds Google App Engine Components .............. SKIPPED
[INFO] jclouds drivers project ........................... SKIPPED
[INFO] allcompute ........................................ SKIPPED
[INFO] allblobstore ...................................... SKIPPED
[INFO] allloadbalancer ................................... SKIPPED
[INFO] all ............................................... SKIPPED
[INFO] Apache jclouds .................................... SKIPPED
[INFO] ------------------------------------------------------------------------
[INFO] BUILD FAILURE
[INFO] ------------------------------------------------------------------------
[INFO] Total time: 1:27.677s
[INFO] Finished at: Wed Oct 19 01:11:05 EDT 2016
[INFO] Final Memory: 72M/255M
[INFO] ------------------------------------------------------------------------
[ERROR] Failed to execute goal org.apache.maven.plugins:maven-surefire-plugin:2.17:test (default-test)
on project jclouds-core: There are test failures.
[ERROR] 
[ERROR] Please refer to <https://jclouds.ci.cloudbees.com/job/jclouds-guava-guice-compat/GUAVA_VERSION=17.0,GUICE_VERSION=4.0,jdk=OpenJDK%207%20(latest)/ws/core/target/surefire-reports>
for the individual test results.
[ERROR] -> [Help 1]
org.apache.maven.lifecycle.LifecycleExecutionException: Failed to execute goal org.apache.maven.plugins:maven-surefire-plugin:2.17:test
(default-test) on project jclouds-core: There are test failures.

Please refer to <https://jclouds.ci.cloudbees.com/job/jclouds-guava-guice-compat/GUAVA_VERSION=17.0,GUICE_VERSION=4.0,jdk=OpenJDK%207%20(latest)/ws/core/target/surefire-reports>
for the individual test results.
	at org.apache.maven.lifecycle.internal.MojoExecutor.execute(MojoExecutor.java:213)
	at org.apache.maven.lifecycle.internal.MojoExecutor.execute(MojoExecutor.java:153)
	at org.apache.maven.lifecycle.internal.MojoExecutor.execute(MojoExecutor.java:145)
	at org.apache.maven.lifecycle.internal.LifecycleModuleBuilder.buildProject(LifecycleModuleBuilder.java:84)
	at org.apache.maven.lifecycle.internal.LifecycleModuleBuilder.buildProject(LifecycleModuleBuilder.java:59)
	at org.apache.maven.lifecycle.internal.LifecycleStarter.singleThreadedBuild(LifecycleStarter.java:183)
	at org.apache.maven.lifecycle.internal.LifecycleStarter.execute(LifecycleStarter.java:161)
	at org.apache.maven.DefaultMaven.doExecute(DefaultMaven.java:320)
	at org.apache.maven.DefaultMaven.execute(DefaultMaven.java:156)
	at org.apache.maven.cli.MavenCli.execute(MavenCli.java:537)
	at org.apache.maven.cli.MavenCli.doMain(MavenCli.java:196)
	at org.apache.maven.cli.MavenCli.main(MavenCli.java:141)
	at sun.reflect.NativeMethodAccessorImpl.invoke0(Native Method)
	at sun.reflect.NativeMethodAccessorImpl.invoke(NativeMethodAccessorImpl.java:57)
	at sun.reflect.DelegatingMethodAccessorImpl.invoke(DelegatingMethodAccessorImpl.java:43)
	at java.lang.reflect.Method.invoke(Method.java:606)
	at org.codehaus.plexus.classworlds.launcher.Launcher.launchEnhanced(Launcher.java:290)
	at org.codehaus.plexus.classworlds.launcher.Launcher.launch(Launcher.java:230)
	at org.codehaus.plexus.classworlds.launcher.Launcher.mainWithExitCode(Launcher.java:409)
	at org.codehaus.plexus.classworlds.launcher.Launcher.main(Launcher.java:352)
Caused by: org.apache.maven.plugin.MojoFailureException: There are test failures.

Please refer to <https://jclouds.ci.cloudbees.com/job/jclouds-guava-guice-compat/GUAVA_VERSION=17.0,GUICE_VERSION=4.0,jdk=OpenJDK%207%20(latest)/ws/core/target/surefire-reports>
for the individual test results.
	at org.apache.maven.plugin.surefire.SurefireHelper.reportExecution(SurefireHelper.java:82)
	at org.apache.maven.plugin.surefire.SurefirePlugin.handleSummary(SurefirePlugin.java:195)
	at org.apache.maven.plugin.surefire.AbstractSurefireMojo.executeAfterPreconditionsChecked(AbstractSurefireMojo.java:861)
	at org.apache.maven.plugin.surefire.AbstractSurefireMojo.execute(AbstractSurefireMojo.java:729)
	at org.apache.maven.plugin.DefaultBuildPluginManager.executeMojo(DefaultBuildPluginManager.java:101)
	at org.apache.maven.lifecycle.internal.MojoExecutor.execute(MojoExecutor.java:209)
	... 19 more
[ERROR] 
[ERROR] Re-run Maven using the -X switch to enable full debug logging.
[ERROR] 
[ERROR] For more information about the errors and possible solutions, please read the following
articles:
[ERROR] [Help 1] http://cwiki.apache.org/confluence/display/MAVEN/MojoFailureException
[ERROR] 
[ERROR] After correcting the problems, you can resume the build with the command
[ERROR]   mvn <goals> -rf :jclouds-core
Build step 'Invoke top-level Maven targets' marked build as failure

Mime
View raw message